#498403 failed

6f91f59Bor Grošelj Simić

specify &&=, ||= and ^^= operators

Owner
~sircmpwn
Created
a month ago
Updated
a month ago
Build manifest
view manifest »

Tasks

view log »
build view log »
upload view log »
go to bottom »
setup
1
2
3
4
5
6
7
8
9
10
11
12
13
14
15
16
17
18
19
20
21
22
23
24
25
26
27
28
29
30
31
32
33
34
35
36
37
38
39
40
41
42
43
44
45
46
47
48
49
50
51
52
53
54
55
56
57
58
59
60
61
62
63
64
65
66
67
68
69
70
71
72
73
74
75
76
77
78
79
80
81
82
83
84
85
86
87
88
89
90
91
92
93
94
[#498403] 2021/04/30 12:25:07 Booting image alpine/latest (default) on port 22664
[#498403] 2021/04/30 12:25:09 Waiting for guest to settle
[#498403] 2021/04/30 12:25:17 Sending tasks
[#498403] 2021/04/30 12:25:17 Sending build environment
[#498403] 2021/04/30 12:25:18 Sending secrets
[#498403] 2021/04/30 12:25:18 Resolving secret 160a72cf-34d6-47b7-928b-c13b42b4d4f6
[#498403] 2021/04/30 12:25:18 Installing packages
Warning: Permanently added '[localhost]:22664' (ECDSA) to the list of known hosts.
fetch http://dl-cdn.alpinelinux.org/alpine/v3.13/main/x86_64/APKINDEX.tar.gz
fetch http://dl-cdn.alpinelinux.org/alpine/v3.13/community/x86_64/APKINDEX.tar.gz
v3.13.5-66-ge6385ab210 [http://dl-cdn.alpinelinux.org/alpine/v3.13/main]
v3.13.5-65-g28e7396caa [http://dl-cdn.alpinelinux.org/alpine/v3.13/community]
OK: 13887 distinct packages available
Warning: Permanently added '[localhost]:22664' (ECDSA) to the list of known hosts.
(1/33) Installing popt (1.18-r0)
(2/33) Installing rsync (3.2.3-r1)
(3/33) Installing rsync-openrc (3.2.3-r1)
(4/33) Installing perl (5.32.0-r0)
(5/33) Installing perl-error (0.17029-r1)
(6/33) Installing perl-git (2.30.2-r0)
(7/33) Installing git-perl (2.30.2-r0)
(8/33) Installing texmf-dist (2020.55416-r1)
(9/33) Installing libxau (1.0.9-r0)
(10/33) Installing libbsd (0.10.0-r0)
(11/33) Installing libxdmcp (1.1.3-r0)
(12/33) Installing libxcb (1.14-r1)
(13/33) Installing libx11 (1.7.0-r0)
(14/33) Installing libxext (1.3.4-r0)
(15/33) Installing libxrender (0.9.10-r3)
(16/33) Installing libpng (1.6.37-r1)
(17/33) Installing freetype (2.10.4-r1)
(18/33) Installing fontconfig (2.13.1-r3)
(19/33) Installing pixman (0.40.0-r2)
(20/33) Installing cairo (1.16.0-r2)
(21/33) Installing icu-libs (67.1-r2)
(22/33) Installing libpaper (1.1.28-r0)
(23/33) Installing libjpeg-turbo (2.1.0-r0)
(24/33) Installing lcms2 (2.11-r0)
(25/33) Installing openjpeg (2.4.0-r1)
(26/33) Installing tiff (4.2.0-r0)
(27/33) Installing poppler (20.12.1-r0)
(28/33) Installing texlive (20200406-r6)
(29/33) Installing graphite2 (1.3.14-r0)
(30/33) Installing harfbuzz (2.7.4-r1)
(31/33) Installing texlive-xetex (20200406-r6)
(32/33) Installing texmf-dist-fontsextra (2020.55416-r1)
(33/33) Installing texmf-dist-latexextra (2020.55416-r1)
Executing busybox-1.32.1-r6.trigger
Executing texlive-20200406-r6.trigger
fmtutil [ERROR]: not building luajithbtex due to missing engine: luajithbtex
fmtutil [WARNING]: inifile euptex.ini for euptex/euptex not found.
fmtutil [WARNING]: inifile uptex.ini for uptex/uptex not found.
fmtutil [WARNING]: inifile eptex.ini for eptex/eptex not found.
fmtutil [ERROR]: not building luahbtex due to missing engine: luahbtex
fmtutil [WARNING]: inifile ptex.ini for ptex/ptex not found.
fmtutil [ERROR]: not building luatex due to missing engine: luatex
fmtutil [ERROR]: not building luajittex due to missing engine: luajittex
fmtutil [WARNING]: inifile texsis.ini for texsis/pdftex not found.
fmtutil [ERROR]: not building dvilualatex-dev due to missing engine: luatex
fmtutil [ERROR]: not building luacsplain due to missing engine: luatex
fmtutil [WARNING]: inifile lollipop.ini for lollipop/tex not found.
fmtutil [WARNING]: inifile amstex.ini for amstex/pdftex not found.
fmtutil [WARNING]: inifile platex.ini for platex-dev/eptex not found.
fmtutil [ERROR]: not building lualatex due to missing engine: luahbtex
fmtutil [ERROR]: not building dviluatex due to missing engine: luatex
fmtutil [WARNING]: inifile uplatex.ini for uplatex-dev/euptex not found.
fmtutil [WARNING]: inifile lambda.ini for lamed/aleph not found.
fmtutil [WARNING]: inifile pdfjadetex.ini for pdfjadetex/pdftex not found.
fmtutil [WARNING]: inifile platex.ini for platex/eptex not found.
fmtutil [WARNING]: inifile xmltex.ini for xmltex/pdftex not found.
fmtutil [WARNING]: inifile uplatex.ini for uplatex/euptex not found.
fmtutil [ERROR]: not building lualatex-dev due to missing engine: luahbtex
fmtutil [WARNING]: inifile mltex.ini for mltex/pdftex not found.
fmtutil [ERROR]: not building dvilualatex due to missing engine: luatex
fmtutil [WARNING]: inifile jadetex.ini for jadetex/pdftex not found.
fmtutil [WARNING]: inifile eplain.ini for eplain/pdftex not found.
fmtutil [WARNING]: inifile pdfxmltex.ini for pdfxmltex/pdftex not found.
fmtutil [ERROR]: not building pdfcsplain due to missing engine: luatex
fmtutil [ERROR]: not building optex due to missing engine: luatex
OK: 3411 MiB in 239 packages
[#498403] 2021/04/30 12:30:30 Cloning repositories
Cloning into 'hare-specification'...
+ cd hare-specification
+ git checkout -q 6f91f59d06d578221cf950f8c9ae87fa93662176
fatal: reference is not a tree: 6f91f59d06d578221cf950f8c9ae87fa93662176
[#498403] 2021/04/30 12:30:31 Build failed.
[#498403] 2021/04/30 12:30:31 The build environment will be kept alive for 10 minutes.
[#498403] 2021/04/30 12:30:31 To log in with SSH and examine it, use the following command:
[#498403] 2021/04/30 12:30:31 
[#498403] 2021/04/30 12:30:31 	ssh -t builds@azusa.runners.sr.ht connect 498403
[#498403] 2021/04/30 12:30:31 
[#498403] 2021/04/30 12:30:31 After logging in, the deadline is increased to your remaining build time.
[#498403] 2021/04/30 12:40:31 Deadline elapsed. Terminating build environment.
[#498403] 2021/04/30 12:40:31 Error: git checkout: exit status 128
Build complete: failed a month ago (took 5 minutes)