#224680 failed

py3-billiard, py3-cairocffi, py3-cairosvg, py3-case, py3-celery, py3-colour, py3-cssselect2

Owner
~sircmpwn
Created
a month ago
Updated
a month ago
Build manifest
view manifest »

Tasks

view log »
setup view log »
build view log »
deploy view log »
go to bottom »
setup
1
2
3
4
5
6
7
8
9
10
11
12
13
14
15
16
17
18
19
20
21
22
23
24
25
26
27
28
29
30
31
32
33
34
35
36
37
38
39
40
41
42
43
44
45
46
47
48
49
50
51
52
53
[#224680] 2020/06/01 19:42:27 Booting image alpine/3.12 (default) on port 22263
[#224680] 2020/06/01 19:42:27 Waiting for guest to settle
[#224680] 2020/06/01 19:42:36 Sending tasks
[#224680] 2020/06/01 19:42:36 Sending build environment
[#224680] 2020/06/01 19:42:36 Sending secrets
[#224680] 2020/06/01 19:42:36 Resolving secret fa00a8d3-7b63-42d5-8060-3bb31c3e3018
[#224680] 2020/06/01 19:42:36 Resolving secret d0adc1d4-af78-4852-920f-1134392f5d10
[#224680] 2020/06/01 19:42:37 Adding repository sr.ht
Warning: Permanently added '[localhost]:22263' (ECDSA) to the list of known hosts.
-----BEGIN PUBLIC KEY-----
MIIBIjANBgkqhkiG9w0BAQEFAAOCAQ8AMIIBCgKCAQEA0Xz+dp7AfkiIjin35/D/
o/WHs4bup9CCIrp2mtPU/ggpdUEKEJoOGfHvvnxHJsXISC9S2B5CgZWEWEpzQXln
XOig++cukGCZBCV0px4p2+5NJjtws6y0sWo5cuHBnQK9b3K/VPxpMMq3dwFZ0+Oj
719yGH1aDUz/xmsU/j2mtMWDTia2LoqBarznjXBcm73nAKGDc9uZxUv2ThseGGn/
T6+pd3fA5KIIBr4LvOAY3dheD1cAEDq7tHEwgSD7lEskhdSqQAq5ZDQErFIJuO1l
DUFHmt3ag26jgkbE0bbYjSN+Yx+Iisb9bFruA9absmdi9BVFGDcLm+Ymnu2UdnuC
vQIDAQAB
-----END PUBLIC KEY-----

Warning: Permanently added '[localhost]:22263' (ECDSA) to the list of known hosts.
https://mirror.sr.ht/alpine/v3.11/sr.ht/
http://dl-cdn.alpinelinux.org/alpine/v3.12/main
http://dl-cdn.alpinelinux.org/alpine/v3.12/community
Warning: Permanently added '[localhost]:22263' (ECDSA) to the list of known hosts.
[#224680] 2020/06/01 19:42:37 Installing packages
Warning: Permanently added '[localhost]:22263' (ECDSA) to the list of known hosts.
fetch https://mirror.sr.ht/alpine/v3.11/sr.ht/x86_64/APKINDEX.tar.gz
fetch http://dl-cdn.alpinelinux.org/alpine/v3.12/main/x86_64/APKINDEX.tar.gz
fetch http://dl-cdn.alpinelinux.org/alpine/v3.12/community/x86_64/APKINDEX.tar.gz
v3.12.0-9-gc3ce4065bd [http://dl-cdn.alpinelinux.org/alpine/v3.12/main]
v3.12.0-10-g13cc71d1b8 [http://dl-cdn.alpinelinux.org/alpine/v3.12/community]
OK: 12838 distinct packages available
Warning: Permanently added '[localhost]:22263' (ECDSA) to the list of known hosts.
(1/3) Installing popt (1.16-r7)
(2/3) Installing rsync (3.1.3-r3)
(3/3) Installing rsync-openrc (3.1.3-r3)
Executing busybox-1.31.1-r16.trigger
OK: 1124 MiB in 204 packages
[#224680] 2020/06/01 19:42:38 Cloning repositories
Cloning into 'sr.ht-apkbuilds'...
+ cd sr.ht-apkbuilds
+ git submodule update --init
[#224680] 2020/06/01 19:42:38 Running task setup
[#224680] 2020/06/01 19:42:39 Running task build
[#224680] 2020/06/01 19:42:56 Build failed.
[#224680] 2020/06/01 19:42:56 The build environment will be kept alive for 10 minutes.
[#224680] 2020/06/01 19:42:56 To log in with SSH and examine it, use the following command:
[#224680] 2020/06/01 19:42:56 
[#224680] 2020/06/01 19:42:56 	ssh -t builds@yui.runners.sr.ht connect 224680
[#224680] 2020/06/01 19:42:56 
[#224680] 2020/06/01 19:42:56 After logging in, the deadline is increased to your remaining build time.
[#224680] 2020/06/01 19:52:56 Deadline elapsed. Terminating build environment.
[#224680] 2020/06/01 19:52:56 Error: Running task on guest: exit status 1
setup
1
2
3
4
+ cd sr.ht-apkbuilds
+ ./pkgkit add-repo -s sr.ht /home/build/.abuild/alpine@sr.ht.rsa
sr.ht /home/build/.abuild/alpine@sr.ht.rsa
writing RSA key
build
1
2
3
4
5
6
7
8
9
10
11
12
13
14
15
16
17
18
19
20
21
22
23
24
25
26
27
28
29
30
31
32
33
34
35
36
37
38
39
40
41
42
43
44
45
46
47
48
49
50
51
52
53
54
55
56
57
58
59
60
61
62
63
64
65
66
67
68
69
70
71
72
73
74
75
76
77
78
79
80
81
82
83
84
85
86
87
88
89
90
91
92
93
94
95
96
97
98
99
100
101
102
103
104
105
106
107
108
109
110
111
112
113
114
115
116
117
118
119
120
121
122
123
124
125
126
127
128
129
130
131
132
133
134
135
136
137
138
139
140
141
142
143
144
145
146
147
148
149
150
151
152
153
154
155
156
157
158
159
160
161
162
163
164
165
166
167
168
169
170
171
172
173
174
175
176
177
178
179
180
181
182
183
184
185
186
187
188
189
190
191
192
193
194
195
196
197
198
199
200
201
202
203
204
205
206
207
208
209
210
211
212
213
214
215
216
217
218
219
220
221
222
223
224
225
226
227
228
229
230
231
232
233
234
235
236
237
238
239
240
241
242
243
244
245
246
247
248
249
250
251
252
253
254
255
256
257
258
259
260
261
262
263
264
265
266
267
268
269
270
271
272
273
274
275
276
277
278
279
280
281
282
283
284
285
286
287
288
289
290
291
292
293
294
295
296
297
298
299
300
301
302
303
304
305
306
307
308
309
310
311
312
313
314
315
316
317
318
319
320
321
322
323
324
325
326
327
328
329
330
331
332
333
334
335
336
337
338
339
340
341
342
343
344
345
346
347
348
349
350
351
352
353
354
355
356
357
358
359
360
361
362
363
364
365
366
367
368
369
370
371
372
373
374
375
376
377
378
379
380
381
382
383
384
385
386
387
388
389
390
391
392
393
394
395
396
397
398
399
400
401
402
403
404
405
406
407
408
409
410
411
412
413
414
415
416
417
418
419
420
421
422
423
424
425
426
427
428
429
430
431
432
433
434
435
436
437
438
439
440
441
442
443
444
445
446
447
448
449
450
451
452
453
454
455
456
457
458
459
460
461
462
463
464
465
466
467
468
469
470
471
472
473
474
475
476
477
478
479
480
481
482
483
484
485
486
487
488
489
490
491
492
493
494
495
496
497
498
499
500
501
502
503
504
505
506
507
508
509
510
511
512
513
514
515
516
517
518
519
520
521
522
523
524
525
526
527
528
529
530
531
532
533
534
535
536
537
538
539
540
541
542
543
544
545
546
547
548
549
550
551
552
553
554
555
556
557
558
559
560
561
562
563
564
565
566
567
568
569
570
571
572
573
574
575
576
577
578
579
580
581
582
583
584
585
586
587
588
589
590
591
592
593
594
595
596
597
598
599
600
601
602
603
604
605
606
607
608
609
610
611
612
613
614
615
616
617
618
619
620
621
622
623
624
625
626
627
628
629
630
631
632
633
634
635
636
637
638
639
640
641
642
643
644
645
646
647
648
649
650
651
652
653
654
655
656
657
658
659
660
661
662
663
664
665
666
667
668
669
670
671
672
673
674
675
676
677
678
679
680
681
682
683
684
685
686
687
688
689
690
691
692
693
694
+ cd sr.ht-apkbuilds
+ ./pkgkit build -cu py3-billiard py3-cairocffi py3-cairosvg py3-case py3-celery py3-colour py3-cssselect2
#!/bin/sh
exec /usr/bin/abuild-apk --no-progress $@
WARNING: Ignoring /home/build/packages/sr.ht/x86_64/APKINDEX.tar.gz: No such file or directory
>>> py3-billiard: Fetching https://files.pythonhosted.org/packages/source/b/billiard/billiard-3.6.3.0.tar.gz
  % Total    % Received % Xferd  Average Speed   Time    Time     Time  Current
                                 Dload  Upload   Total   Spent    Left  Speed

  0     0    0     0    0     0      0      0 --:--:-- --:--:-- --:--:--     0
  0     0    0     0    0     0      0      0 --:--:-- --:--:-- --:--:--     0

100  151k  100  151k    0     0   670k      0 --:--:-- --:--:-- --:--:--  670k
>>> py3-billiard: Updating the sha512sums in APKBUILD...
>>> py3-billiard: Building sr.ht/py3-billiard 3.6.3.0-r2 (using abuild 3.6.0-r0) started Mon, 01 Jun 2020 19:42:38 +0000
>>> py3-billiard: Checking sanity of /home/build/sr.ht-apkbuilds/sr.ht/py3-billiard/APKBUILD...
>>> py3-billiard: Analyzing dependencies...
>>> py3-billiard: Installing for build: build-base python3 py3-setuptools
WARNING: Ignoring /home/build/packages//sr.ht/x86_64/APKINDEX.tar.gz: No such file or directory
WARNING: Ignoring /home/build/packages/sr.ht/x86_64/APKINDEX.tar.gz: No such file or directory
(1/7) Installing py3-ordered-set (4.0.1-r0)
(2/7) Installing py3-appdirs (1.4.4-r1)
(3/7) Installing py3-parsing (2.4.7-r0)
(4/7) Installing py3-six (1.15.0-r0)
(5/7) Installing py3-packaging (20.4-r0)
(6/7) Installing py3-setuptools (47.0.0-r0)
(7/7) Installing .makedepends-py3-billiard (20200601.194239)
Executing busybox-1.31.1-r16.trigger
OK: 1127 MiB in 211 packages
>>> py3-billiard: Cleaning up srcdir
>>> py3-billiard: Cleaning up pkgdir
>>> py3-billiard: Fetching https://files.pythonhosted.org/packages/source/b/billiard/billiard-3.6.3.0.tar.gz
>>> py3-billiard: Fetching https://files.pythonhosted.org/packages/source/b/billiard/billiard-3.6.3.0.tar.gz
>>> py3-billiard: Checking sha512sums...
billiard-3.6.3.0.tar.gz: OK
>>> py3-billiard: Unpacking /var/cache/distfiles/billiard-3.6.3.0.tar.gz...
running check
>>> py3-billiard: Entering fakeroot...
running install
running build
running build_py
creating build
creating build/lib
creating build/lib/billiard
copying billiard/spawn.py -> build/lib/billiard
copying billiard/heap.py -> build/lib/billiard
copying billiard/semaphore_tracker.py -> build/lib/billiard
copying billiard/synchronize.py -> build/lib/billiard
copying billiard/context.py -> build/lib/billiard
copying billiard/queues.py -> build/lib/billiard
copying billiard/__init__.py -> build/lib/billiard
copying billiard/util.py -> build/lib/billiard
copying billiard/process.py -> build/lib/billiard
copying billiard/exceptions.py -> build/lib/billiard
copying billiard/popen_fork.py -> build/lib/billiard
copying billiard/popen_forkserver.py -> build/lib/billiard
copying billiard/managers.py -> build/lib/billiard
copying billiard/popen_spawn_posix.py -> build/lib/billiard
copying billiard/_ext.py -> build/lib/billiard
copying billiard/forkserver.py -> build/lib/billiard
copying billiard/sharedctypes.py -> build/lib/billiard
copying billiard/common.py -> build/lib/billiard
copying billiard/popen_spawn_win32.py -> build/lib/billiard
copying billiard/resource_sharer.py -> build/lib/billiard
copying billiard/einfo.py -> build/lib/billiard
copying billiard/_win.py -> build/lib/billiard
copying billiard/five.py -> build/lib/billiard
copying billiard/compat.py -> build/lib/billiard
copying billiard/reduction.py -> build/lib/billiard
copying billiard/connection.py -> build/lib/billiard
copying billiard/pool.py -> build/lib/billiard
creating build/lib/billiard/dummy
copying billiard/dummy/__init__.py -> build/lib/billiard/dummy
copying billiard/dummy/connection.py -> build/lib/billiard/dummy
running install_lib
creating /home/build/sr.ht-apkbuilds/sr.ht/py3-billiard/pkg
creating /home/build/sr.ht-apkbuilds/sr.ht/py3-billiard/pkg/py3-billiard
creating /home/build/sr.ht-apkbuilds/sr.ht/py3-billiard/pkg/py3-billiard/usr
creating /home/build/sr.ht-apkbuilds/sr.ht/py3-billiard/pkg/py3-billiard/usr/lib
creating /home/build/sr.ht-apkbuilds/sr.ht/py3-billiard/pkg/py3-billiard/usr/lib/python3.8
creating /home/build/sr.ht-apkbuilds/sr.ht/py3-billiard/pkg/py3-billiard/usr/lib/python3.8/site-packages
creating /home/build/sr.ht-apkbuilds/sr.ht/py3-billiard/pkg/py3-billiard/usr/lib/python3.8/site-packages/billiard
copying build/lib/billiard/spawn.py -> /home/build/sr.ht-apkbuilds/sr.ht/py3-billiard/pkg/py3-billiard/usr/lib/python3.8/site-packages/billiard
copying build/lib/billiard/heap.py -> /home/build/sr.ht-apkbuilds/sr.ht/py3-billiard/pkg/py3-billiard/usr/lib/python3.8/site-packages/billiard
copying build/lib/billiard/semaphore_tracker.py -> /home/build/sr.ht-apkbuilds/sr.ht/py3-billiard/pkg/py3-billiard/usr/lib/python3.8/site-packages/billiard
copying build/lib/billiard/synchronize.py -> /home/build/sr.ht-apkbuilds/sr.ht/py3-billiard/pkg/py3-billiard/usr/lib/python3.8/site-packages/billiard
copying build/lib/billiard/context.py -> /home/build/sr.ht-apkbuilds/sr.ht/py3-billiard/pkg/py3-billiard/usr/lib/python3.8/site-packages/billiard
copying build/lib/billiard/queues.py -> /home/build/sr.ht-apkbuilds/sr.ht/py3-billiard/pkg/py3-billiard/usr/lib/python3.8/site-packages/billiard
copying build/lib/billiard/__init__.py -> /home/build/sr.ht-apkbuilds/sr.ht/py3-billiard/pkg/py3-billiard/usr/lib/python3.8/site-packages/billiard
copying build/lib/billiard/util.py -> /home/build/sr.ht-apkbuilds/sr.ht/py3-billiard/pkg/py3-billiard/usr/lib/python3.8/site-packages/billiard
copying build/lib/billiard/process.py -> /home/build/sr.ht-apkbuilds/sr.ht/py3-billiard/pkg/py3-billiard/usr/lib/python3.8/site-packages/billiard
copying build/lib/billiard/exceptions.py -> /home/build/sr.ht-apkbuilds/sr.ht/py3-billiard/pkg/py3-billiard/usr/lib/python3.8/site-packages/billiard
copying build/lib/billiard/popen_fork.py -> /home/build/sr.ht-apkbuilds/sr.ht/py3-billiard/pkg/py3-billiard/usr/lib/python3.8/site-packages/billiard
copying build/lib/billiard/popen_forkserver.py -> /home/build/sr.ht-apkbuilds/sr.ht/py3-billiard/pkg/py3-billiard/usr/lib/python3.8/site-packages/billiard
copying build/lib/billiard/managers.py -> /home/build/sr.ht-apkbuilds/sr.ht/py3-billiard/pkg/py3-billiard/usr/lib/python3.8/site-packages/billiard
copying build/lib/billiard/popen_spawn_posix.py -> /home/build/sr.ht-apkbuilds/sr.ht/py3-billiard/pkg/py3-billiard/usr/lib/python3.8/site-packages/billiard
creating /home/build/sr.ht-apkbuilds/sr.ht/py3-billiard/pkg/py3-billiard/usr/lib/python3.8/site-packages/billiard/dummy
copying build/lib/billiard/dummy/__init__.py -> /home/build/sr.ht-apkbuilds/sr.ht/py3-billiard/pkg/py3-billiard/usr/lib/python3.8/site-packages/billiard/dummy
copying build/lib/billiard/dummy/connection.py -> /home/build/sr.ht-apkbuilds/sr.ht/py3-billiard/pkg/py3-billiard/usr/lib/python3.8/site-packages/billiard/dummy
copying build/lib/billiard/_ext.py -> /home/build/sr.ht-apkbuilds/sr.ht/py3-billiard/pkg/py3-billiard/usr/lib/python3.8/site-packages/billiard
copying build/lib/billiard/forkserver.py -> /home/build/sr.ht-apkbuilds/sr.ht/py3-billiard/pkg/py3-billiard/usr/lib/python3.8/site-packages/billiard
copying build/lib/billiard/sharedctypes.py -> /home/build/sr.ht-apkbuilds/sr.ht/py3-billiard/pkg/py3-billiard/usr/lib/python3.8/site-packages/billiard
copying build/lib/billiard/common.py -> /home/build/sr.ht-apkbuilds/sr.ht/py3-billiard/pkg/py3-billiard/usr/lib/python3.8/site-packages/billiard
copying build/lib/billiard/popen_spawn_win32.py -> /home/build/sr.ht-apkbuilds/sr.ht/py3-billiard/pkg/py3-billiard/usr/lib/python3.8/site-packages/billiard
copying build/lib/billiard/resource_sharer.py -> /home/build/sr.ht-apkbuilds/sr.ht/py3-billiard/pkg/py3-billiard/usr/lib/python3.8/site-packages/billiard
copying build/lib/billiard/einfo.py -> /home/build/sr.ht-apkbuilds/sr.ht/py3-billiard/pkg/py3-billiard/usr/lib/python3.8/site-packages/billiard
copying build/lib/billiard/_win.py -> /home/build/sr.ht-apkbuilds/sr.ht/py3-billiard/pkg/py3-billiard/usr/lib/python3.8/site-packages/billiard
copying build/lib/billiard/five.py -> /home/build/sr.ht-apkbuilds/sr.ht/py3-billiard/pkg/py3-billiard/usr/lib/python3.8/site-packages/billiard
copying build/lib/billiard/compat.py -> /home/build/sr.ht-apkbuilds/sr.ht/py3-billiard/pkg/py3-billiard/usr/lib/python3.8/site-packages/billiard
copying build/lib/billiard/reduction.py -> /home/build/sr.ht-apkbuilds/sr.ht/py3-billiard/pkg/py3-billiard/usr/lib/python3.8/site-packages/billiard
copying build/lib/billiard/connection.py -> /home/build/sr.ht-apkbuilds/sr.ht/py3-billiard/pkg/py3-billiard/usr/lib/python3.8/site-packages/billiard
copying build/lib/billiard/pool.py -> /home/build/sr.ht-apkbuilds/sr.ht/py3-billiard/pkg/py3-billiard/usr/lib/python3.8/site-packages/billiard
byte-compiling /home/build/sr.ht-apkbuilds/sr.ht/py3-billiard/pkg/py3-billiard/usr/lib/python3.8/site-packages/billiard/spawn.py to spawn.cpython-38.pyc
byte-compiling /home/build/sr.ht-apkbuilds/sr.ht/py3-billiard/pkg/py3-billiard/usr/lib/python3.8/site-packages/billiard/heap.py to heap.cpython-38.pyc
byte-compiling /home/build/sr.ht-apkbuilds/sr.ht/py3-billiard/pkg/py3-billiard/usr/lib/python3.8/site-packages/billiard/semaphore_tracker.py to semaphore_tracker.cpython-38.pyc
byte-compiling /home/build/sr.ht-apkbuilds/sr.ht/py3-billiard/pkg/py3-billiard/usr/lib/python3.8/site-packages/billiard/synchronize.py to synchronize.cpython-38.pyc
byte-compiling /home/build/sr.ht-apkbuilds/sr.ht/py3-billiard/pkg/py3-billiard/usr/lib/python3.8/site-packages/billiard/context.py to context.cpython-38.pyc
byte-compiling /home/build/sr.ht-apkbuilds/sr.ht/py3-billiard/pkg/py3-billiard/usr/lib/python3.8/site-packages/billiard/queues.py to queues.cpython-38.pyc
byte-compiling /home/build/sr.ht-apkbuilds/sr.ht/py3-billiard/pkg/py3-billiard/usr/lib/python3.8/site-packages/billiard/__init__.py to __init__.cpython-38.pyc
byte-compiling /home/build/sr.ht-apkbuilds/sr.ht/py3-billiard/pkg/py3-billiard/usr/lib/python3.8/site-packages/billiard/util.py to util.cpython-38.pyc
byte-compiling /home/build/sr.ht-apkbuilds/sr.ht/py3-billiard/pkg/py3-billiard/usr/lib/python3.8/site-packages/billiard/process.py to process.cpython-38.pyc
byte-compiling /home/build/sr.ht-apkbuilds/sr.ht/py3-billiard/pkg/py3-billiard/usr/lib/python3.8/site-packages/billiard/exceptions.py to exceptions.cpython-38.pyc
byte-compiling /home/build/sr.ht-apkbuilds/sr.ht/py3-billiard/pkg/py3-billiard/usr/lib/python3.8/site-packages/billiard/popen_fork.py to popen_fork.cpython-38.pyc
byte-compiling /home/build/sr.ht-apkbuilds/sr.ht/py3-billiard/pkg/py3-billiard/usr/lib/python3.8/site-packages/billiard/popen_forkserver.py to popen_forkserver.cpython-38.pyc
byte-compiling /home/build/sr.ht-apkbuilds/sr.ht/py3-billiard/pkg/py3-billiard/usr/lib/python3.8/site-packages/billiard/managers.py to managers.cpython-38.pyc
byte-compiling /home/build/sr.ht-apkbuilds/sr.ht/py3-billiard/pkg/py3-billiard/usr/lib/python3.8/site-packages/billiard/popen_spawn_posix.py to popen_spawn_posix.cpython-38.pyc
byte-compiling /home/build/sr.ht-apkbuilds/sr.ht/py3-billiard/pkg/py3-billiard/usr/lib/python3.8/site-packages/billiard/dummy/__init__.py to __init__.cpython-38.pyc
byte-compiling /home/build/sr.ht-apkbuilds/sr.ht/py3-billiard/pkg/py3-billiard/usr/lib/python3.8/site-packages/billiard/dummy/connection.py to connection.cpython-38.pyc
byte-compiling /home/build/sr.ht-apkbuilds/sr.ht/py3-billiard/pkg/py3-billiard/usr/lib/python3.8/site-packages/billiard/_ext.py to _ext.cpython-38.pyc
byte-compiling /home/build/sr.ht-apkbuilds/sr.ht/py3-billiard/pkg/py3-billiard/usr/lib/python3.8/site-packages/billiard/forkserver.py to forkserver.cpython-38.pyc
byte-compiling /home/build/sr.ht-apkbuilds/sr.ht/py3-billiard/pkg/py3-billiard/usr/lib/python3.8/site-packages/billiard/sharedctypes.py to sharedctypes.cpython-38.pyc
byte-compiling /home/build/sr.ht-apkbuilds/sr.ht/py3-billiard/pkg/py3-billiard/usr/lib/python3.8/site-packages/billiard/common.py to common.cpython-38.pyc
byte-compiling /home/build/sr.ht-apkbuilds/sr.ht/py3-billiard/pkg/py3-billiard/usr/lib/python3.8/site-packages/billiard/popen_spawn_win32.py to popen_spawn_win32.cpython-38.pyc
byte-compiling /home/build/sr.ht-apkbuilds/sr.ht/py3-billiard/pkg/py3-billiard/usr/lib/python3.8/site-packages/billiard/resource_sharer.py to resource_sharer.cpython-38.pyc
byte-compiling /home/build/sr.ht-apkbuilds/sr.ht/py3-billiard/pkg/py3-billiard/usr/lib/python3.8/site-packages/billiard/einfo.py to einfo.cpython-38.pyc
byte-compiling /home/build/sr.ht-apkbuilds/sr.ht/py3-billiard/pkg/py3-billiard/usr/lib/python3.8/site-packages/billiard/_win.py to _win.cpython-38.pyc
byte-compiling /home/build/sr.ht-apkbuilds/sr.ht/py3-billiard/pkg/py3-billiard/usr/lib/python3.8/site-packages/billiard/five.py to five.cpython-38.pyc
byte-compiling /home/build/sr.ht-apkbuilds/sr.ht/py3-billiard/pkg/py3-billiard/usr/lib/python3.8/site-packages/billiard/compat.py to compat.cpython-38.pyc
byte-compiling /home/build/sr.ht-apkbuilds/sr.ht/py3-billiard/pkg/py3-billiard/usr/lib/python3.8/site-packages/billiard/reduction.py to reduction.cpython-38.pyc
byte-compiling /home/build/sr.ht-apkbuilds/sr.ht/py3-billiard/pkg/py3-billiard/usr/lib/python3.8/site-packages/billiard/connection.py to connection.cpython-38.pyc
byte-compiling /home/build/sr.ht-apkbuilds/sr.ht/py3-billiard/pkg/py3-billiard/usr/lib/python3.8/site-packages/billiard/pool.py to pool.cpython-38.pyc
writing byte-compilation script '/tmp/tmpnc_77jwt.py'
/usr/bin/python3 /tmp/tmpnc_77jwt.py
removing /tmp/tmpnc_77jwt.py
running install_egg_info
running egg_info
writing billiard.egg-info/PKG-INFO
writing dependency_links to billiard.egg-info/dependency_links.txt
writing top-level names to billiard.egg-info/top_level.txt
reading manifest file 'billiard.egg-info/SOURCES.txt'
reading manifest template 'MANIFEST.in'
warning: no files found matching '*.py' under directory 'Lib'
warning: no files found matching '*.py' under directory 'funtests'
warning: no previously-included files matching '*' found under directory 'docs/_build'
warning: no previously-included files matching '__pycache__' found under directory '*'
warning: no previously-included files matching '*.py[co]' found under directory '*'
warning: no previously-included files matching '.*.sw*' found under directory '*'
writing manifest file 'billiard.egg-info/SOURCES.txt'
Copying billiard.egg-info to /home/build/sr.ht-apkbuilds/sr.ht/py3-billiard/pkg/py3-billiard/usr/lib/python3.8/site-packages/billiard-3.6.3.0-py3.8.egg-info
running install_scripts
>>> py3-billiard*: Running postcheck for py3-billiard
>>> py3-billiard*: Preparing package py3-billiard...
>>> py3-billiard*: Tracing dependencies...
>>> py3-billiard*: Package size: 1.0 MB
>>> py3-billiard*: Compressing data...
>>> py3-billiard*: Create checksum...
>>> py3-billiard*: Create py3-billiard-3.6.3.0-r2.apk
>>> py3-billiard: Build complete at Mon, 01 Jun 2020 19:42:41 +0000 elapsed time 0h 0m 3s
>>> py3-billiard: Cleaning up srcdir
>>> py3-billiard: Cleaning up pkgdir
>>> py3-billiard: Uninstalling dependencies...
WARNING: Ignoring /home/build/packages/sr.ht/x86_64/APKINDEX.tar.gz: No such file or directory
(1/7) Purging .makedepends-py3-billiard (20200601.194239)
(2/7) Purging py3-setuptools (47.0.0-r0)
(3/7) Purging py3-ordered-set (4.0.1-r0)
(4/7) Purging py3-appdirs (1.4.4-r1)
(5/7) Purging py3-packaging (20.4-r0)
(6/7) Purging py3-parsing (2.4.7-r0)
(7/7) Purging py3-six (1.15.0-r0)
Executing busybox-1.31.1-r16.trigger
OK: 1124 MiB in 204 packages
>>> py3-billiard: Updating the sr.ht/x86_64 repository index...
>>> py3-billiard: Signing the index...
>>> py3-cairocffi: Fetching https://files.pythonhosted.org/packages/source/c/cairocffi/cairocffi-1.1.0.tar.gz
  % Total    % Received % Xferd  Average Speed   Time    Time     Time  Current
                                 Dload  Upload   Total   Spent    Left  Speed

  0     0    0     0    0     0      0      0 --:--:-- --:--:-- --:--:--     0
  0     0    0     0    0     0      0      0 --:--:-- --:--:-- --:--:--     0

100 68744  100 68744    0     0   271k      0 --:--:-- --:--:-- --:--:--  271k
>>> py3-cairocffi: Updating the sha512sums in APKBUILD...
>>> py3-cairocffi: Building sr.ht/py3-cairocffi 1.1.0-r1 (using abuild 3.6.0-r0) started Mon, 01 Jun 2020 19:42:41 +0000
>>> py3-cairocffi: Checking sanity of /home/build/sr.ht-apkbuilds/sr.ht/py3-cairocffi/APKBUILD...
>>> py3-cairocffi: Analyzing dependencies...
>>> py3-cairocffi: Installing for build: build-base python3 py3-cffi cairo gdk-pixbuf py3-setuptools py3-pytest py3-pytest-cov py3-pytest-isort py3-pytest-flake8 ttf-dejavu
(1/48) Installing py3-cparser (2.20-r0)
(2/48) Installing py3-cffi (1.14.0-r2)
(3/48) Installing libxau (1.0.9-r0)
(4/48) Installing libbsd (0.10.0-r0)
(5/48) Installing libxdmcp (1.1.3-r0)
(6/48) Installing libxcb (1.14-r1)
(7/48) Installing libx11 (1.6.9-r0)
(8/48) Installing libxext (1.3.4-r0)
(9/48) Installing libxrender (0.9.10-r3)
(10/48) Installing brotli-libs (1.0.7-r5)
(11/48) Installing libpng (1.6.37-r1)
(12/48) Installing freetype (2.10.2-r0)
(13/48) Installing fontconfig (2.13.1-r2)
(14/48) Installing pixman (0.40.0-r2)
(15/48) Installing cairo (1.16.0-r2)
(16/48) Installing libxml2 (2.9.10-r4)
(17/48) Installing shared-mime-info (1.15-r0)
(18/48) Installing libjpeg-turbo (2.0.4-r1)
(19/48) Installing tiff (4.1.0-r0)
(20/48) Installing gdk-pixbuf (2.40.0-r2)
(21/48) Installing py3-ordered-set (4.0.1-r0)
(22/48) Installing py3-appdirs (1.4.4-r1)
(23/48) Installing py3-parsing (2.4.7-r0)
(24/48) Installing py3-six (1.15.0-r0)
(25/48) Installing py3-packaging (20.4-r0)
(26/48) Installing py3-setuptools (47.0.0-r0)
(27/48) Installing py3-atomicwrites (1.4.0-r0)
(28/48) Installing py3-py (1.8.1-r0)
(29/48) Installing py3-attrs (19.3.0-r1)
(30/48) Installing py3-more-itertools (8.3.0-r0)
(31/48) Installing py3-pluggy (0.13.1-r0)
(32/48) Installing py3-wcwidth (0.1.9-r0)
(33/48) Installing py3-pytest (5.4.2-r0)
(34/48) Installing py3-coverage (5.1-r0)
(35/48) Installing py3-pytest-cov (2.8.1-r1)
(36/48) Installing py3-isort (4.3.21.2-r1)
(37/48) Installing py3-pytest-isort (0.3.1-r1)
(38/48) Installing py3-entrypoints (0.3-r3)
(39/48) Installing py3-pyflakes (2.2.0-r0)
(40/48) Installing py3-pycodestyle (2.6.0-r0)
(41/48) Installing py3-mccabe (0.6.1-r5)
(42/48) Installing py3-flake8 (3.8.2-r0)
(43/48) Installing py3-pytest-flake8 (1.0.4-r1)
(44/48) Installing encodings (1.0.5-r0)
(45/48) Installing libfontenc (1.1.4-r0)
(46/48) Installing mkfontscale (1.2.1-r1)
(47/48) Installing ttf-dejavu (2.37-r1)
(48/48) Installing .makedepends-py3-cairocffi (20200601.194242)
Executing busybox-1.31.1-r16.trigger
Executing fontconfig-2.13.1-r2.trigger
Executing shared-mime-info-1.15-r0.trigger
Executing gdk-pixbuf-2.40.0-r2.trigger
Executing mkfontscale-1.2.1-r1.trigger
OK: 1168 MiB in 252 packages
>>> py3-cairocffi: Cleaning up srcdir
>>> py3-cairocffi: Cleaning up pkgdir
>>> py3-cairocffi: Fetching https://files.pythonhosted.org/packages/source/c/cairocffi/cairocffi-1.1.0.tar.gz
>>> py3-cairocffi: Fetching https://files.pythonhosted.org/packages/source/c/cairocffi/cairocffi-1.1.0.tar.gz
>>> py3-cairocffi: Checking sha512sums...
cairocffi-1.1.0.tar.gz: OK
>>> py3-cairocffi: Unpacking /var/cache/distfiles/cairocffi-1.1.0.tar.gz...
WARNING: The pip package is not available, falling back to EasyInstall for handling setup_requires/test_requires; this is deprecated and will be removed in a future version.
running build
running build_py
package init file 'cairocffi/_generated/__init__.py' not found (or not a regular file)
file cairocffi/_generated/ffi.py (for module cairocffi._generated.ffi) not found
file cairocffi/_generated/ffi_pixbuf.py (for module cairocffi._generated.ffi_pixbuf) not found
creating build
creating build/lib
creating build/lib/cairocffi
copying cairocffi/ffi_build.py -> build/lib/cairocffi
copying cairocffi/pixbuf.py -> build/lib/cairocffi
copying cairocffi/test_pixbuf.py -> build/lib/cairocffi
copying cairocffi/context.py -> build/lib/cairocffi
copying cairocffi/test_xcb.py -> build/lib/cairocffi
copying cairocffi/__init__.py -> build/lib/cairocffi
copying cairocffi/surfaces.py -> build/lib/cairocffi
copying cairocffi/constants.py -> build/lib/cairocffi
copying cairocffi/test_cairo.py -> build/lib/cairocffi
copying cairocffi/patterns.py -> build/lib/cairocffi
copying cairocffi/matrix.py -> build/lib/cairocffi
copying cairocffi/fonts.py -> build/lib/cairocffi
copying cairocffi/xcb.py -> build/lib/cairocffi
copying cairocffi/VERSION -> build/lib/cairocffi
file cairocffi/_generated/ffi.py (for module cairocffi._generated.ffi) not found
file cairocffi/_generated/ffi_pixbuf.py (for module cairocffi._generated.ffi_pixbuf) not found
generating cffi module 'build/lib/cairocffi/_generated/ffi.py'
creating build/lib/cairocffi/_generated
generating cffi module 'build/lib/cairocffi/_generated/ffi_pixbuf.py'
WARNING: The pip package is not available, falling back to EasyInstall for handling setup_requires/test_requires; this is deprecated and will be removed in a future version.
running pytest
running egg_info
writing cairocffi.egg-info/PKG-INFO
writing dependency_links to cairocffi.egg-info/dependency_links.txt
writing requirements to cairocffi.egg-info/requires.txt
writing top-level names to cairocffi.egg-info/top_level.txt
reading manifest file 'cairocffi.egg-info/SOURCES.txt'
writing manifest file 'cairocffi.egg-info/SOURCES.txt'
running build_ext
generating cffi module 'cairocffi/_generated/ffi.py'
generating cffi module 'cairocffi/_generated/ffi_pixbuf.py'
============================= test session starts ==============================
platform linux -- Python 3.8.3, pytest-5.4.2, py-1.8.1, pluggy-0.13.1
rootdir: /home/build/sr.ht-apkbuilds/sr.ht/py3-cairocffi/src/cairocffi-1.1.0, inifile: setup.cfg
plugins: isort-0.3.1, cov-2.8.1, flake8-1.0.4
collecting ... 
collecting 54 items                                                            
collected 83 items / 1 skipped / 82 selected                                   

setup.py F.                                                              [  2%]
cairocffi/__init__.py F.                                                 [  4%]
cairocffi/constants.py F.                                                [  7%]
cairocffi/context.py F.                                                  [  9%]
cairocffi/ffi_build.py F.                                                [ 12%]
cairocffi/fonts.py F.                                                    [ 14%]
cairocffi/matrix.py F.                                                   [ 16%]
cairocffi/patterns.py F.                                                 [ 19%]
cairocffi/pixbuf.py F.                                                   [ 21%]
cairocffi/surfaces.py F.                                                 [ 24%]
cairocffi/test_cairo.py F............................................... [ 81%]
                                                                         [ 81%]
cairocffi/test_pixbuf.py F..x...                                         [ 90%]
cairocffi/test_xcb.py F.                                                 [ 92%]
cairocffi/xcb.py F.                                                      [ 95%]
cairocffi/_generated/ffi.py F.                                           [ 97%]
cairocffi/_generated/ffi_pixbuf.py F.                                    [100%]

=================================== FAILURES ===================================
_________________________________ FLAKE8-check _________________________________
/usr/lib/python3.8/site-packages/pluggy/hooks.py:286: in __call__
    return self._hookexec(self, self.get_hookimpls(), kwargs)
/usr/lib/python3.8/site-packages/pluggy/manager.py:93: in _hookexec
    return self._inner_hookexec(hook, methods, kwargs)
/usr/lib/python3.8/site-packages/pluggy/manager.py:84: in <lambda>
    self._inner_hookexec = lambda hook, methods, kwargs: hook.multicall(
/usr/lib/python3.8/site-packages/_pytest/runner.py:143: in pytest_runtest_call
    raise e
/usr/lib/python3.8/site-packages/_pytest/runner.py:135: in pytest_runtest_call
    item.runtest()
/usr/lib/python3.8/site-packages/pytest_flake8.py:110: in runtest
    found_errors, out, err = call(
/usr/lib/python3.8/site-packages/py/_io/capture.py:150: in call
    res = func(*args, **kwargs)
/usr/lib/python3.8/site-packages/pytest_flake8.py:182: in check_file
    app.parse_preliminary_options_and_args(args)
E   AttributeError: 'Application' object has no attribute 'parse_preliminary_options_and_args'
_________________________________ FLAKE8-check _________________________________
/usr/lib/python3.8/site-packages/pluggy/hooks.py:286: in __call__
    return self._hookexec(self, self.get_hookimpls(), kwargs)
/usr/lib/python3.8/site-packages/pluggy/manager.py:93: in _hookexec
    return self._inner_hookexec(hook, methods, kwargs)
/usr/lib/python3.8/site-packages/pluggy/manager.py:84: in <lambda>
    self._inner_hookexec = lambda hook, methods, kwargs: hook.multicall(
/usr/lib/python3.8/site-packages/_pytest/runner.py:143: in pytest_runtest_call
    raise e
/usr/lib/python3.8/site-packages/_pytest/runner.py:135: in pytest_runtest_call
    item.runtest()
/usr/lib/python3.8/site-packages/pytest_flake8.py:110: in runtest
    found_errors, out, err = call(
/usr/lib/python3.8/site-packages/py/_io/capture.py:150: in call
    res = func(*args, **kwargs)
/usr/lib/python3.8/site-packages/pytest_flake8.py:182: in check_file
    app.parse_preliminary_options_and_args(args)
E   AttributeError: 'Application' object has no attribute 'parse_preliminary_options_and_args'
_________________________________ FLAKE8-check _________________________________
/usr/lib/python3.8/site-packages/pluggy/hooks.py:286: in __call__
    return self._hookexec(self, self.get_hookimpls(), kwargs)
/usr/lib/python3.8/site-packages/pluggy/manager.py:93: in _hookexec
    return self._inner_hookexec(hook, methods, kwargs)
/usr/lib/python3.8/site-packages/pluggy/manager.py:84: in <lambda>
    self._inner_hookexec = lambda hook, methods, kwargs: hook.multicall(
/usr/lib/python3.8/site-packages/_pytest/runner.py:143: in pytest_runtest_call
    raise e
/usr/lib/python3.8/site-packages/_pytest/runner.py:135: in pytest_runtest_call
    item.runtest()
/usr/lib/python3.8/site-packages/pytest_flake8.py:110: in runtest
    found_errors, out, err = call(
/usr/lib/python3.8/site-packages/py/_io/capture.py:150: in call
    res = func(*args, **kwargs)
/usr/lib/python3.8/site-packages/pytest_flake8.py:182: in check_file
    app.parse_preliminary_options_and_args(args)
E   AttributeError: 'Application' object has no attribute 'parse_preliminary_options_and_args'
_________________________________ FLAKE8-check _________________________________
/usr/lib/python3.8/site-packages/pluggy/hooks.py:286: in __call__
    return self._hookexec(self, self.get_hookimpls(), kwargs)
/usr/lib/python3.8/site-packages/pluggy/manager.py:93: in _hookexec
    return self._inner_hookexec(hook, methods, kwargs)
/usr/lib/python3.8/site-packages/pluggy/manager.py:84: in <lambda>
    self._inner_hookexec = lambda hook, methods, kwargs: hook.multicall(
/usr/lib/python3.8/site-packages/_pytest/runner.py:143: in pytest_runtest_call
    raise e
/usr/lib/python3.8/site-packages/_pytest/runner.py:135: in pytest_runtest_call
    item.runtest()
/usr/lib/python3.8/site-packages/pytest_flake8.py:110: in runtest
    found_errors, out, err = call(
/usr/lib/python3.8/site-packages/py/_io/capture.py:150: in call
    res = func(*args, **kwargs)
/usr/lib/python3.8/site-packages/pytest_flake8.py:182: in check_file
    app.parse_preliminary_options_and_args(args)
E   AttributeError: 'Application' object has no attribute 'parse_preliminary_options_and_args'
_________________________________ FLAKE8-check _________________________________
/usr/lib/python3.8/site-packages/pluggy/hooks.py:286: in __call__
    return self._hookexec(self, self.get_hookimpls(), kwargs)
/usr/lib/python3.8/site-packages/pluggy/manager.py:93: in _hookexec
    return self._inner_hookexec(hook, methods, kwargs)
/usr/lib/python3.8/site-packages/pluggy/manager.py:84: in <lambda>
    self._inner_hookexec = lambda hook, methods, kwargs: hook.multicall(
/usr/lib/python3.8/site-packages/_pytest/runner.py:143: in pytest_runtest_call
    raise e
/usr/lib/python3.8/site-packages/_pytest/runner.py:135: in pytest_runtest_call
    item.runtest()
/usr/lib/python3.8/site-packages/pytest_flake8.py:110: in runtest
    found_errors, out, err = call(
/usr/lib/python3.8/site-packages/py/_io/capture.py:150: in call
    res = func(*args, **kwargs)
/usr/lib/python3.8/site-packages/pytest_flake8.py:182: in check_file
    app.parse_preliminary_options_and_args(args)
E   AttributeError: 'Application' object has no attribute 'parse_preliminary_options_and_args'
_________________________________ FLAKE8-check _________________________________
/usr/lib/python3.8/site-packages/pluggy/hooks.py:286: in __call__
    return self._hookexec(self, self.get_hookimpls(), kwargs)
/usr/lib/python3.8/site-packages/pluggy/manager.py:93: in _hookexec
    return self._inner_hookexec(hook, methods, kwargs)
/usr/lib/python3.8/site-packages/pluggy/manager.py:84: in <lambda>
    self._inner_hookexec = lambda hook, methods, kwargs: hook.multicall(
/usr/lib/python3.8/site-packages/_pytest/runner.py:143: in pytest_runtest_call
    raise e
/usr/lib/python3.8/site-packages/_pytest/runner.py:135: in pytest_runtest_call
    item.runtest()
/usr/lib/python3.8/site-packages/pytest_flake8.py:110: in runtest
    found_errors, out, err = call(
/usr/lib/python3.8/site-packages/py/_io/capture.py:150: in call
    res = func(*args, **kwargs)
/usr/lib/python3.8/site-packages/pytest_flake8.py:182: in check_file
    app.parse_preliminary_options_and_args(args)
E   AttributeError: 'Application' object has no attribute 'parse_preliminary_options_and_args'
_________________________________ FLAKE8-check _________________________________
/usr/lib/python3.8/site-packages/pluggy/hooks.py:286: in __call__
    return self._hookexec(self, self.get_hookimpls(), kwargs)
/usr/lib/python3.8/site-packages/pluggy/manager.py:93: in _hookexec
    return self._inner_hookexec(hook, methods, kwargs)
/usr/lib/python3.8/site-packages/pluggy/manager.py:84: in <lambda>
    self._inner_hookexec = lambda hook, methods, kwargs: hook.multicall(
/usr/lib/python3.8/site-packages/_pytest/runner.py:143: in pytest_runtest_call
    raise e
/usr/lib/python3.8/site-packages/_pytest/runner.py:135: in pytest_runtest_call
    item.runtest()
/usr/lib/python3.8/site-packages/pytest_flake8.py:110: in runtest
    found_errors, out, err = call(
/usr/lib/python3.8/site-packages/py/_io/capture.py:150: in call
    res = func(*args, **kwargs)
/usr/lib/python3.8/site-packages/pytest_flake8.py:182: in check_file
    app.parse_preliminary_options_and_args(args)
E   AttributeError: 'Application' object has no attribute 'parse_preliminary_options_and_args'
_________________________________ FLAKE8-check _________________________________
/usr/lib/python3.8/site-packages/pluggy/hooks.py:286: in __call__
    return self._hookexec(self, self.get_hookimpls(), kwargs)
/usr/lib/python3.8/site-packages/pluggy/manager.py:93: in _hookexec
    return self._inner_hookexec(hook, methods, kwargs)
/usr/lib/python3.8/site-packages/pluggy/manager.py:84: in <lambda>
    self._inner_hookexec = lambda hook, methods, kwargs: hook.multicall(
/usr/lib/python3.8/site-packages/_pytest/runner.py:143: in pytest_runtest_call
    raise e
/usr/lib/python3.8/site-packages/_pytest/runner.py:135: in pytest_runtest_call
    item.runtest()
/usr/lib/python3.8/site-packages/pytest_flake8.py:110: in runtest
    found_errors, out, err = call(
/usr/lib/python3.8/site-packages/py/_io/capture.py:150: in call
    res = func(*args, **kwargs)
/usr/lib/python3.8/site-packages/pytest_flake8.py:182: in check_file
    app.parse_preliminary_options_and_args(args)
E   AttributeError: 'Application' object has no attribute 'parse_preliminary_options_and_args'
_________________________________ FLAKE8-check _________________________________
/usr/lib/python3.8/site-packages/pluggy/hooks.py:286: in __call__
    return self._hookexec(self, self.get_hookimpls(), kwargs)
/usr/lib/python3.8/site-packages/pluggy/manager.py:93: in _hookexec
    return self._inner_hookexec(hook, methods, kwargs)
/usr/lib/python3.8/site-packages/pluggy/manager.py:84: in <lambda>
    self._inner_hookexec = lambda hook, methods, kwargs: hook.multicall(
/usr/lib/python3.8/site-packages/_pytest/runner.py:143: in pytest_runtest_call
    raise e
/usr/lib/python3.8/site-packages/_pytest/runner.py:135: in pytest_runtest_call
    item.runtest()
/usr/lib/python3.8/site-packages/pytest_flake8.py:110: in runtest
    found_errors, out, err = call(
/usr/lib/python3.8/site-packages/py/_io/capture.py:150: in call
    res = func(*args, **kwargs)
/usr/lib/python3.8/site-packages/pytest_flake8.py:182: in check_file
    app.parse_preliminary_options_and_args(args)
E   AttributeError: 'Application' object has no attribute 'parse_preliminary_options_and_args'
_________________________________ FLAKE8-check _________________________________
/usr/lib/python3.8/site-packages/pluggy/hooks.py:286: in __call__
    return self._hookexec(self, self.get_hookimpls(), kwargs)
/usr/lib/python3.8/site-packages/pluggy/manager.py:93: in _hookexec
    return self._inner_hookexec(hook, methods, kwargs)
/usr/lib/python3.8/site-packages/pluggy/manager.py:84: in <lambda>
    self._inner_hookexec = lambda hook, methods, kwargs: hook.multicall(
/usr/lib/python3.8/site-packages/_pytest/runner.py:143: in pytest_runtest_call
    raise e
/usr/lib/python3.8/site-packages/_pytest/runner.py:135: in pytest_runtest_call
    item.runtest()
/usr/lib/python3.8/site-packages/pytest_flake8.py:110: in runtest
    found_errors, out, err = call(
/usr/lib/python3.8/site-packages/py/_io/capture.py:150: in call
    res = func(*args, **kwargs)
/usr/lib/python3.8/site-packages/pytest_flake8.py:182: in check_file
    app.parse_preliminary_options_and_args(args)
E   AttributeError: 'Application' object has no attribute 'parse_preliminary_options_and_args'
_________________________________ FLAKE8-check _________________________________
/usr/lib/python3.8/site-packages/pluggy/hooks.py:286: in __call__
    return self._hookexec(self, self.get_hookimpls(), kwargs)
/usr/lib/python3.8/site-packages/pluggy/manager.py:93: in _hookexec
    return self._inner_hookexec(hook, methods, kwargs)
/usr/lib/python3.8/site-packages/pluggy/manager.py:84: in <lambda>
    self._inner_hookexec = lambda hook, methods, kwargs: hook.multicall(
/usr/lib/python3.8/site-packages/_pytest/runner.py:143: in pytest_runtest_call
    raise e
/usr/lib/python3.8/site-packages/_pytest/runner.py:135: in pytest_runtest_call
    item.runtest()
/usr/lib/python3.8/site-packages/pytest_flake8.py:110: in runtest
    found_errors, out, err = call(
/usr/lib/python3.8/site-packages/py/_io/capture.py:150: in call
    res = func(*args, **kwargs)
/usr/lib/python3.8/site-packages/pytest_flake8.py:182: in check_file
    app.parse_preliminary_options_and_args(args)
E   AttributeError: 'Application' object has no attribute 'parse_preliminary_options_and_args'
_________________________________ FLAKE8-check _________________________________
/usr/lib/python3.8/site-packages/pluggy/hooks.py:286: in __call__
    return self._hookexec(self, self.get_hookimpls(), kwargs)
/usr/lib/python3.8/site-packages/pluggy/manager.py:93: in _hookexec
    return self._inner_hookexec(hook, methods, kwargs)
/usr/lib/python3.8/site-packages/pluggy/manager.py:84: in <lambda>
    self._inner_hookexec = lambda hook, methods, kwargs: hook.multicall(
/usr/lib/python3.8/site-packages/_pytest/runner.py:143: in pytest_runtest_call
    raise e
/usr/lib/python3.8/site-packages/_pytest/runner.py:135: in pytest_runtest_call
    item.runtest()
/usr/lib/python3.8/site-packages/pytest_flake8.py:110: in runtest
    found_errors, out, err = call(
/usr/lib/python3.8/site-packages/py/_io/capture.py:150: in call
    res = func(*args, **kwargs)
/usr/lib/python3.8/site-packages/pytest_flake8.py:182: in check_file
    app.parse_preliminary_options_and_args(args)
E   AttributeError: 'Application' object has no attribute 'parse_preliminary_options_and_args'
_________________________________ FLAKE8-check _________________________________
/usr/lib/python3.8/site-packages/pluggy/hooks.py:286: in __call__
    return self._hookexec(self, self.get_hookimpls(), kwargs)
/usr/lib/python3.8/site-packages/pluggy/manager.py:93: in _hookexec
    return self._inner_hookexec(hook, methods, kwargs)
/usr/lib/python3.8/site-packages/pluggy/manager.py:84: in <lambda>
    self._inner_hookexec = lambda hook, methods, kwargs: hook.multicall(
/usr/lib/python3.8/site-packages/_pytest/runner.py:143: in pytest_runtest_call
    raise e
/usr/lib/python3.8/site-packages/_pytest/runner.py:135: in pytest_runtest_call
    item.runtest()
/usr/lib/python3.8/site-packages/pytest_flake8.py:110: in runtest
    found_errors, out, err = call(
/usr/lib/python3.8/site-packages/py/_io/capture.py:150: in call
    res = func(*args, **kwargs)
/usr/lib/python3.8/site-packages/pytest_flake8.py:182: in check_file
    app.parse_preliminary_options_and_args(args)
E   AttributeError: 'Application' object has no attribute 'parse_preliminary_options_and_args'
_________________________________ FLAKE8-check _________________________________
/usr/lib/python3.8/site-packages/pluggy/hooks.py:286: in __call__
    return self._hookexec(self, self.get_hookimpls(), kwargs)
/usr/lib/python3.8/site-packages/pluggy/manager.py:93: in _hookexec
    return self._inner_hookexec(hook, methods, kwargs)
/usr/lib/python3.8/site-packages/pluggy/manager.py:84: in <lambda>
    self._inner_hookexec = lambda hook, methods, kwargs: hook.multicall(
/usr/lib/python3.8/site-packages/_pytest/runner.py:143: in pytest_runtest_call
    raise e
/usr/lib/python3.8/site-packages/_pytest/runner.py:135: in pytest_runtest_call
    item.runtest()
/usr/lib/python3.8/site-packages/pytest_flake8.py:110: in runtest
    found_errors, out, err = call(
/usr/lib/python3.8/site-packages/py/_io/capture.py:150: in call
    res = func(*args, **kwargs)
/usr/lib/python3.8/site-packages/pytest_flake8.py:182: in check_file
    app.parse_preliminary_options_and_args(args)
E   AttributeError: 'Application' object has no attribute 'parse_preliminary_options_and_args'
_________________________________ FLAKE8-check _________________________________
/usr/lib/python3.8/site-packages/pluggy/hooks.py:286: in __call__
    return self._hookexec(self, self.get_hookimpls(), kwargs)
/usr/lib/python3.8/site-packages/pluggy/manager.py:93: in _hookexec
    return self._inner_hookexec(hook, methods, kwargs)
/usr/lib/python3.8/site-packages/pluggy/manager.py:84: in <lambda>
    self._inner_hookexec = lambda hook, methods, kwargs: hook.multicall(
/usr/lib/python3.8/site-packages/_pytest/runner.py:143: in pytest_runtest_call
    raise e
/usr/lib/python3.8/site-packages/_pytest/runner.py:135: in pytest_runtest_call
    item.runtest()
/usr/lib/python3.8/site-packages/pytest_flake8.py:110: in runtest
    found_errors, out, err = call(
/usr/lib/python3.8/site-packages/py/_io/capture.py:150: in call
    res = func(*args, **kwargs)
/usr/lib/python3.8/site-packages/pytest_flake8.py:182: in check_file
    app.parse_preliminary_options_and_args(args)
E   AttributeError: 'Application' object has no attribute 'parse_preliminary_options_and_args'
_________________________________ FLAKE8-check _________________________________
/usr/lib/python3.8/site-packages/pluggy/hooks.py:286: in __call__
    return self._hookexec(self, self.get_hookimpls(), kwargs)
/usr/lib/python3.8/site-packages/pluggy/manager.py:93: in _hookexec
    return self._inner_hookexec(hook, methods, kwargs)
/usr/lib/python3.8/site-packages/pluggy/manager.py:84: in <lambda>
    self._inner_hookexec = lambda hook, methods, kwargs: hook.multicall(
/usr/lib/python3.8/site-packages/_pytest/runner.py:143: in pytest_runtest_call
    raise e
/usr/lib/python3.8/site-packages/_pytest/runner.py:135: in pytest_runtest_call
    item.runtest()
/usr/lib/python3.8/site-packages/pytest_flake8.py:110: in runtest
    found_errors, out, err = call(
/usr/lib/python3.8/site-packages/py/_io/capture.py:150: in call
    res = func(*args, **kwargs)
/usr/lib/python3.8/site-packages/pytest_flake8.py:182: in check_file
    app.parse_preliminary_options_and_args(args)
E   AttributeError: 'Application' object has no attribute 'parse_preliminary_options_and_args'
=============================== warnings summary ===============================
/usr/lib/python3.8/site-packages/pytest_flake8.py:65: 16 tests with warnings
  /usr/lib/python3.8/site-packages/pytest_flake8.py:65: PytestDeprecationWarning: direct construction of Flake8Item has been deprecated, please use Flake8Item.from_parent
    return Flake8Item(

/usr/lib/python3.8/site-packages/pytest_isort.py:43: 16 tests with warnings
  /usr/lib/python3.8/site-packages/pytest_isort.py:43: PytestDeprecationWarning: direct construction of IsortItem has been deprecated, please use IsortItem.from_parent
    return IsortItem(path, parent)

-- Docs: https://docs.pytest.org/en/latest/warnings.html
=========================== short test summary info ============================
FAILED setup.py::FLAKE8 - AttributeError: 'Application' object has no attribu...
FAILED cairocffi/__init__.py::FLAKE8 - AttributeError: 'Application' object h...
FAILED cairocffi/constants.py::FLAKE8 - AttributeError: 'Application' object ...
FAILED cairocffi/context.py::FLAKE8 - AttributeError: 'Application' object ha...
FAILED cairocffi/ffi_build.py::FLAKE8 - AttributeError: 'Application' object ...
FAILED cairocffi/fonts.py::FLAKE8 - AttributeError: 'Application' object has ...
FAILED cairocffi/matrix.py::FLAKE8 - AttributeError: 'Application' object has...
FAILED cairocffi/patterns.py::FLAKE8 - AttributeError: 'Application' object h...
FAILED cairocffi/pixbuf.py::FLAKE8 - AttributeError: 'Application' object has...
FAILED cairocffi/surfaces.py::FLAKE8 - AttributeError: 'Application' object h...
FAILED cairocffi/test_cairo.py::FLAKE8 - AttributeError: 'Application' object...
FAILED cairocffi/test_pixbuf.py::FLAKE8 - AttributeError: 'Application' objec...
FAILED cairocffi/test_xcb.py::FLAKE8 - AttributeError: 'Application' object h...
FAILED cairocffi/xcb.py::FLAKE8 - AttributeError: 'Application' object has no...
FAILED cairocffi/_generated/ffi.py::FLAKE8 - AttributeError: 'Application' ob...
FAILED cairocffi/_generated/ffi_pixbuf.py::FLAKE8 - AttributeError: 'Applicat...
======= 16 failed, 66 passed, 1 skipped, 1 xfailed, 32 warnings in 2.78s =======
>>> ERROR: py3-cairocffi: check failed
>>> py3-cairocffi: Uninstalling dependencies...
(1/48) Purging .makedepends-py3-cairocffi (20200601.194242)
(2/48) Purging py3-cffi (1.14.0-r2)
(3/48) Purging py3-cparser (2.20-r0)
(4/48) Purging cairo (1.16.0-r2)
(5/48) Purging gdk-pixbuf (2.40.0-r2)
Executing gdk-pixbuf-2.40.0-r2.pre-deinstall
(6/48) Purging shared-mime-info (1.15-r0)
Executing shared-mime-info-1.15-r0.post-deinstall
(7/48) Purging py3-pytest-cov (2.8.1-r1)
(8/48) Purging py3-coverage (5.1-r0)
(9/48) Purging py3-pytest-isort (0.3.1-r1)
(10/48) Purging py3-isort (4.3.21.2-r1)
(11/48) Purging py3-pytest-flake8 (1.0.4-r1)
(12/48) Purging py3-pytest (5.4.2-r0)
(13/48) Purging py3-atomicwrites (1.4.0-r0)
(14/48) Purging py3-py (1.8.1-r0)
(15/48) Purging py3-attrs (19.3.0-r1)
(16/48) Purging py3-more-itertools (8.3.0-r0)
(17/48) Purging py3-pluggy (0.13.1-r0)
(18/48) Purging py3-wcwidth (0.1.9-r0)
(19/48) Purging py3-flake8 (3.8.2-r0)
(20/48) Purging py3-entrypoints (0.3-r3)
(21/48) Purging py3-pyflakes (2.2.0-r0)
(22/48) Purging py3-pycodestyle (2.6.0-r0)
(23/48) Purging py3-mccabe (0.6.1-r5)
(24/48) Purging py3-setuptools (47.0.0-r0)
(25/48) Purging py3-ordered-set (4.0.1-r0)
(26/48) Purging py3-appdirs (1.4.4-r1)
(27/48) Purging py3-packaging (20.4-r0)
(28/48) Purging py3-parsing (2.4.7-r0)
(29/48) Purging py3-six (1.15.0-r0)
(30/48) Purging ttf-dejavu (2.37-r1)
(31/48) Purging fontconfig (2.13.1-r2)
(32/48) Purging encodings (1.0.5-r0)
(33/48) Purging mkfontscale (1.2.1-r1)
(34/48) Purging libxext (1.3.4-r0)
(35/48) Purging libxrender (0.9.10-r3)
(36/48) Purging libx11 (1.6.9-r0)
(37/48) Purging libxcb (1.14-r1)
(38/48) Purging libxau (1.0.9-r0)
(39/48) Purging libxdmcp (1.1.3-r0)
(40/48) Purging libbsd (0.10.0-r0)
(41/48) Purging freetype (2.10.2-r0)
(42/48) Purging brotli-libs (1.0.7-r5)
(43/48) Purging libpng (1.6.37-r1)
(44/48) Purging pixman (0.40.0-r2)
(45/48) Purging libxml2 (2.9.10-r4)
(46/48) Purging tiff (4.1.0-r0)
(47/48) Purging libjpeg-turbo (2.0.4-r1)
(48/48) Purging libfontenc (1.1.4-r0)
Executing busybox-1.31.1-r16.trigger
OK: 1124 MiB in 204 packages
Build complete: failed a month ago (took 29 seconds)