#219201 failed

render/egl: stop including eglmesaext.h

cb0a41eSimon Ser

Owner
~sircmpwn
Created
a month ago
Updated
a month ago
Build manifest
view manifest »

Tasks

view log »
setup view log »
build view log »
build-features-disabled view log »
go to bottom »
setup
1
2
3
4
5
6
7
8
9
10
11
12
13
14
15
16
17
18
19
20
21
22
23
24
25
26
27
28
29
30
31
32
33
34
35
36
37
38
39
40
41
42
43
44
45
46
47
48
49
50
51
52
53
54
55
56
57
58
59
60
61
62
63
64
65
66
67
68
69
70
71
72
73
74
75
76
77
78
79
80
81
82
83
84
85
86
87
88
89
90
91
92
93
94
95
96
97
98
99
100
101
102
103
104
105
106
107
108
109
110
111
112
113
114
115
116
117
118
119
120
121
122
123
124
125
126
127
128
129
130
131
132
133
134
135
136
137
138
139
140
141
[#219201] 2020/05/25 15:05:20 Booting image alpine/edge (default) on port 22768
[#219201] 2020/05/25 15:05:20 Waiting for guest to settle
[#219201] 2020/05/25 15:05:28 Sending tasks
[#219201] 2020/05/25 15:05:28 Sending build environment
[#219201] 2020/05/25 15:05:28 Installing packages
Warning: Permanently added '[localhost]:22768' (ECDSA) to the list of known hosts.
fetch http://dl-cdn.alpinelinux.org/alpine/edge/main/x86_64/APKINDEX.tar.gz
fetch http://dl-cdn.alpinelinux.org/alpine/edge/community/x86_64/APKINDEX.tar.gz
fetch http://dl-cdn.alpinelinux.org/alpine/edge/testing/x86_64/APKINDEX.tar.gz
v3.12.0_rc1-247-ga6dc26b8a4 [http://dl-cdn.alpinelinux.org/alpine/edge/main]
v3.12.0_rc1-252-g8ca2f0a6c4 [http://dl-cdn.alpinelinux.org/alpine/edge/community]
v3.12.0_rc1-252-g8ca2f0a6c4 [http://dl-cdn.alpinelinux.org/alpine/edge/testing]
OK: 16764 distinct packages available
Warning: Permanently added '[localhost]:22768' (ECDSA) to the list of known hosts.
(1/102) Installing udev-init-scripts (33-r1)
Executing udev-init-scripts-33-r1.post-install
(2/102) Installing udev-init-scripts-openrc (33-r1)
(3/102) Installing eudev-libs (3.2.9-r3)
(4/102) Installing eudev (3.2.9-r3)
(5/102) Installing eudev-openrc (3.2.9-r3)
(6/102) Installing eudev-dev (3.2.9-r3)
(7/102) Installing sdl2 (2.0.12-r1)
(8/102) Installing libxau (1.0.9-r0)
(9/102) Installing libbsd (0.10.0-r0)
(10/102) Installing libxdmcp (1.1.3-r0)
(11/102) Installing libxcb (1.14-r1)
(12/102) Installing libx11 (1.6.9-r0)
(13/102) Installing aom-libs (1.0.0-r1)
(14/102) Installing alsa-lib (1.2.2-r0)
(15/102) Installing brotli-libs (1.0.7-r5)
(16/102) Installing libpng (1.6.37-r1)
(17/102) Installing freetype (2.10.2-r0)
(18/102) Installing fontconfig (2.13.1-r2)
(19/102) Installing fribidi (1.0.9-r0)
(20/102) Installing libass (0.14.0-r0)
(21/102) Installing libdav1d (0.7.0-r0)
(22/102) Installing lame (3.100-r0)
(23/102) Installing opus (1.3.1-r0)
(24/102) Installing libssh (0.9.4-r0)
(25/102) Installing libogg (1.3.4-r0)
(26/102) Installing libtheora (1.1.1-r14)
(27/102) Installing libjpeg-turbo (2.0.4-r1)
(28/102) Installing v4l-utils-libs (1.20.0-r0)
(29/102) Installing libxext (1.3.4-r0)
(30/102) Installing libxfixes (5.0.3-r2)
(31/102) Installing libpciaccess (0.16-r0)
(32/102) Installing libdrm (2.4.101-r0)
(33/102) Installing wayland-libs-client (1.18.0-r4)
(34/102) Installing libva (2.7.1-r0)
(35/102) Installing libvdpau (1.4-r0)
(36/102) Installing libvorbis (1.3.6-r2)
(37/102) Installing libvpx (1.8.2-r0)
(38/102) Installing x264-libs (20191119-r1)
(39/102) Installing x265-libs (3.3-r1)
(40/102) Installing xvidcore (1.3.7-r1)
(41/102) Installing ffmpeg-libs (4.2.3-r0)
(42/102) Installing ffmpeg-dev (4.2.3-r0)
(43/102) Installing libevdev (1.9.0-r0)
(44/102) Installing mtdev (1.1.6-r0)
(45/102) Installing libinput-libs (1.15.5-r0)
(46/102) Installing libinput-dev (1.15.5-r0)
(47/102) Installing libxkbcommon (0.10.0-r1)
(48/102) Installing libxkbcommon-x11 (0.10.0-r1)
(49/102) Installing xorgproto (2020.1-r0)
(50/102) Installing libxau-dev (1.0.9-r0)
(51/102) Installing xcb-proto (1.14-r0)
(52/102) Installing libxdmcp-dev (1.1.3-r0)
(53/102) Installing libxcb-dev (1.14-r1)
(54/102) Installing libxkbcommon-dev (0.10.0-r1)
(55/102) Installing linux-headers (5.4.5-r1)
(56/102) Installing libdrm-dev (2.4.101-r0)
(57/102) Installing xtrans (1.4.0-r1)
(58/102) Installing libx11-dev (1.6.9-r0)
(59/102) Installing libxext-dev (1.3.4-r0)
(60/102) Installing libxdamage (1.1.5-r0)
(61/102) Installing libxfixes-dev (5.0.3-r2)
(62/102) Installing libxdamage-dev (1.1.5-r0)
(63/102) Installing libxshmfence (1.3-r0)
(64/102) Installing libxshmfence-dev (1.3-r0)
(65/102) Installing mesa (20.0.7-r0)
(66/102) Installing wayland-libs-server (1.18.0-r4)
(67/102) Installing mesa-gbm (20.0.7-r0)
(68/102) Installing mesa-glapi (20.0.7-r0)
(69/102) Installing mesa-egl (20.0.7-r0)
(70/102) Installing libxxf86vm (1.1.4-r2)
(71/102) Installing mesa-gl (20.0.7-r0)
(72/102) Installing mesa-gles (20.0.7-r0)
(73/102) Installing libxml2 (2.9.10-r4)
(74/102) Installing llvm10-libs (10.0.0-r2)
(75/102) Installing zstd-libs (1.4.5-r0)
(76/102) Installing mesa-osmesa (20.0.7-r0)
(77/102) Installing mesa-xatracker (20.0.7-r0)
(78/102) Installing libxxf86vm-dev (1.1.4-r2)
(79/102) Installing mesa-dev (20.0.7-r0)
(80/102) Installing samurai (1.1-r0)
(81/102) Installing py3-ordered-set (4.0.1-r0)
(82/102) Installing py3-appdirs (1.4.4-r1)
(83/102) Installing py3-parsing (2.4.7-r0)
(84/102) Installing py3-six (1.15.0-r0)
(85/102) Installing py3-packaging (20.4-r0)
(86/102) Installing py3-setuptools (46.4.0-r0)
(87/102) Installing meson (0.54.2-r1)
(88/102) Installing pixman (0.40.0-r2)
(89/102) Installing pixman-dev (0.40.0-r2)
(90/102) Installing libffi-dev (3.3-r2)
(91/102) Installing expat-dev (2.2.9-r1)
(92/102) Installing wayland-libs-cursor (1.18.0-r4)
(93/102) Installing wayland-libs-egl (1.18.0-r4)
(94/102) Installing wayland-dev (1.18.0-r4)
(95/102) Installing wayland-protocols (1.20-r0)
(96/102) Installing util-macros (1.19.2-r1)
(97/102) Installing xcb-util (0.4.0-r3)
(98/102) Installing xcb-util-dev (0.4.0-r3)
(99/102) Installing xcb-util-image (0.4.0-r1)
(100/102) Installing xcb-util-image-dev (0.4.0-r1)
(101/102) Installing xcb-util-wm (0.4.1-r1)
(102/102) Installing xcb-util-wm-dev (0.4.1-r1)
Executing busybox-1.31.1-r16.trigger
Executing eudev-3.2.9-r3.trigger
OK: 1253 MiB in 303 packages
[#219201] 2020/05/25 15:05:50 Cloning repositories
Cloning into 'wlroots'...
+ cd wlroots
+ git checkout -q cb0a41e732d86da71b69f6b4a825e7d34d9da594
+ cd wlroots
+ git submodule update --init
[#219201] 2020/05/25 15:06:57 Running task setup
[#219201] 2020/05/25 15:07:00 Running task build
[#219201] 2020/05/25 15:07:00 Processing post-failed triggers...
[#219201] 2020/05/25 15:07:01 Sending webhook...
[#219201] 2020/05/25 15:07:04 Webhook response: 200
[#219201] 2020/05/25 15:07:04 Sent build status to GitHub
[#219201] 2020/05/25 15:07:04 Build failed.
[#219201] 2020/05/25 15:07:04 The build environment will be kept alive for 10 minutes.
[#219201] 2020/05/25 15:07:04 To log in with SSH and examine it, use the following command:
[#219201] 2020/05/25 15:07:04 
[#219201] 2020/05/25 15:07:04 	ssh -t builds@azusa.runners.sr.ht connect 219201
[#219201] 2020/05/25 15:07:04 
[#219201] 2020/05/25 15:07:04 After logging in, the deadline is increased to your remaining build time.
[#219201] 2020/05/25 15:17:04 Deadline elapsed. Terminating build environment.
[#219201] 2020/05/25 15:17:04 Error: Running task on guest: exit status 1
setup
1
2
3
4
5
6
7
8
9
10
11
12
13
14
15
16
17
18
19
20
21
22
23
24
25
26
27
28
29
30
31
32
33
34
35
36
37
38
39
40
41
42
43
44
45
46
47
48
49
50
51
52
53
54
55
56
57
58
59
60
61
62
63
64
65
66
67
68
69
70
71
72
73
74
75
76
77
78
79
80
+ cd wlroots
+ meson build -Dauto_features=enabled -Dlogind=disabled -Dxcb-errors=disabled
The Meson build system
Version: 0.54.2
Source dir: /home/build/wlroots
Build dir: /home/build/wlroots/build
Build type: native build
Project name: wlroots
Project version: 0.10.0
C compiler for the host machine: cc (gcc 9.3.0 "cc (Alpine 9.3.0) 9.3.0")
C linker for the host machine: cc ld.bfd 2.34
Host machine cpu family: x86_64
Host machine cpu: x86_64
Compiler for C supports arguments -Wundef: YES 
Compiler for C supports arguments -Wlogical-op: YES 
Compiler for C supports arguments -Wmissing-include-dirs: YES 
Compiler for C supports arguments -Wold-style-definition: YES 
Compiler for C supports arguments -Wpointer-arith: YES 
Compiler for C supports arguments -Winit-self: YES 
Compiler for C supports arguments -Wstrict-prototypes: YES 
Compiler for C supports arguments -Wimplicit-fallthrough=2: YES 
Compiler for C supports arguments -Wendif-labels: YES 
Compiler for C supports arguments -Wstrict-aliasing=2: YES 
Compiler for C supports arguments -Woverflow: YES 
Compiler for C supports arguments -Wmissing-prototypes: YES 
Compiler for C supports arguments -Wno-missing-braces -Wmissing-braces: YES 
Compiler for C supports arguments -Wno-missing-field-initializers -Wmissing-field-initializers: YES 
Compiler for C supports arguments -Wno-unused-parameter -Wunused-parameter: YES 
Compiler for C supports arguments -fmacro-prefix-map=/prefix/to/hide=: YES 
Found pkg-config: /usr/bin/pkg-config (1.6.3)
Run-time dependency wayland-server found: YES 1.18.0
Run-time dependency wayland-client found: YES 1.18.0
Run-time dependency wayland-egl found: YES 18.1.0
Run-time dependency wayland-protocols found: YES 1.20
Run-time dependency egl found: YES 20.0.7
Run-time dependency glesv2 found: YES 20.0.7
Run-time dependency libdrm found: YES 2.4.101
Run-time dependency gbm found: YES 20.0.7
Run-time dependency libinput found: YES 1.15.5
Run-time dependency xkbcommon found: YES 0.10.0
Run-time dependency libudev found: YES 243
Run-time dependency pixman-1 found: YES 0.40.0
Library m found: YES
Library rt found: YES
Found pkg-config: /usr/bin/pkg-config (1.6.3)
Build-time dependency wayland-scanner found: YES 1.18.0
Program /usr/bin/wayland-scanner found: YES (/usr/bin/wayland-scanner)
Run-time dependency x11-xcb found: YES 1.6.9
Run-time dependency xcb found: YES 1.14
Run-time dependency xcb-xinput found: YES 1.14
Run-time dependency xcb-xfixes found: YES 1.14
Run-time dependency xcb found: YES 1.14
Run-time dependency xcb-composite found: YES 1.14
Run-time dependency xcb-render found: YES 1.14
Run-time dependency xcb-xfixes found: YES 1.14
Dependency xcb-errors skipped: feature xcb-errors disabled
Run-time dependency xcb-icccm found: YES 0.4.1
Configuring config.h using configuration
Configuring version.h using configuration
Run-time dependency threads found: YES
Run-time dependency wayland-cursor found: YES 1.18.0
Did not find CMake 'cmake'
Found CMake: NO
Run-time dependency libpng found: NO (tried pkgconfig and cmake)
Run-time dependency libavutil found: YES 56.31.100
Run-time dependency libavcodec found: YES 58.54.100
Run-time dependency libavformat found: YES 58.29.100
Has header "libavutil/hwcontext_drm.h" with dependency libavutil: YES 
Build targets in project: 114

wlroots 0.10.0

        systemd: 0
        elogind: 0
       xwayland: 1
    x11_backend: 1
      xcb-icccm: 1
     xcb-errors: 0

Found ninja-1.9.0 at /usr/bin/ninja
build
1
2
3
4
5
6
7
8
9
10
11
12
13
14
15
16
17
18
19
20
21
22
23
24
25
26
27
28
29
30
31
32
33
34
35
36
37
38
39
40
41
42
43
44
45
46
47
48
49
50
51
52
53
54
55
56
57
58
59
60
61
62
63
+ cd wlroots
+ ninja -C build
[1/316] Generating wlr_virtual_pointer_unstable_v1_client_h with a custom command
[2/316] Generating wlr_foreign_toplevel_management_unstable_v1_client_h with a custom command
[3/316] Generating text_input_unstable_v3_client_h with a custom command
[4/316] Generating input_method_unstable_v2_client_h with a custom command
[5/316] Compiling C object 'examples/c590b3c@@virtual-pointer@exe/virtual-pointer.c.o'
[6/316] Generating wlr_export_dmabuf_unstable_v1_client_h with a custom command
[7/316] Compiling C object 'examples/c590b3c@@foreign-toplevel@exe/foreign-toplevel.c.o'
[8/316] Compiling C object 'examples/c590b3c@@dmabuf-capture@exe/dmabuf-capture.c.o'
[9/316] Generating pointer_constraints_unstable_v1_client_h with a custom command
[10/316] Generating wlr_output_power_management_unstable_v1_client_h with a custom command
[11/316] Compiling C object 'examples/c590b3c@@output-power-management@exe/output-power-management.c.o'
[12/316] Generating wlr_gamma_control_unstable_v1_client_h with a custom command
[13/316] Compiling C object 'examples/c590b3c@@gamma-control@exe/gamma-control.c.o'
[14/316] Generating wlr_input_inhibitor_unstable_v1_client_h with a custom command
[15/316] Generating wlr_layer_shell_unstable_v1_client_h with a custom command
[16/316] Generating keyboard_shortcuts_inhibit_unstable_v1_client_h with a custom command
[17/316] Generating idle_inhibit_unstable_v1_client_h with a custom command
[18/316] Generating kde_idle_client_h with a custom command
[19/316] Compiling C object 'examples/c590b3c@@idle@exe/idle.c.o'
[20/316] Compiling C object 'examples/c590b3c@@output-layout@exe/cat.c.o'
[21/316] Compiling C object 'examples/c590b3c@@output-layout@exe/output-layout.c.o'
[22/316] Compiling C object 'examples/c590b3c@@multi-pointer@exe/multi-pointer.c.o'
[23/316] Compiling C object 'examples/c590b3c@@rotation@exe/cat.c.o'
[24/316] Compiling C object 'examples/c590b3c@@rotation@exe/rotation.c.o'
ninja: job failed: cc -Iexamples/c590b3c@@multi-pointer@exe -Iexamples -I../examples -I. -I.. -Iinclude -I../include -Iprotocol -I../protocol -I/usr/include/libdrm -I/usr/include/pixman-1 -fdiagnostics-color=always -pipe -D_FILE_OFFSET_BITS=64 -Wall -Winvalid-pch -Wextra -Werror -std=c11 -g -DWLR_USE_UNSTABLE -Wundef -Wlogical-op -Wmissing-include-dirs -Wold-style-definition -Wpointer-arith -Winit-self -Wstrict-prototypes -Wimplicit-fallthrough=2 -Wendif-labels -Wstrict-aliasing=2 -Woverflow -Wmissing-prototypes -Wno-missing-braces -Wno-missing-field-initializers -Wno-unused-parameter -fmacro-prefix-map=../= -DLIBINPUT_MAJOR=1 -DLIBINPUT_MINOR=15 -DLIBINPUT_PATCH=5 '-DICONDIR="/usr/local/share/icons"' -MD -MQ 'examples/c590b3c@@multi-pointer@exe/multi-pointer.c.o' -MF 'examples/c590b3c@@multi-pointer@exe/multi-pointer.c.o.d' -o 'examples/c590b3c@@multi-pointer@exe/multi-pointer.c.o' -c ../examples/multi-pointer.c
In file included from ../include/wlr/backend.h:14,
                 from ../examples/multi-pointer.c:11:
../include/wlr/render/egl.h:50:3: error: unknown type name 'PFNEGLQUERYWAYLANDBUFFERWL'
   50 |   PFNEGLQUERYWAYLANDBUFFERWL eglQueryWaylandBufferWL;
      |   ^~~~~~~~~~~~~~~~~~~~~~~~~~
../include/wlr/render/egl.h:51:3: error: unknown type name 'PFNEGLBINDWAYLANDDISPLAYWL'
   51 |   PFNEGLBINDWAYLANDDISPLAYWL eglBindWaylandDisplayWL;
      |   ^~~~~~~~~~~~~~~~~~~~~~~~~~
../include/wlr/render/egl.h:52:3: error: unknown type name 'PFNEGLUNBINDWAYLANDDISPLAYWL'
   52 |   PFNEGLUNBINDWAYLANDDISPLAYWL eglUnbindWaylandDisplayWL;
      |   ^~~~~~~~~~~~~~~~~~~~~~~~~~~~
ninja: job failed: cc -Iexamples/c590b3c@@output-layout@exe -Iexamples -I../examples -I. -I.. -Iinclude -I../include -Iprotocol -I../protocol -I/usr/include/libdrm -I/usr/include/pixman-1 -fdiagnostics-color=always -pipe -D_FILE_OFFSET_BITS=64 -Wall -Winvalid-pch -Wextra -Werror -std=c11 -g -DWLR_USE_UNSTABLE -Wundef -Wlogical-op -Wmissing-include-dirs -Wold-style-definition -Wpointer-arith -Winit-self -Wstrict-prototypes -Wimplicit-fallthrough=2 -Wendif-labels -Wstrict-aliasing=2 -Woverflow -Wmissing-prototypes -Wno-missing-braces -Wno-missing-field-initializers -Wno-unused-parameter -fmacro-prefix-map=../= -DLIBINPUT_MAJOR=1 -DLIBINPUT_MINOR=15 -DLIBINPUT_PATCH=5 '-DICONDIR="/usr/local/share/icons"' -MD -MQ 'examples/c590b3c@@output-layout@exe/output-layout.c.o' -MF 'examples/c590b3c@@output-layout@exe/output-layout.c.o.d' -o 'examples/c590b3c@@output-layout@exe/output-layout.c.o' -c ../examples/output-layout.c
In file included from ../include/wlr/backend.h:14,
                 from ../examples/output-layout.c:12:
../include/wlr/render/egl.h:50:3: error: unknown type name 'PFNEGLQUERYWAYLANDBUFFERWL'
   50 |   PFNEGLQUERYWAYLANDBUFFERWL eglQueryWaylandBufferWL;
      |   ^~~~~~~~~~~~~~~~~~~~~~~~~~
../include/wlr/render/egl.h:51:3: error: unknown type name 'PFNEGLBINDWAYLANDDISPLAYWL'
   51 |   PFNEGLBINDWAYLANDDISPLAYWL eglBindWaylandDisplayWL;
      |   ^~~~~~~~~~~~~~~~~~~~~~~~~~
../include/wlr/render/egl.h:52:3: error: unknown type name 'PFNEGLUNBINDWAYLANDDISPLAYWL'
   52 |   PFNEGLUNBINDWAYLANDDISPLAYWL eglUnbindWaylandDisplayWL;
      |   ^~~~~~~~~~~~~~~~~~~~~~~~~~~~
ninja: job failed: cc -Iexamples/c590b3c@@rotation@exe -Iexamples -I../examples -I. -I.. -Iinclude -I../include -Iprotocol -I../protocol -I/usr/include/libdrm -I/usr/include/pixman-1 -fdiagnostics-color=always -pipe -D_FILE_OFFSET_BITS=64 -Wall -Winvalid-pch -Wextra -Werror -std=c11 -g -DWLR_USE_UNSTABLE -Wundef -Wlogical-op -Wmissing-include-dirs -Wold-style-definition -Wpointer-arith -Winit-self -Wstrict-prototypes -Wimplicit-fallthrough=2 -Wendif-labels -Wstrict-aliasing=2 -Woverflow -Wmissing-prototypes -Wno-missing-braces -Wno-missing-field-initializers -Wno-unused-parameter -fmacro-prefix-map=../= -DLIBINPUT_MAJOR=1 -DLIBINPUT_MINOR=15 -DLIBINPUT_PATCH=5 '-DICONDIR="/usr/local/share/icons"' -MD -MQ 'examples/c590b3c@@rotation@exe/rotation.c.o' -MF 'examples/c590b3c@@rotation@exe/rotation.c.o.d' -o 'examples/c590b3c@@rotation@exe/rotation.c.o' -c ../examples/rotation.c
In file included from ../include/wlr/backend.h:14,
                 from ../examples/rotation.c:12:
../include/wlr/render/egl.h:50:3: error: unknown type name 'PFNEGLQUERYWAYLANDBUFFERWL'
   50 |   PFNEGLQUERYWAYLANDBUFFERWL eglQueryWaylandBufferWL;
      |   ^~~~~~~~~~~~~~~~~~~~~~~~~~
../include/wlr/render/egl.h:51:3: error: unknown type name 'PFNEGLBINDWAYLANDDISPLAYWL'
   51 |   PFNEGLBINDWAYLANDDISPLAYWL eglBindWaylandDisplayWL;
      |   ^~~~~~~~~~~~~~~~~~~~~~~~~~
../include/wlr/render/egl.h:52:3: error: unknown type name 'PFNEGLUNBINDWAYLANDDISPLAYWL'
   52 |   PFNEGLUNBINDWAYLANDDISPLAYWL eglUnbindWaylandDisplayWL;
      |   ^~~~~~~~~~~~~~~~~~~~~~~~~~~~
ninja: subcommands failed
Build complete: failed a month ago (took a minute)