#488929 failed

c8c1280Sam Whited

ping: use new encoding test helper

Owner
~samwhited
Created
28 days ago
Updated
28 days ago
Build manifest
view manifest »

Tasks

view log »
setup view log »
stable view log »
go to bottom »
setup
1
2
3
4
5
6
7
8
9
10
11
12
13
14
15
16
17
18
19
20
21
22
23
24
25
26
27
28
29
30
31
32
33
34
35
36
37
38
39
40
41
42
43
44
45
46
47
48
49
50
51
52
53
54
55
56
57
58
59
60
61
62
63
64
65
66
67
68
69
70
71
72
73
74
75
76
77
78
79
80
81
82
83
84
85
86
87
88
89
90
91
92
93
94
95
96
97
98
99
100
101
102
103
104
105
106
107
108
109
110
111
112
113
114
115
116
117
118
119
120
121
122
123
124
125
126
127
128
129
130
131
132
133
134
135
136
137
138
139
140
141
142
143
144
145
146
147
148
149
150
151
152
153
154
155
156
157
158
159
160
161
162
163
164
165
166
167
168
169
170
171
172
173
174
175
176
177
178
179
180
181
182
183
184
185
186
187
188
189
190
191
192
193
194
195
196
197
198
199
200
201
202
203
204
205
206
207
208
209
210
211
212
213
214
[#488929] 2021/04/18 03:53:17 Booting image archlinux (default) on port 22253
[#488929] 2021/04/18 03:53:22 Waiting for guest to settle
[#488929] 2021/04/18 03:53:29 Sending tasks
[#488929] 2021/04/18 03:53:29 Sending build environment
[#488929] 2021/04/18 03:53:30 Installing packages
Warning: Permanently added '[localhost]:22253' (ECDSA) to the list of known hosts.
core is up to date
downloading extra.db (0)
downloading extra.db (1648277/1648277) 100%
downloading community.db (0)
downloading community.db (1833421/5729359) 32%
downloading community.db (3320269/5729359) 57%
downloading community.db (5159373/5729359) 90%
downloading community.db (5729359/5729359) 100%
Warning: Permanently added '[localhost]:22253' (ECDSA) to the list of known hosts.
nothing to do
Warning: Permanently added '[localhost]:22253' (ECDSA) to the list of known hosts.
resolving dependencies...
warning: openssl-1.1.1.k-1 is up to date -- skipping
looking for conflicting packages...

Packages (12) aspell-0.60.8-2  libidn-1.36-1  libotr-4.1.1-3  loudmouth-1.5.4-1  lua52-5.2.4-5  lua52-expat-1.3.0-5  lua52-filesystem-1.8.0-3  lua52-socket-20200329-1  go-2:1.16.3-1  lua52-sec-2:0.9-2  mcabber-1.1.2-1  prosody-1:0.11.8-1

Total Download Size:   136.34 MiB
Total Installed Size:  605.51 MiB

:: Proceed with installation? [Y/n] 
:: Retrieving packages...
downloading libidn-1.36-1-x86_64.pkg.tar.zst...
downloading loudmouth-1.5.4-1-x86_64.pkg.tar.zst...
downloading libotr-4.1.1-3-x86_64.pkg.tar.zst...
downloading aspell-0.60.8-2-x86_64.pkg.tar.zst...
downloading lua52-5.2.4-5-x86_64.pkg.tar.zst...
downloading go-2:1.16.3-1-x86_64.pkg.tar.zst...
downloading lua52-socket-20200329-1-x86_64.pkg.tar.zst...
downloading lua52-sec-2:0.9-2-x86_64.pkg.tar.zst...
downloading mcabber-1.1.2-1-x86_64.pkg.tar.zst...
downloading lua52-expat-1.3.0-5-x86_64.pkg.tar.zst...
downloading lua52-filesystem-1.8.0-3-x86_64.pkg.tar.zst...
downloading prosody-1:0.11.8-1-x86_64.pkg.tar.zst...
checking keyring...
checking package integrity...
loading package files...
checking for file conflicts...
checking available disk space...
:: Processing package changes...
installing go...
installing lua52-socket...
installing lua52-sec...
installing libidn...
installing loudmouth...
installing libotr...
installing aspell...
Optional dependencies for aspell
    perl: to import old dictionaries [installed]
installing mcabber...
installing lua52...
installing lua52-expat...
installing lua52-filesystem...
installing prosody...
>> Documentation: http://wiki.archlinux.org/index.php/Prosody
>> Probably you need to do 'chown prosody:jabber /var/lib/prosody'
Optional dependencies for prosody
    lua52-sec: TLS encryption support [installed]
    lua52-dbi: SQL storage support
:: Running post-transaction hooks...
(1/5) Creating system user accounts...
Creating group jabber with gid 17.
Creating group prosody with gid 973.
Creating user prosody (Prosody XMPP Server) with uid 973 and gid 973.
(2/5) Reloading system manager configuration...
(3/5) Creating temporary files...
(4/5) Arming ConditionNeedsUpdate...
(5/5) Updating the info directory file...
:: Checking for conflicts...
:: Checking for inner conflicts...
[Repo Make:8]  perl-digest-sha1-2.13-15  perl-authen-sasl-2.16-8  perl-xml-stream-1.24-6  perl-digest-hmac-1.04-1  perl-net-xmpp-1.05-6  perl-net-ssleay-1.88-2  perl-uri-5.09-1  perl-io-socket-ssl-2.070-1
[Aur:1]  sendxmpp-1.24-1

:: Downloaded PKGBUILD (1/1): sendxmpp
  1 sendxmpp                                 (Build Files Exist)
==> Diffs to show?
==> [N]one [A]ll [Ab]ort [I]nstalled [No]tInstalled or (1 2 3, 1-3, ^4)
==> 
:: (1/1) Parsing SRCINFO: sendxmpp
resolving dependencies...
looking for conflicting packages...

Packages (8) perl-authen-sasl-2.16-8  perl-digest-hmac-1.04-1  perl-digest-sha1-2.13-15  perl-io-socket-ssl-2.070-1  perl-net-ssleay-1.88-2  perl-net-xmpp-1.05-6  perl-uri-5.09-1  perl-xml-stream-1.24-6

Total Download Size:   0.68 MiB
Total Installed Size:  2.11 MiB

:: Proceed with installation? [Y/n] 
:: Retrieving packages...
downloading perl-digest-sha1-2.13-15-x86_64.pkg.tar.zst...
downloading perl-digest-hmac-1.04-1-any.pkg.tar.zst...
downloading perl-net-ssleay-1.88-2-x86_64.pkg.tar.zst...
downloading perl-uri-5.09-1-any.pkg.tar.zst...
downloading perl-io-socket-ssl-2.070-1-any.pkg.tar.zst...
downloading perl-authen-sasl-2.16-8-any.pkg.tar.zst...
downloading perl-xml-stream-1.24-6-any.pkg.tar.zst...
downloading perl-net-xmpp-1.05-6-any.pkg.tar.zst...
checking keyring...
checking package integrity...
loading package files...
checking for file conflicts...
checking available disk space...
:: Processing package changes...
installing perl-digest-sha1...
installing perl-authen-sasl...
installing perl-xml-stream...
installing perl-digest-hmac...
installing perl-net-xmpp...
installing perl-net-ssleay...
installing perl-uri...
installing perl-io-socket-ssl...
:: Running post-transaction hooks...
(1/2) Arming ConditionNeedsUpdate...
(2/2) Warn about old perl modules
==> Making package: sendxmpp 1.24-1 (Sun Apr 18 03:54:00 2021)
==> Retrieving sources...
  -> Downloading sendxmpp-1.24.tar.gz...
  % Total    % Received % Xferd  Average Speed   Time    Time     Time  Current
                                 Dload  Upload   Total   Spent    Left  Speed

  0     0    0     0    0     0      0      0 --:--:-- --:--:-- --:--:--     0
100   121  100   121    0     0    746      0 --:--:-- --:--:-- --:--:--   751

100  9657    0  9657    0     0  31558      0 --:--:-- --:--:-- --:--:-- 31558
==> Validating source files with sha256sums...
    sendxmpp-1.24.tar.gz ... Passed
 -> perl-net-xmpp not satisfied, flushing install queue
==> Making package: sendxmpp 1.24-1 (Sun Apr 18 03:54:02 2021)
==> Checking runtime dependencies...
==> Checking buildtime dependencies...
==> Retrieving sources...
  -> Found sendxmpp-1.24.tar.gz
==> Validating source files with sha256sums...
    sendxmpp-1.24.tar.gz ... Passed
==> Removing existing $srcdir/ directory...
==> Extracting sources...
  -> Extracting sendxmpp-1.24.tar.gz with bsdtar
==> Sources are ready.
==> Making package: sendxmpp 1.24-1 (Sun Apr 18 03:54:05 2021)
==> Checking runtime dependencies...
==> Checking buildtime dependencies...
==> WARNING: Using existing $srcdir/ tree
==> Starting build()...
Checking if your kit is complete...
Looks good
Generating a Unix-style Makefile
Writing Makefile for sendxmpp
Writing MYMETA.yml and MYMETA.json
cp sendxmpp blib/script/sendxmpp
"/usr/bin/perl" -MExtUtils::MY -e 'MY->fixin(shift)' -- blib/script/sendxmpp
Manifying 1 pod document
==> Entering fakeroot environment...
==> Starting package()...
Manifying 1 pod document
Installing /home/build/.cache/yay/sendxmpp/pkg/sendxmpp/usr/share/man/man1/sendxmpp.1p
Installing /home/build/.cache/yay/sendxmpp/pkg/sendxmpp/usr/bin/site_perl/sendxmpp
Appending installation info to /home/build/.cache/yay/sendxmpp/pkg/sendxmpp/usr/lib/perl5/5.32/core_perl/perllocal.pod
==> Tidying install...
  -> Removing empty directories...
  -> Removing libtool files...
  -> Purging unwanted files...
  -> Removing static library files...
  -> Stripping unneeded symbols from binaries and libraries...
  -> Compressing man and info pages...
==> Checking for packaging issues...
==> Creating package "sendxmpp"...
  -> Generating .PKGINFO file...
  -> Generating .BUILDINFO file...
  -> Generating .MTREE file...
  -> Compressing package...
==> Leaving fakeroot environment.
==> Finished making: sendxmpp 1.24-1 (Sun Apr 18 03:54:07 2021)
==> Cleaning up...
loading packages...
resolving dependencies...
looking for conflicting packages...

Packages (1) sendxmpp-1.24-1

Total Installed Size:  0.02 MiB

:: Proceed with installation? [Y/n] 
checking keyring...
checking package integrity...
loading package files...
checking for file conflicts...
checking available disk space...
:: Processing package changes...
installing sendxmpp...
:: Running post-transaction hooks...
(1/1) Arming ConditionNeedsUpdate...
[#488929] 2021/04/18 03:54:07 Cloning repositories
Cloning into 'xmpp'...
+ cd xmpp
+ git checkout -q c8c12800dbc5697c7e9b4c25501f54bb5e588ddb
+ cd xmpp
+ git submodule update --init
[#488929] 2021/04/18 03:54:08 Running task setup
[#488929] 2021/04/18 03:54:08 Running task stable
[#488929] 2021/04/18 03:54:47 Build failed.
[#488929] 2021/04/18 03:54:47 The build environment will be kept alive for 10 minutes.
[#488929] 2021/04/18 03:54:47 To log in with SSH and examine it, use the following command:
[#488929] 2021/04/18 03:54:47 
[#488929] 2021/04/18 03:54:47 	ssh -t builds@azusa.runners.sr.ht connect 488929
[#488929] 2021/04/18 03:54:47 
[#488929] 2021/04/18 03:54:47 After logging in, the deadline is increased to your remaining build time.
[#488929] 2021/04/18 04:04:47 Deadline elapsed. Terminating build environment.
[#488929] 2021/04/18 04:04:47 Error: Running task on guest: exit status 1
setup
1
2
3
4
5
6
7
8
9
10
11
12
13
14
15
16
17
18
19
20
21
22
23
24
25
26
27
28
29
30
31
32
33
34
35
36
37
38
39
+ go version
go version go1.16.3 linux/amd64
+ go env
GO111MODULE="on"
GOARCH="amd64"
GOBIN=""
GOCACHE="/home/build/.cache/go-build"
GOENV="/home/build/.config/go/env"
GOEXE=""
GOFLAGS=""
GOHOSTARCH="amd64"
GOHOSTOS="linux"
GOINSECURE=""
GOMODCACHE="/home/build/go/pkg/mod"
GONOPROXY=""
GONOSUMDB=""
GOOS="linux"
GOPATH="/home/build/go"
GOPRIVATE=""
GOPROXY="https://proxy.golang.org,direct"
GOROOT="/usr/lib/go"
GOSUMDB="sum.golang.org"
GOTMPDIR=""
GOTOOLDIR="/usr/lib/go/pkg/tool/linux_amd64"
GOVCS=""
GOVERSION="go1.16.3"
GCCGO="gccgo"
AR="ar"
CC="gcc"
CXX="g++"
CGO_ENABLED="1"
GOMOD="/dev/null"
CGO_CFLAGS="-g -O2"
CGO_CPPFLAGS=""
CGO_CXXFLAGS="-g -O2"
CGO_FFLAGS="-g -O2"
CGO_LDFLAGS="-g -O2"
PKG_CONFIG="pkg-config"
GOGCCFLAGS="-fPIC -m64 -pthread -fmessage-length=0 -fdebug-prefix-map=/tmp/go-build1810738966=/tmp/go-build -gno-record-gcc-switches"
stable
1
2
3
4
5
6
7
8
9
10
11
12
13
14
15
16
17
18
19
20
21
22
23
24
25
26
27
28
29
30
31
32
33
34
35
36
37
38
39
40
41
42
43
44
45
46
47
48
49
50
51
52
53
54
55
56
57
58
59
60
61
62
63
64
65
66
67
68
69
70
71
72
73
74
75
76
77
78
79
80
81
82
83
84
85
86
87
88
89
90
91
92
93
94
95
96
97
98
99
100
101
102
103
104
105
106
107
108
109
110
111
112
113
114
115
116
117
118
119
120
121
122
123
124
125
126
127
128
129
130
131
132
133
134
135
136
137
138
139
140
141
142
143
144
145
146
147
148
149
150
151
152
153
154
155
156
157
158
159
160
161
162
163
164
165
166
167
168
169
170
171
172
173
174
175
176
177
178
179
180
181
182
183
184
185
186
187
188
189
190
191
192
193
194
195
196
197
198
199
200
201
202
203
204
205
206
207
208
209
210
211
212
213
214
215
216
217
218
219
220
221
222
223
224
225
226
227
228
229
230
231
232
233
234
235
236
237
238
239
240
241
242
243
244
245
246
247
248
249
250
251
252
253
254
255
256
257
258
259
260
261
262
263
264
265
266
267
268
269
270
271
272
273
274
275
276
277
278
279
280
281
282
283
284
285
286
287
288
289
290
291
292
293
294
295
296
297
298
299
300
301
302
303
304
305
306
307
308
309
310
311
+ cd xmpp/
+ go test -v -tags integration -run Integration ./...
go: downloading golang.org/x/image v0.0.0-20181116024801-cd38e8056d9b
go: downloading mellium.im/xmlstream v0.15.3-0.20210221202126-7cc1407dad4c
go: downloading mellium.im/sasl v0.2.1
go: downloading golang.org/x/net v0.0.0-20190813141303-74dc4d7220e7
go: downloading golang.org/x/sys v0.0.0-20210110051926-789bb1bd4061
go: downloading golang.org/x/text v0.3.2
go: downloading golang.org/x/crypto v0.0.0-20190701094942-4def268fd1a4
go: downloading mellium.im/reader v0.1.0
=== RUN   TestIntegrationSASLClient
    integration.go:577: starting command: /tmp/go-build4132089804/b001/xmpp.test -mel.serve
    integration.go:577: server: started server in /tmp/xmpp.test177666821
=== RUN   TestIntegrationSASLClient/xmpp.test/0
    integration.go:577: starting command: /usr/bin/mcabber -f /tmp/mcabber279997088/mcabberrc
    integration.go:577: server: decoded config: {ListenC2S:true ListenS2S:false C2SFeatures:[] S2SFeatures:[] LogXML:false}
    integration.go:577: server: error negotiating c2s session: EOF
    integration.go:577: New trace log started.  MCabber version 1.1.2
        ----------------------
    integration.go:577: [2021-04-18 03:54:23] Loaded /tmp/mcabber279997088/mcabberrc.
    integration.go:577: server: loaded TLS certificate for localhost
    integration.go:577: [2021-04-18 03:54:24] Certificate is not trusted!
    integration.go:577: [2021-04-18 03:54:24] Connection established.
        Remote fingerprint: SHA256:049b29cb55b36963a267ae44f918a4d4fef32211f6809e9bd5a59bf703d7ddb2
        [2021-04-18 03:54:24] Your status has been set: [_>o] 
=== RUN   TestIntegrationSASLClient/xmpp.test/0/mcabber/0
    sasl_integration_test.go:46: Connected successfully!
=== CONT  TestIntegrationSASLClient/xmpp.test/0
    integration.go:577: [2021-04-18 03:54:24] Executing FIFO command: quit
    integration.go:577: [2021-04-18 03:54:24] Unloading module fifo.
    integration.go:577: [2021-04-18 03:54:24] Unloaded module fifo.
    integration.go:577: [2021-04-18 03:54:24] Your status has been set: [o>_] 
    integration.go:577: [2021-04-18 03:54:24] Disconnected.
--- PASS: TestIntegrationSASLClient (1.34s)
    --- PASS: TestIntegrationSASLClient/xmpp.test/0 (0.16s)
        --- PASS: TestIntegrationSASLClient/xmpp.test/0/mcabber/0 (0.00s)
    integration.go:577: server: error accepting connection on c2s listener: accept tcp [::]:38453: use of closed network connection
PASS
ok  	mellium.im/xmpp	1.344s
testing: warning: no tests to run
PASS
ok  	mellium.im/xmpp/color	0.001s [no tests to run]
=== RUN   TestIntegrationComponentClient
    integration.go:577: starting command: /usr/bin/prosody --config /tmp/prosody863951299/prosody.cfg.lua
    integration.go:577: startup             info	Hello and welcome to Prosody version 0.11.8
    integration.go:577: startup             info	Prosody is using the select backend for connection handling
    integration.go:577: localhost:tls       info	Certificates loaded
    integration.go:577: portmanager         info	Activated service 'c2s' on [127.0.0.1]:45627, [::1]:45627
    integration.go:577: portmanager         info	Activated service 'legacy_ssl' on no ports
    integration.go:577: portmanager         info	Activated service 'component' on [127.0.0.1]:34453, [::1]:34453
    integration.go:577: component.localhost:tls  info	Certificates loaded
    integration.go:577: c2s55d07c9cf770          info	Client connected
        c2s55d07c9cf770          info	Client disconnected: closed
=== RUN   TestIntegrationComponentClient/prosody/0
    integration.go:577: jcp55d07ca9a520          info	Incoming Jabber component connection
    integration.go:577: component.localhost:component  info	External component successfully authenticated
--- PASS: TestIntegrationComponentClient (2.28s)
    --- PASS: TestIntegrationComponentClient/prosody/0 (0.00s)
    integration.go:577: mod_posix                      warn	Received SIGTERM
        startup                        info	Shutting down: Received SIGTERM
    integration.go:577: jcp55d07ca9a520                info	component disconnected: component.localhost (false)
    integration.go:577: general                        info	Shutting down...
    integration.go:577: general                        info	Shutdown status: Cleaning up
    integration.go:577: general                        info	Shutdown complete
PASS
ok  	mellium.im/xmpp/component	2.287s
?   	mellium.im/xmpp/compress	[no test files]
testing: warning: no tests to run
PASS
ok  	mellium.im/xmpp/delay	0.003s [no tests to run]
=== RUN   TestIntegrationDial
=== RUN   TestIntegrationDial/no-target.badxmpp.eu
=== RUN   TestIntegrationDial/no-address.badxmpp.eu
=== RUN   TestIntegrationDial/no-service.badxmpp.eu
=== RUN   TestIntegrationDial/no-service.badxmpp.eu#01
    integration_test.go:66: wrong type of error: want=*net.OpError, got=*errors.errorString
--- FAIL: TestIntegrationDial (19.05s)
    --- PASS: TestIntegrationDial/no-target.badxmpp.eu (8.70s)
    --- PASS: TestIntegrationDial/no-address.badxmpp.eu (7.34s)
    --- PASS: TestIntegrationDial/no-service.badxmpp.eu (0.01s)
    --- FAIL: TestIntegrationDial/no-service.badxmpp.eu#01 (3.00s)
FAIL
FAIL	mellium.im/xmpp/dial	19.056s
testing: warning: no tests to run
PASS
ok  	mellium.im/xmpp/disco	0.003s [no tests to run]
testing: warning: no tests to run
PASS
ok  	mellium.im/xmpp/form	0.005s [no tests to run]
testing: warning: no tests to run
PASS
ok  	mellium.im/xmpp/forward	0.003s [no tests to run]
testing: warning: no tests to run
PASS
ok  	mellium.im/xmpp/ibr2	0.003s [no tests to run]
?   	mellium.im/xmpp/internal	[no test files]
testing: warning: no tests to run
PASS
ok  	mellium.im/xmpp/internal/attr	0.002s [no tests to run]
testing: warning: no tests to run
PASS
ok  	mellium.im/xmpp/internal/decl	0.006s [no tests to run]
=== RUN   TestIntegrationLookupService
=== RUN   TestIntegrationLookupService/0
=== RUN   TestIntegrationLookupService/1
=== RUN   TestIntegrationLookupService/2
=== RUN   TestIntegrationLookupService/3
=== RUN   TestIntegrationLookupService/4
--- PASS: TestIntegrationLookupService (0.06s)
    --- PASS: TestIntegrationLookupService/0 (0.00s)
    --- PASS: TestIntegrationLookupService/1 (0.01s)
    --- PASS: TestIntegrationLookupService/2 (0.01s)
    --- PASS: TestIntegrationLookupService/3 (0.01s)
    --- PASS: TestIntegrationLookupService/4 (0.02s)
PASS
ok  	mellium.im/xmpp/internal/discover	0.061s
?   	mellium.im/xmpp/internal/integration	[no test files]
?   	mellium.im/xmpp/internal/integration/ejabberd	[no test files]
?   	mellium.im/xmpp/internal/integration/mcabber	[no test files]
?   	mellium.im/xmpp/internal/integration/mellium	[no test files]
?   	mellium.im/xmpp/internal/integration/prosody	[no test files]
?   	mellium.im/xmpp/internal/integration/sendxmpp	[no test files]
testing: warning: no tests to run
PASS
ok  	mellium.im/xmpp/internal/marshal	0.003s [no tests to run]
?   	mellium.im/xmpp/internal/ns	[no test files]
testing: warning: no tests to run
PASS
ok  	mellium.im/xmpp/internal/saslerr	0.004s [no tests to run]
testing: warning: no tests to run
PASS
ok  	mellium.im/xmpp/internal/stream	0.003s [no tests to run]
testing: warning: no tests to run
PASS
ok  	mellium.im/xmpp/internal/xmpptest	0.003s [no tests to run]
testing: warning: no tests to run
PASS
ok  	mellium.im/xmpp/jid	0.003s [no tests to run]
testing: warning: no tests to run
PASS
ok  	mellium.im/xmpp/mux	0.006s [no tests to run]
testing: warning: no tests to run
PASS
ok  	mellium.im/xmpp/oob	0.005s [no tests to run]
testing: warning: no tests to run
PASS
ok  	mellium.im/xmpp/paging	0.003s [no tests to run]
=== RUN   TestIntegrationSendPing
    integration.go:577: starting command: /usr/bin/prosody --config /tmp/prosody766711605/prosody.cfg.lua
    integration.go:577: startup             info	Hello and welcome to Prosody version 0.11.8
    integration.go:577: startup             info	Prosody is using the select backend for connection handling
    integration.go:577: portmanager         info	Activated service 'c2s' on [127.0.0.1]:43591, [::1]:43591
        portmanager         info	Activated service 'legacy_ssl' on no ports
    integration.go:577: localhost:tls       info	Certificates loaded
    integration.go:577: c2s55be5988f760     info	Client connected
    integration.go:577: c2s55be5988f760     info	Client disconnected: closed
=== RUN   TestIntegrationSendPing/prosody/0
    integration.go:577: c2s55be59a000c0     info	Client connected
    integration.go:577: c2s55be59a000c0     info	Stream encrypted (TLSv1.3 with TLS_AES_256_GCM_SHA384)
    integration.go:577: c2s55be59a000c0     info	Authenticated as me@localhost
=== RUN   TestIntegrationSendPing/prosody/1
    integration.go:577: c2s55be59853fe0     info	Client connected
    integration.go:577: c2s55be59853fe0     info	Stream encrypted (TLSv1.3 with TLS_AES_256_GCM_SHA384)
    integration.go:577: c2s55be59853fe0     info	Authenticated as me@localhost
=== RUN   TestIntegrationSendPing/prosody/1/sendxmpp/0
    integration.go:679: exec: "sendxmpp": executable file not found in $PATH
=== CONT  TestIntegrationSendPing/prosody/1
    integration.go:577: starting command: /usr/bin/mcabber -f /tmp/mcabber979450640/mcabberrc
    integration.go:577: New trace log started.  MCabber version 1.1.2
        ----------------------
    integration.go:577: [2021-04-18 03:54:36] Loaded /tmp/mcabber979450640/mcabberrc.
    integration.go:577: c2s55be599b5ec0     info	Client connected
    integration.go:577: [2021-04-18 03:54:36] Certificate is not trusted!
    integration.go:577: c2s55be599b5ec0     info	Stream encrypted (TLSv1.3 with TLS_AES_256_GCM_SHA384)
    integration.go:577: c2s55be599b5ec0     info	Authenticated as me@localhost
=== RUN   TestIntegrationSendPing/prosody/1/mcabber/0
=== CONT  TestIntegrationSendPing/prosody/1
    integration.go:577: [2021-04-18 03:54:36] Connection established.
        Remote fingerprint: SHA256:26f6a426436c480f4ba10ebb1ebd954cb82a63da501df86f781ab0403a49488e
    integration.go:577: [2021-04-18 03:54:36] Your status has been set: [_>o] 
    integration.go:577: [2021-04-18 03:54:36] Executing FIFO command: request ping me@localhost/igmrh--P
    integration.go:577: [2021-04-18 03:54:36] Buddy status has changed: [_>o] <me@localhost/mcabbertest.a9125708> 
    integration.go:577: [2021-04-18 03:54:36] Executing FIFO command: quit
        [2021-04-18 03:54:36] Unloading module fifo.
        [2021-04-18 03:54:36] Unloaded module fifo.
        [2021-04-18 03:54:36] Your status has been set: [o>_] 
    integration.go:577: c2s55be599b5ec0     info	Client disconnected: closed
    integration.go:577: [2021-04-18 03:54:36] Disconnected.
=== RUN   TestIntegrationSendPing/ejabberdctl/0
    integration.go:679: exec: "ejabberdctl": executable file not found in $PATH
--- PASS: TestIntegrationSendPing (2.51s)
    --- PASS: TestIntegrationSendPing/prosody/0 (0.01s)
    --- PASS: TestIntegrationSendPing/prosody/1 (0.15s)
        --- SKIP: TestIntegrationSendPing/prosody/1/sendxmpp/0 (0.00s)
        --- PASS: TestIntegrationSendPing/prosody/1/mcabber/0 (0.00s)
    --- SKIP: TestIntegrationSendPing/ejabberdctl/0 (0.00s)
    integration_test.go:135: error from serve: system-shutdown
    integration.go:577: mod_posix           warn	Received SIGTERM
        startup             info	Shutting down: Received SIGTERM
        c2s55be59853fe0     info	Client disconnected: connection closed
        c2s55be59a000c0     info	Client disconnected: connection closed
        general             info	Shutting down...
        general             info	Shutdown status: Cleaning up
        general             info	Shutdown complete
    integration_test.go:68: error from serve: system-shutdown
PASS
ok  	mellium.im/xmpp/ping	2.540s
testing: warning: no tests to run
PASS
ok  	mellium.im/xmpp/receipts	0.005s [no tests to run]
=== RUN   TestIntegrationRoster
    integration.go:577: starting command: /usr/bin/prosody --config /tmp/prosody643927367/prosody.cfg.lua
    integration.go:577: startup             info	Hello and welcome to Prosody version 0.11.8
    integration.go:577: startup             info	Prosody is using the select backend for connection handling
    integration.go:577: portmanager         info	Activated service 'c2s' on [127.0.0.1]:32945, [::1]:32945
    integration.go:577: portmanager         info	Activated service 'legacy_ssl' on no ports
    integration.go:577: localhost:tls       info	Certificates loaded
    integration.go:577: c2s55aa06f4c110     info	Client connected
    integration.go:577: c2s55aa06f4c110     info	Client disconnected: closed
=== RUN   TestIntegrationRoster/prosody/0
    integration.go:577: c2s55aa06e0ab10     info	Client connected
    integration.go:577: c2s55aa06e0ab10     info	Stream encrypted (TLSv1.3 with TLS_AES_256_GCM_SHA384)
    integration.go:577: c2s55aa06e0ab10     info	Authenticated as me@localhost
=== RUN   TestIntegrationRoster/ejabberdctl/0
    integration.go:679: exec: "ejabberdctl": executable file not found in $PATH
--- PASS: TestIntegrationRoster (2.33s)
    --- PASS: TestIntegrationRoster/prosody/0 (0.02s)
    --- SKIP: TestIntegrationRoster/ejabberdctl/0 (0.00s)
    integration.go:577: mod_posix           warn	Received SIGTERM
        startup             info	Shutting down: Received SIGTERM
    integration_test.go:53: error from serve: system-shutdown
    integration.go:577: c2s55aa06e0ab10     info	Client disconnected: connection closed
    integration.go:577: general             info	Shutting down...
        general             info	Shutdown status: Cleaning up
    integration.go:577: general             info	Shutdown complete
PASS
ok  	mellium.im/xmpp/roster	2.346s
testing: warning: no tests to run
PASS
ok  	mellium.im/xmpp/s2s	0.004s [no tests to run]
testing: warning: no tests to run
PASS
ok  	mellium.im/xmpp/stanza	0.003s [no tests to run]
testing: warning: no tests to run
PASS
ok  	mellium.im/xmpp/stream	0.003s [no tests to run]
testing: warning: no tests to run
PASS
ok  	mellium.im/xmpp/styling	0.003s [no tests to run]
testing: warning: no tests to run
PASS
ok  	mellium.im/xmpp/uri	0.003s [no tests to run]
testing: warning: no tests to run
PASS
ok  	mellium.im/xmpp/version	0.003s [no tests to run]
=== RUN   TestIntegrationDialWebSocket
    integration.go:577: starting command: /usr/bin/prosody --config /tmp/prosody417076807/prosody.cfg.lua
    integration.go:577: startup             info	Hello and welcome to Prosody version 0.11.8
    integration.go:577: startup             info	Prosody is using the select backend for connection handling
    integration.go:577: portmanager         info	Activated service 'c2s' on [127.0.0.1]:46641, [::1]:46641
    integration.go:577: portmanager         info	Activated service 'legacy_ssl' on no ports
    integration.go:577: portmanager         info	Activated service 'http' on [127.0.0.1]:34375, [::1]:34375
    integration.go:577: portmanager         info	Activated service 'https' on [127.0.0.1]:41753, [::1]:41753
    integration.go:577: localhost:tls       info	Certificates loaded
    integration.go:577: c2s56494a350ac0     info	Client connected
    integration.go:577: c2s56494a350ac0     info	Client disconnected: closed
=== RUN   TestIntegrationDialWebSocket/prosody/0
    integration.go:577: c2s56494a357040     info	Client connected
    integration.go:577: c2s56494a357040     info	Authenticated as me@localhost
=== RUN   TestIntegrationDialWebSocket/ejabberdctl/0
    integration.go:679: exec: "ejabberdctl": executable file not found in $PATH
--- PASS: TestIntegrationDialWebSocket (2.90s)
    --- PASS: TestIntegrationDialWebSocket/prosody/0 (0.02s)
    --- SKIP: TestIntegrationDialWebSocket/ejabberdctl/0 (0.00s)
    integration.go:577: mod_posix           warn	Received SIGTERM
        startup             info	Shutting down: Received SIGTERM
    integration_test.go:92: error from serve: system-shutdown
    integration.go:577: c2s56494a357040     info	Client disconnected: connection closed
        general             info	Shutting down...
        general             info	Shutdown status: Cleaning up
    integration.go:577: general             info	Shutdown complete
PASS
ok  	mellium.im/xmpp/websocket	2.918s
testing: warning: no tests to run
PASS
ok  	mellium.im/xmpp/x509	0.003s [no tests to run]
=== RUN   TestIntegrationRequestTime
    integration.go:577: starting command: /usr/bin/prosody --config /tmp/prosody573728787/prosody.cfg.lua
    integration.go:577: startup             info	Hello and welcome to Prosody version 0.11.8
    integration.go:577: startup             info	Prosody is using the select backend for connection handling
    integration.go:577: localhost:tls       info	Certificates loaded
    integration.go:577: portmanager         info	Activated service 'c2s' on [127.0.0.1]:41047, [::1]:41047
        portmanager         info	Activated service 'legacy_ssl' on no ports
    integration.go:577: c2s5584c3da1ed0     info	Client connected
    integration.go:577: c2s5584c3da1ed0     info	Client disconnected: closed
=== RUN   TestIntegrationRequestTime/prosody/0
    integration.go:577: c2s5584c3f382a0     info	Client connected
    integration.go:577: c2s5584c3f382a0     info	Stream encrypted (TLSv1.3 with TLS_AES_256_GCM_SHA384)
    integration.go:577: c2s5584c3f382a0     info	Authenticated as me@localhost
--- PASS: TestIntegrationRequestTime (2.38s)
    --- PASS: TestIntegrationRequestTime/prosody/0 (0.02s)
    integration.go:577: mod_posix           warn	Received SIGTERM
    integration.go:577: startup             info	Shutting down: Received SIGTERM
    integration.go:577: c2s5584c3f382a0     info	Client disconnected: connection closed
    integration_test.go:53: error from serve: system-shutdown
    integration.go:577: general             info	Shutting down...
        general             info	Shutdown status: Cleaning up
    integration.go:577: general             info	Shutdown complete
PASS
ok  	mellium.im/xmpp/xtime	2.388s
FAIL
Build complete: failed 28 days ago (took a minute)