#434429 failed

Build package: v21.03/x86_64/qmltermwidget-0.2.0-r1

Owner
~postmarketos
Created
9 days ago
Updated
9 days ago
Build manifest
view manifest »

Tasks

view log »
bpo_setup view log »
install_pubkey view log »
pmbootstrap_build view log »
checksums view log »
submit view log »
go to bottom »
setup
1
2
3
4
5
6
7
8
9
10
11
12
13
14
15
16
17
18
19
20
21
22
23
24
25
26
27
28
29
30
31
32
33
34
35
36
37
38
39
40
41
42
43
44
45
46
47
48
49
50
51
52
53
54
55
56
57
58
59
60
61
[#434429] 2021/02/22 06:02:16 Booting image alpine/latest (default) on port 22112
[#434429] 2021/02/22 06:02:18 Waiting for guest to settle
[#434429] 2021/02/22 06:02:26 Sending tasks
[#434429] 2021/02/22 06:02:27 Sending build environment
[#434429] 2021/02/22 06:02:27 Sending secrets
[#434429] 2021/02/22 06:02:27 Resolving secret 482975ec-22f7-49fd-9b54-486b0b1947c3
[#434429] 2021/02/22 06:02:27 Installing packages
Warning: Permanently added '[localhost]:22112' (ECDSA) to the list of known hosts.
fetch http://dl-cdn.alpinelinux.org/alpine/v3.13/main/x86_64/APKINDEX.tar.gz
fetch http://dl-cdn.alpinelinux.org/alpine/v3.13/community/x86_64/APKINDEX.tar.gz
v3.13.2-8-g7bb1c88019 [http://dl-cdn.alpinelinux.org/alpine/v3.13/main]
v3.13.2-12-gea23800845 [http://dl-cdn.alpinelinux.org/alpine/v3.13/community]
OK: 13877 distinct packages available
Warning: Permanently added '[localhost]:22112' (ECDSA) to the list of known hosts.
(1/18) Installing skalibs (2.10.0.0-r0)
(2/18) Installing s6-ipcserver (2.10.0.0-r0)
(3/18) Installing utmps (0.1.0.0-r0)
Executing utmps-0.1.0.0-r0.pre-install
(4/18) Installing utmps-openrc (0.1.0.0-r0)
(5/18) Installing coreutils (8.32-r2)
(6/18) Installing libproc (3.3.16-r0)
(7/18) Installing procps (3.3.16-r0)
(8/18) Installing py3-ordered-set (4.0.2-r0)
(9/18) Installing py3-appdirs (1.4.4-r1)
(10/18) Installing py3-parsing (2.4.7-r1)
(11/18) Installing py3-six (1.15.0-r0)
(12/18) Installing py3-packaging (20.9-r0)
(13/18) Installing py3-setuptools (51.3.3-r0)
(14/18) Installing py3-chardet (4.0.0-r0)
(15/18) Installing py3-idna (3.1-r0)
(16/18) Installing py3-urllib3 (1.26.2-r1)
(17/18) Installing py3-requests (2.25.1-r1)
(18/18) Installing xz (5.2.5-r0)
Executing busybox-1.32.1-r3.trigger
OK: 1205 MiB in 224 packages
[#434429] 2021/02/22 06:02:29 Cloning repositories
Cloning into 'pmaports'...
+ cd pmaports
+ git submodule update --init
Cloning into 'pmbootstrap'...
+ cd pmbootstrap
+ git submodule update --init
Cloning into 'build.postmarketos.org'...
+ cd build.postmarketos.org
+ git submodule update --init
[#434429] 2021/02/22 06:02:37 Running task bpo_setup
[#434429] 2021/02/22 06:02:38 Running task install_pubkey
[#434429] 2021/02/22 06:02:39 Running task pmbootstrap_build
[#434429] 2021/02/22 06:03:55 Processing post-failed triggers...
[#434429] 2021/02/22 06:03:56 Sending webhook...
[#434429] 2021/02/22 06:03:59 Webhook response: 200
[#434429] 2021/02/22 06:03:59 done
[#434429] 2021/02/22 06:03:59 Build failed.
[#434429] 2021/02/22 06:03:59 The build environment will be kept alive for 10 minutes.
[#434429] 2021/02/22 06:03:59 To log in with SSH and examine it, use the following command:
[#434429] 2021/02/22 06:03:59 
[#434429] 2021/02/22 06:03:59 	ssh -t builds@azusa.runners.sr.ht connect 434429
[#434429] 2021/02/22 06:03:59 
[#434429] 2021/02/22 06:03:59 After logging in, the deadline is increased to your remaining build time.
[#434429] 2021/02/22 06:13:59 Deadline elapsed. Terminating build environment.
[#434429] 2021/02/22 06:13:59 Error: Running task on guest: exit status 1
bpo_setup
1
2
3
4
5
6
7
8
9
10
11
12
13
14
15
16
+ export BPO_JOB_ID=434429
+ BPO_JOB_ID=434429
+ mkdir -p /home/build/.config
+ echo '[pmbootstrap]'
+ echo 'is_default_channel = False'
+ git -C pmaports checkout v21.03
Branch 'v21.03' set up to track remote branch 'v21.03' from 'origin'.
Switched to a new branch 'v21.03'
+ sudo ln -s /home/build/pmbootstrap/pmbootstrap.py /usr/bin/pmbootstrap
+ yes ''
+ pmbootstrap --aports=/home/build/pmaports -q init
[06:02:37] Work path [/home/build/.local/var/pmbootstrap]: [06:02:37] Channel [stable-next]: [06:02:37] Vendor [qemu]: [06:02:37] Device codename [amd64]: [06:02:37] Kernel [virt]: [06:02:37] Username [user]: [06:02:37] User interface [weston]: [06:02:37] Change them? (y/n) [n]: [06:02:37] Extra packages [none]: [06:02:37] Choose default locale for installation (y/n) [C.UTF-8]: [06:02:37] Device hostname (short form, e.g. 'foo') [qemu-amd64]: [06:02:37] Build outdated packages during 'pmbootstrap install'? (y/n) [y]: + sudo modprobe binfmt_misc
+ sudo mount -t binfmt_misc none /proc/sys/fs/binfmt_misc
++ git -C pmaports rev-parse --abbrev-ref HEAD
+ branch=v21.03
+ '[' v21.03 '!=' v21.03 ']'
install_pubkey
1
2
3
4
5
6
7
8
9
10
11
12
+ export BPO_JOB_ID=434429
+ BPO_JOB_ID=434429
+ echo -n '-----BEGIN PUBLIC KEY-----
MIIBIjANBgkqhkiG9w0BAQEFAAOCAQ8AMIIBCgKCAQEA3xn8DlD4ZJuioKYBqsYH
jY2dEtS9iIQ7Ud06HoxgY7QpiBB8GyXNpqW79vgkuhfayHv5C2eeRSs5fVhx4T5d
Kr+SlqOp5wmo+3MfhL0zfYlKrt0XkjmkMiUwFEn9BcTAf6cDsJ838KCUyAmbCKDS
Pivr5bZf1LDHK7/M//CVixoNJ8+Tj50X0BKbcz6LnyZ+R4Nk4udgymkzjZxoSlWF
/bkduoeNrR5Me83C1YfVLzCT2QTdiw6OEU0EH2IzrgHkIx5bZF2Ezf4a4WQxEGSg
L6L6smQSsDoMqYavpy8EmeOLK/28IS8WVgU18m5upZ1O/26icGp+QkOC/SlKkRu0
iwIDAQAB
-----END PUBLIC KEY-----
'
pmbootstrap_build
1
2
3
4
5
6
7
8
9
10
11
12
13
14
15
16
17
18
19
20
21
22
23
24
25
26
27
28
29
30
31
32
33
34
35
36
37
38
39
40
41
42
43
44
45
46
47
48
49
50
51
52
53
54
55
56
57
58
59
60
61
62
63
64
65
66
67
68
69
70
71
72
73
74
75
76
77
78
79
80
81
82
83
84
85
86
87
88
89
90
91
92
93
94
95
96
97
98
99
100
101
102
103
104
105
106
107
108
109
110
111
112
113
114
115
116
117
118
119
120
121
122
123
124
125
126
127
128
129
130
131
132
133
134
135
136
137
138
139
140
141
142
143
144
145
146
147
148
149
150
151
152
153
154
155
156
157
158
159
160
161
162
163
164
165
166
167
168
169
170
171
172
173
174
175
176
177
178
179
180
181
182
183
184
185
186
187
188
189
190
191
192
193
194
195
196
197
198
199
200
201
202
203
204
205
206
207
208
209
210
211
212
213
214
215
216
217
218
219
220
221
222
223
224
225
226
227
228
229
230
231
232
233
234
235
236
237
238
239
240
241
242
243
244
245
246
247
248
249
250
251
252
253
254
255
256
257
258
259
260
261
262
263
264
265
266
267
268
269
270
271
272
273
274
275
276
277
278
279
280
281
282
283
284
285
286
287
288
289
290
291
292
293
294
295
296
297
298
299
300
301
302
303
304
305
306
307
308
309
310
311
312
313
314
315
316
317
318
319
320
321
322
323
324
325
326
327
328
329
330
331
332
333
334
335
336
337
338
339
340
341
342
343
344
345
346
347
348
349
350
351
352
353
354
355
356
357
358
359
360
361
362
363
364
365
366
367
368
369
370
371
372
373
374
375
376
377
378
379
380
381
382
383
384
385
386
387
388
389
390
391
392
393
394
395
396
397
398
399
400
401
402
403
404
405
406
407
408
409
410
411
412
413
414
415
416
417
418
419
420
421
422
423
424
425
426
427
428
429
430
431
432
433
434
435
436
437
438
439
440
441
442
443
444
445
446
447
448
449
450
451
452
453
454
455
456
457
458
459
460
461
462
463
464
465
466
467
468
469
470
471
472
473
474
475
476
477
478
479
480
481
482
483
484
485
486
487
488
489
490
491
492
493
494
495
496
497
498
499
500
501
502
503
504
505
506
507
508
509
510
511
512
513
514
515
516
517
518
519
520
521
522
523
524
525
526
527
528
529
530
531
532
533
534
535
536
537
538
539
540
541
542
543
544
545
546
547
548
549
550
551
552
553
554
555
556
557
558
559
560
561
562
563
564
565
566
567
568
569
570
571
572
573
574
575
576
577
578
579
580
581
582
583
584
585
586
587
588
589
590
591
592
593
594
595
596
597
598
599
600
601
602
603
604
605
606
607
608
609
610
611
612
613
614
615
616
617
618
619
620
621
622
623
624
625
626
627
628
629
630
631
632
633
634
635
636
637
638
639
640
641
642
643
644
645
646
647
648
649
650
651
652
653
654
655
656
657
658
659
660
661
662
663
664
665
666
667
668
669
670
671
672
673
674
675
676
677
678
679
680
681
682
683
684
685
686
687
688
689
690
691
692
693
694
695
696
697
698
699
700
701
702
703
704
705
706
707
708
709
710
711
712
713
714
715
716
717
718
719
720
721
722
723
724
725
726
727
728
729
730
731
732
733
734
735
736
737
738
739
740
741
742
743
744
745
746
747
748
749
750
751
752
753
754
755
756
757
758
759
760
761
762
763
764
765
766
767
768
769
770
771
772
773
774
775
776
777
778
779
780
781
782
783
784
785
786
787
788
789
790
791
792
793
794
795
796
797
798
799
800
801
802
803
804
805
806
807
808
809
810
811
812
813
814
815
816
817
818
819
820
821
822
823
824
825
826
827
828
829
830
831
832
833
834
835
836
837
838
839
840
841
842
843
844
845
846
847
848
849
850
851
852
853
854
855
856
857
858
859
860
861
862
863
864
865
866
867
868
869
870
871
872
873
874
875
876
877
878
879
880
881
882
883
884
885
886
887
888
889
890
891
892
893
894
895
896
897
898
899
900
901
902
903
904
905
906
907
908
909
910
911
912
913
914
915
916
917
918
919
920
921
922
923
924
925
926
927
928
929
930
931
932
933
934
935
936
937
938
939
940
941
942
943
944
945
946
947
948
949
950
951
952
953
954
955
956
957
958
959
960
961
962
963
964
965
966
967
968
969
970
971
972
973
974
975
976
977
978
979
980
981
982
983
984
985
986
987
988
989
990
991
992
993
994
995
996
997
998
999
1000
1001
1002
1003
1004
1005
1006
1007
1008
1009
1010
1011
1012
1013
1014
1015
1016
1017
1018
1019
1020
1021
1022
1023
+ export BPO_JOB_ID=434429
+ BPO_JOB_ID=434429
+ pmbootstrap -m http://dl-2.alpinelinux.org/alpine/ -mp http://build.postmarketos.org/wip/ -mp http://mirror.postmarketos.org/postmarketos/ --aports=/home/build/pmaports --no-ccache --timeout 900 --details-to-stdout build --no-depends --strict --arch x86_64 --force qmltermwidget
(002259) [06:02:39] % cd /home/build/pmaports; git remote -v
origin	https://gitlab.com/postmarketOS/pmaports.git/ (fetch)
origin	https://gitlab.com/postmarketOS/pmaports.git/ (push)
(002259) [06:02:39] % cd /home/build/pmaports; git show origin/master:channels.cfg
# Reference: https://postmarketos.org/channels.cfg
[channels.cfg]
recommended=edge

[edge]
description=Rolling release channel
branch_pmaports=master
branch_aports=master
mirrordir_alpine=edge

[stable]
description=Stable release channel (first beta v20.05, does not have many devices yet)
branch_pmaports=v20.05
branch_aports=3.12-stable
mirrordir_alpine=v3.12

[stable-next]
description=Upcoming second beta v21.03. DO NOT USE.
branch_pmaports=v21.03
branch_aports=3.13-stable
mirrordir_alpine=v3.13
(002259) [06:02:39] Shutdown complete
(002259) [06:02:39] Calculate work folder size
(002259) [06:02:39] % sudo du --summarize --block-size=1 /home/build/.local/var/pmbootstrap
20480	/home/build/.local/var/pmbootstrap
(002259) [06:02:39] Shutdown complete
(002259) [06:02:39] % sudo du --summarize --block-size=1 /home/build/.local/var/pmbootstrap
20480	/home/build/.local/var/pmbootstrap
(002259) [06:02:39] Cleared up ~0 MB of space
(002259) [06:02:39] APKINDEX outdated (file does not exist yet): http://build.postmarketos.org/wip/v21.03/x86_64/APKINDEX.tar.gz
(002259) [06:02:39] APKINDEX outdated (file does not exist yet): http://mirror.postmarketos.org/postmarketos/v21.03/x86_64/APKINDEX.tar.gz
(002259) [06:02:39] APKINDEX outdated (file does not exist yet): http://dl-2.alpinelinux.org/alpine/v3.13/main/x86_64/APKINDEX.tar.gz
(002259) [06:02:39] APKINDEX outdated (file does not exist yet): http://dl-2.alpinelinux.org/alpine/v3.13/community/x86_64/APKINDEX.tar.gz
(002259) [06:02:39] Update package index for x86_64 (4 file(s))
(002259) [06:02:39] % mkdir -p /home/build/.local/var/pmbootstrap/cache_http
(002259) [06:02:39] Download http://build.postmarketos.org/wip/v21.03/x86_64/APKINDEX.tar.gz
(002259) [06:02:39] % sudo mkdir -p /home/build/.local/var/pmbootstrap/cache_apk_x86_64
(002259) [06:02:39] % sudo cp /home/build/.local/var/pmbootstrap/cache_http/APKINDEX_40c7a24b27dd238be178699a2ca80b05060e56905f6c4ebe6f6ac2ac77a9c4af /home/build/.local/var/pmbootstrap/cache_apk_x86_64/APKINDEX.cf67b0ff.tar.gz
(002259) [06:02:39] Download http://mirror.postmarketos.org/postmarketos/v21.03/x86_64/APKINDEX.tar.gz
(002259) [06:02:39] WARNING: file not found: http://mirror.postmarketos.org/postmarketos/v21.03/x86_64/APKINDEX.tar.gz
(002259) [06:02:39] Download http://dl-2.alpinelinux.org/alpine/v3.13/main/x86_64/APKINDEX.tar.gz
(002259) [06:02:40] % sudo cp /home/build/.local/var/pmbootstrap/cache_http/APKINDEX_b45a26b68f4b8a322cc0d8712fd4769825bff4922e99e09827b6624eb85a7f2f /home/build/.local/var/pmbootstrap/cache_apk_x86_64/APKINDEX.6a9bd0af.tar.gz
(002259) [06:02:40] Download http://dl-2.alpinelinux.org/alpine/v3.13/community/x86_64/APKINDEX.tar.gz
(002259) [06:02:40] % sudo cp /home/build/.local/var/pmbootstrap/cache_http/APKINDEX_dd6cd26cf416edcd1a63f93b53af66614b16490666a245df00cc3f263d39980e /home/build/.local/var/pmbootstrap/cache_apk_x86_64/APKINDEX.d9df3a78.tar.gz
(002259) [06:02:42] Build is necessary for package 'qmltermwidget': No binary package available
(002259) [06:02:42] NOTE: Skipped apk version check for chroot 'native', because it is not installed yet!
(002259) [06:02:42] % sudo mkdir -p /home/build/.local/var/pmbootstrap/chroot_native/dev
(002259) [06:02:42] % sudo mount -t tmpfs -o size=1M,noexec,dev tmpfs /home/build/.local/var/pmbootstrap/chroot_native/dev
(002259) [06:02:42] % sudo mkdir -p /home/build/.local/var/pmbootstrap/chroot_native/dev/pts /home/build/.local/var/pmbootstrap/chroot_native/dev/shm
(002259) [06:02:42] % sudo mount -t tmpfs -o nodev,nosuid,noexec tmpfs /home/build/.local/var/pmbootstrap/chroot_native/dev/shm
(002259) [06:02:42] % sudo mknod -m 666 /home/build/.local/var/pmbootstrap/chroot_native/dev/null c 1 3
(002259) [06:02:42] % sudo mknod -m 666 /home/build/.local/var/pmbootstrap/chroot_native/dev/zero c 1 5
(002259) [06:02:42] % sudo mknod -m 666 /home/build/.local/var/pmbootstrap/chroot_native/dev/full c 1 7
(002259) [06:02:42] % sudo mknod -m 644 /home/build/.local/var/pmbootstrap/chroot_native/dev/random c 1 8
(002259) [06:02:42] % sudo mknod -m 644 /home/build/.local/var/pmbootstrap/chroot_native/dev/urandom c 1 9
(002259) [06:02:42] % sudo mkdir -p /home/build/.local/var/pmbootstrap/chroot_native/proc
(002259) [06:02:42] % sudo mount --bind /proc /home/build/.local/var/pmbootstrap/chroot_native/proc
(002259) [06:02:42] % sudo mkdir -p /home/build/.local/var/pmbootstrap/chroot_native/var/cache/apk
(002259) [06:02:42] % sudo mount --bind /home/build/.local/var/pmbootstrap/cache_apk_x86_64 /home/build/.local/var/pmbootstrap/chroot_native/var/cache/apk
(002259) [06:02:42] % sudo mkdir -p /home/build/.local/var/pmbootstrap/cache_ccache_x86_64
(002259) [06:02:42] % sudo mkdir -p /home/build/.local/var/pmbootstrap/chroot_native/mnt/pmbootstrap-ccache
(002259) [06:02:42] % sudo mount --bind /home/build/.local/var/pmbootstrap/cache_ccache_x86_64 /home/build/.local/var/pmbootstrap/chroot_native/mnt/pmbootstrap-ccache
(002259) [06:02:42] % sudo mkdir -p /home/build/.local/var/pmbootstrap/cache_distfiles
(002259) [06:02:42] % sudo mkdir -p /home/build/.local/var/pmbootstrap/chroot_native/var/cache/distfiles
(002259) [06:02:42] % sudo mount --bind /home/build/.local/var/pmbootstrap/cache_distfiles /home/build/.local/var/pmbootstrap/chroot_native/var/cache/distfiles
(002259) [06:02:42] % sudo mkdir -p /home/build/.local/var/pmbootstrap/chroot_native/mnt/pmbootstrap-git
(002259) [06:02:42] % sudo mount --bind /home/build/.local/var/pmbootstrap/cache_git /home/build/.local/var/pmbootstrap/chroot_native/mnt/pmbootstrap-git
(002259) [06:02:42] % sudo mkdir -p /home/build/.local/var/pmbootstrap/cache_rust
(002259) [06:02:42] % sudo mkdir -p /home/build/.local/var/pmbootstrap/chroot_native/mnt/pmbootstrap-rust
(002259) [06:02:42] % sudo mount --bind /home/build/.local/var/pmbootstrap/cache_rust /home/build/.local/var/pmbootstrap/chroot_native/mnt/pmbootstrap-rust
(002259) [06:02:42] % sudo mkdir -p /home/build/.local/var/pmbootstrap/config_abuild
(002259) [06:02:42] % sudo mkdir -p /home/build/.local/var/pmbootstrap/chroot_native/mnt/pmbootstrap-abuild-config
(002259) [06:02:42] % sudo mount --bind /home/build/.local/var/pmbootstrap/config_abuild /home/build/.local/var/pmbootstrap/chroot_native/mnt/pmbootstrap-abuild-config
(002259) [06:02:42] % sudo mkdir -p /home/build/.local/var/pmbootstrap/config_apk_keys
(002259) [06:02:42] % sudo mkdir -p /home/build/.local/var/pmbootstrap/chroot_native/etc/apk/keys
(002259) [06:02:42] % sudo mount --bind /home/build/.local/var/pmbootstrap/config_apk_keys /home/build/.local/var/pmbootstrap/chroot_native/etc/apk/keys
(002259) [06:02:42] % sudo mkdir -p /home/build/.local/var/pmbootstrap/packages/stable-next
(002259) [06:02:42] % sudo mkdir -p /home/build/.local/var/pmbootstrap/chroot_native/mnt/pmbootstrap-packages
(002259) [06:02:42] % sudo mount --bind /home/build/.local/var/pmbootstrap/packages/stable-next /home/build/.local/var/pmbootstrap/chroot_native/mnt/pmbootstrap-packages
(002259) [06:02:42] Download http://dl-2.alpinelinux.org/alpine/v3.13/main/x86_64/apk-tools-static-2.12.1-r0.apk
(002259) [06:02:43] sigfilename: sbin/apk.static.SIGN.RSA.alpine-devel@lists.alpinelinux.org-4a6a0840.rsa.pub
(002259) [06:02:43] sigkey: alpine-devel@lists.alpinelinux.org-4a6a0840.rsa.pub
(002259) [06:02:43] extracted: /tmp/pmbootstrapnlxhdl94apk
(002259) [06:02:43] extracted: /tmp/pmbootstrapwql85brjsig
(002259) [06:02:43] Verify apk.static signature with /home/build/pmbootstrap/pmb/data/keys/alpine-devel@lists.alpinelinux.org-4a6a0840.rsa.pub
(002259) [06:02:43] % openssl dgst -sha1 -verify /home/build/pmbootstrap/pmb/data/keys/alpine-devel@lists.alpinelinux.org-4a6a0840.rsa.pub -signature /tmp/pmbootstrapwql85brjsig /tmp/pmbootstrapnlxhdl94apk
Verified OK
(002259) [06:02:43] Verify the version reported by the apk.static binary (must match the package version 2.12.1-r0)
(002259) [06:02:43] % /tmp/pmbootstrapnlxhdl94apk --version
apk-tools 2.12.1, compiled for x86_64.
(002259) [06:02:43] (native) install alpine-base
(002259) [06:02:43] % sudo ln -s -f /var/cache/apk /home/build/.local/var/pmbootstrap/chroot_native/etc/apk/cache
(002259) [06:02:43] % sudo cp /home/build/pmbootstrap/pmb/data/keys/alpine-devel@lists.alpinelinux.org-4a6a0840.rsa.pub /home/build/.local/var/pmbootstrap/config_apk_keys/
(002259) [06:02:43] % sudo cp /home/build/pmbootstrap/pmb/data/keys/alpine-devel@lists.alpinelinux.org-58e4f17d.rsa.pub /home/build/.local/var/pmbootstrap/config_apk_keys/
(002259) [06:02:43] % sudo cp /home/build/pmbootstrap/pmb/data/keys/alpine-devel@lists.alpinelinux.org-5243ef4b.rsa.pub /home/build/.local/var/pmbootstrap/config_apk_keys/
(002259) [06:02:43] % sudo cp /home/build/pmbootstrap/pmb/data/keys/alpine-devel@lists.alpinelinux.org-524d27bb.rsa.pub /home/build/.local/var/pmbootstrap/config_apk_keys/
(002259) [06:02:43] % sudo cp /home/build/pmbootstrap/pmb/data/keys/alpine-devel@lists.alpinelinux.org-58cbb476.rsa.pub /home/build/.local/var/pmbootstrap/config_apk_keys/
(002259) [06:02:43] % sudo cp /home/build/pmbootstrap/pmb/data/keys/alpine-devel@lists.alpinelinux.org-58199dcc.rsa.pub /home/build/.local/var/pmbootstrap/config_apk_keys/
(002259) [06:02:43] % sudo cp /home/build/pmbootstrap/pmb/data/keys/wip.rsa.pub /home/build/.local/var/pmbootstrap/config_apk_keys/
(002259) [06:02:43] % sudo cp /home/build/pmbootstrap/pmb/data/keys/build.postmarketos.org.rsa.pub /home/build/.local/var/pmbootstrap/config_apk_keys/
(002259) [06:02:43] % sudo cp /home/build/pmbootstrap/pmb/data/keys/alpine-devel@lists.alpinelinux.org-5261cecb.rsa.pub /home/build/.local/var/pmbootstrap/config_apk_keys/
(002259) [06:02:43] % sudo cp /etc/resolv.conf /home/build/.local/var/pmbootstrap/chroot_native/etc/resolv.conf
(002259) [06:02:43] % sudo mkdir -p /home/build/.local/var/pmbootstrap/chroot_native/etc/apk
(002259) [06:02:43] (native) update /etc/apk/repositories
(002259) [06:02:43] % sudo sh -c echo /mnt/pmbootstrap-packages >> /home/build/.local/var/pmbootstrap/chroot_native/etc/apk/repositories
(002259) [06:02:43] % sudo sh -c echo http://build.postmarketos.org/wip/v21.03 >> /home/build/.local/var/pmbootstrap/chroot_native/etc/apk/repositories
(002259) [06:02:43] % sudo sh -c echo http://mirror.postmarketos.org/postmarketos/v21.03 >> /home/build/.local/var/pmbootstrap/chroot_native/etc/apk/repositories
(002259) [06:02:43] % sudo sh -c echo http://dl-2.alpinelinux.org/alpine/v3.13/main >> /home/build/.local/var/pmbootstrap/chroot_native/etc/apk/repositories
(002259) [06:02:43] % sudo sh -c echo http://dl-2.alpinelinux.org/alpine/v3.13/community >> /home/build/.local/var/pmbootstrap/chroot_native/etc/apk/repositories
(002259) [06:02:43] % sudo mkdir -p /home/build/.local/var/pmbootstrap/tmp
(002259) [06:02:43] % sudo mkfifo /home/build/.local/var/pmbootstrap/tmp/apk_progress_fifo
(002259) [06:02:43] % sudo cat /home/build/.local/var/pmbootstrap/tmp/apk_progress_fifo
(002259) [06:02:43] % sudo sh -c exec 3>/home/build/.local/var/pmbootstrap/tmp/apk_progress_fifo; /home/build/.local/var/pmbootstrap/apk.static --no-progress --progress-fd 3 --root /home/build/.local/var/pmbootstrap/chroot_native --cache-dir /home/build/.local/var/pmbootstrap/cache_apk_x86_64 --initdb --arch x86_64 add alpine-base
(002259) [06:02:43] New background process: pid=2325, output=background
WARNING: Ignoring /mnt/pmbootstrap-packages: No such file or directory
fetch http://mirror.postmarketos.org/postmarketos/v21.03/x86_64/APKINDEX.tar.gz
ERROR: http://mirror.postmarketos.org/postmarketos/v21.03: No such file or directory
WARNING: Ignoring http://mirror.postmarketos.org/postmarketos/v21.03: No such file or directory
(1/20) Installing musl (1.2.2-r0)
(2/20) Installing busybox (1.32.1-r3)
Executing busybox-1.32.1-r3.post-install
(3/20) Installing alpine-baselayout (3.2.0-r8)
Executing alpine-baselayout-3.2.0-r8.pre-install
Executing alpine-baselayout-3.2.0-r8.post-install
(4/20) Installing ifupdown-ng (0.10.2-r2)
(5/20) Installing openrc (0.42.1-r19)
Executing openrc-0.42.1-r19.post-install
(6/20) Installing alpine-conf (3.11.0-r2)
(7/20) Installing libcrypto1.1 (1.1.1j-r0)
(8/20) Installing libssl1.1 (1.1.1j-r0)
(9/20) Installing ca-certificates-bundle (20191127-r5)
(10/20) Installing libtls-standalone (2.9.1-r1)
(11/20) Installing ssl_client (1.32.1-r3)
(12/20) Installing zlib (1.2.11-r3)
(13/20) Installing apk-tools (2.12.1-r0)
(14/20) Installing busybox-suid (1.32.1-r3)
(15/20) Installing busybox-initscripts (3.2-r2)
Executing busybox-initscripts-3.2-r2.post-install
(16/20) Installing scanelf (1.2.8-r0)
(17/20) Installing musl-utils (1.2.2-r0)
(18/20) Installing libc-utils (0.7.2-r3)
(19/20) Installing alpine-keys (2.2-r0)
(20/20) Installing alpine-base (3.13.2-r0)
Executing busybox-1.32.1-r3.trigger
OK: 9 MiB in 20 packages
(002259) [06:02:44] (native) % adduser -D pmos -u 12345
(002259) [06:02:44] (native) % busybox su pmos -c HOME=/home/pmos ln -s /mnt/pmbootstrap-abuild-config /home/pmos/.abuild
(002259) [06:02:44] (native) % chown pmos:pmos /mnt/pmbootstrap-abuild-config
(002259) [06:02:44] (native) % busybox su pmos -c HOME=/home/pmos ln -s /mnt/pmbootstrap-ccache /home/pmos/.ccache
(002259) [06:02:44] (native) % chown pmos:pmos /mnt/pmbootstrap-ccache
(002259) [06:02:44] (native) % busybox su pmos -c HOME=/home/pmos mkdir -p /home/pmos/packages
(002259) [06:02:44] (native) % busybox su pmos -c HOME=/home/pmos ln -s /mnt/pmbootstrap-packages /home/pmos/packages/pmos
(002259) [06:02:44] (native) % chown pmos:pmos /mnt/pmbootstrap-packages
(002259) [06:02:44] (native) % busybox su pmos -c HOME=/home/pmos mkdir -p /home/pmos/.cargo/registry
(002259) [06:02:44] (native) % mkdir -p /mnt/pmbootstrap-rust/registry/index
(002259) [06:02:44] (native) % busybox su pmos -c HOME=/home/pmos ln -s /mnt/pmbootstrap-rust/registry/index /home/pmos/.cargo/registry/index
(002259) [06:02:44] (native) % chown pmos:pmos /mnt/pmbootstrap-rust/registry/index
(002259) [06:02:44] (native) % mkdir -p /mnt/pmbootstrap-rust/registry/cache
(002259) [06:02:44] (native) % busybox su pmos -c HOME=/home/pmos ln -s /mnt/pmbootstrap-rust/registry/cache /home/pmos/.cargo/registry/cache
(002259) [06:02:44] (native) % chown pmos:pmos /mnt/pmbootstrap-rust/registry/cache
(002259) [06:02:44] (native) % busybox su pmos -c HOME=/home/pmos mkdir -p /home/pmos/.cargo/git
(002259) [06:02:44] (native) % mkdir -p /mnt/pmbootstrap-rust/git/db
(002259) [06:02:45] (native) % busybox su pmos -c HOME=/home/pmos ln -s /mnt/pmbootstrap-rust/git/db /home/pmos/.cargo/git/db
(002259) [06:02:45] (native) % chown pmos:pmos /mnt/pmbootstrap-rust/git/db
(002259) [06:02:45] (native) calculate depends of abuild, build-base, ccache, git (pmbootstrap -v for details)
(002259) [06:02:45] (native) install abuild build-base ccache git
(002259) [06:02:45] % sudo mkfifo /home/build/.local/var/pmbootstrap/chroot_native/tmp/apk_progress_fifo
(002259) [06:02:45] (native) % cat /tmp/apk_progress_fifo
(002259) [06:02:45] (native) % sh -c exec 3>/tmp/apk_progress_fifo; apk --no-progress --progress-fd 3 add -u --virtual .pmbootstrap abuild build-base ccache git fakeroot openssl attr tar pkgconf patch lzip curl binutils file gcc g++ make libc-dev fortify-headers libcurl expat pcre2 libattr libacl libgcc libstdc++ ca-certificates libmagic libgomp libatomic libgphobos gmp isl22 mpc1 mpfr4 musl-dev brotli-libs nghttp2-libs
(002259) [06:02:45] New background process: pid=2361, output=background
WARNING: Ignoring /mnt/pmbootstrap-packages: No such file or directory
fetch http://mirror.postmarketos.org/postmarketos/v21.03/x86_64/APKINDEX.tar.gz
ERROR: http://mirror.postmarketos.org/postmarketos/v21.03: No such file or directory
WARNING: Ignoring http://mirror.postmarketos.org/postmarketos/v21.03: No such file or directory
(1/39) Installing fakeroot (1.25.3-r3)
(2/39) Installing openssl (1.1.1j-r0)
(3/39) Installing libattr (2.4.48-r0)
(4/39) Installing attr (2.4.48-r0)
(5/39) Installing libacl (2.2.53-r0)
(6/39) Installing tar (1.33-r1)
(7/39) Installing pkgconf (1.7.3-r0)
(8/39) Installing patch (2.7.6-r6)
(9/39) Installing libgcc (10.2.1_pre1-r3)
(10/39) Installing libstdc++ (10.2.1_pre1-r3)
(11/39) Installing lzip (1.21-r0)
(12/39) Installing ca-certificates (20191127-r5)
(13/39) Installing brotli-libs (1.0.9-r3)
(14/39) Installing nghttp2-libs (1.42.0-r1)
(15/39) Installing libcurl (7.74.0-r0)
(16/39) Installing curl (7.74.0-r0)
(17/39) Installing abuild (3.7.0-r0)
Executing abuild-3.7.0-r0.pre-install
(18/39) Installing binutils (2.35.1-r1)
(19/39) Installing libmagic (5.39-r0)
(20/39) Installing file (5.39-r0)
(21/39) Installing libgomp (10.2.1_pre1-r3)
(22/39) Installing libatomic (10.2.1_pre1-r3)
(23/39) Installing libgphobos (10.2.1_pre1-r3)
(24/39) Installing gmp (6.2.1-r0)
(25/39) Installing isl22 (0.22-r0)
(26/39) Installing mpfr4 (4.1.0-r0)
(27/39) Installing mpc1 (1.2.0-r0)
(28/39) Installing gcc (10.2.1_pre1-r3)
(29/39) Installing musl-dev (1.2.2-r0)
(30/39) Installing libc-dev (0.7.2-r3)
(31/39) Installing g++ (10.2.1_pre1-r3)
(32/39) Installing make (4.3-r0)
(33/39) Installing fortify-headers (1.1-r0)
(34/39) Installing build-base (0.5-r2)
(35/39) Installing ccache (3.7.12-r0)
(36/39) Installing expat (2.2.10-r1)
(37/39) Installing pcre2 (10.36-r0)
(38/39) Installing git (2.30.1-r0)
(39/39) Installing .pmbootstrap (20210222.060245)
Executing busybox-1.32.1-r3.trigger
Executing ca-certificates-20191127-r5.trigger
OK: 213 MiB in 59 packages
(002259) [06:02:55] (native) % apk --no-progress add abuild build-base ccache git
WARNING: Ignoring /mnt/pmbootstrap-packages: No such file or directory
fetch http://mirror.postmarketos.org/postmarketos/v21.03/x86_64/APKINDEX.tar.gz
ERROR: http://mirror.postmarketos.org/postmarketos/v21.03: No such file or directory
WARNING: Ignoring http://mirror.postmarketos.org/postmarketos/v21.03: No such file or directory
OK: 213 MiB in 59 packages
(002259) [06:02:55] (native) % apk --no-progress del .pmbootstrap
WARNING: Ignoring /mnt/pmbootstrap-packages: No such file or directory
WARNING: Ignoring http://mirror.postmarketos.org/postmarketos/v21.03: No such file or directory
(1/1) Purging .pmbootstrap (20210222.060245)
OK: 213 MiB in 58 packages
(002259) [06:02:56] (native) % chown root:abuild /var/cache/distfiles
(002259) [06:02:56] (native) % chmod g+w /var/cache/distfiles
(002259) [06:02:56] (native) generate abuild keys
(002259) [06:02:56] (native) % busybox su pmos -c HOME=/home/pmos abuild-keygen -n -q -a
Generating RSA private key, 2048 bit long modulus (2 primes)
............+++++
....................................................................................+++++
e is 65537 (0x010001)
writing RSA key
(002259) [06:02:56] (native) % cp /mnt/pmbootstrap-abuild-config/pmos-60334910.rsa.pub /etc/apk/keys/
(002259) [06:02:56] (native) % cp /tmp/gzip_wrapper.sh /usr/local/bin/gzip
(002259) [06:02:56] (native) % chmod +x /usr/local/bin/gzip
(002259) [06:02:56] (native) % adduser pmos abuild
(002259) [06:02:56] (native) % sed -i -e s/^CLEANUP=.*/CLEANUP=''/ /etc/abuild.conf
(002259) [06:02:56] (native) % sed -i -e s/^ERROR_CLEANUP=.*/ERROR_CLEANUP=''/ /etc/abuild.conf
(002259) [06:02:56] (native) % touch /var/local/pmbootstrap_chroot_build_init_done
(002259) [06:02:56] (native) % sed -i -e s/^export JOBS=.*/export JOBS=3/ /etc/abuild.conf
(002259) [06:02:56] (native) % busybox su pmos -c HOME=/home/pmos ccache --max-size 5G
Set cache size limit to 5.0 GB
(002259) [06:02:56] (native) build x86_64/qmltermwidget-0.2.0-r1.apk
(002259) [06:02:56] % sudo cp -rL /home/build/pmaports/main/qmltermwidget/ /home/build/.local/var/pmbootstrap/chroot_native/home/pmos/build
(002259) [06:02:56] (native) % chown -R pmos:pmos /home/pmos/build
(002259) [06:02:56] % sudo mkdir -p /home/build/.local/var/pmbootstrap/chroot_native/mnt/pmaports
(002259) [06:02:56] % sudo mount --bind /home/build/pmaports /home/build/.local/var/pmbootstrap/chroot_native/mnt/pmaports
(002259) [06:02:56] (native) % busybox su pmos -c HOME=/home/pmos mkdir -p /home/pmos/build
(002259) [06:02:56] (native) % busybox su pmos -c HOME=/home/pmos ln -sf /mnt/pmaports/.git /home/pmos/build/.git
(002259) [06:02:56] (native) % cd /home/pmos/build; busybox su pmos -c CARCH=x86_64 SUDO_APK='abuild-apk --no-progress' CCACHE_DISABLE=1 HOME=/home/pmos abuild -D postmarketOS -r -f
]0;abuild: qmltermwidget>>> qmltermwidget: Building pmos/qmltermwidget 0.2.0-r1 (using abuild 3.7.0-r0) started Mon, 22 Feb 2021 06:02:56 +0000
>>> qmltermwidget: Checking sanity of /home/pmos/build/APKBUILD...
>>> qmltermwidget: Analyzing dependencies...
>>> qmltermwidget: Installing for build: build-base qt5-qtbase-dev qt5-qtdeclarative-dev
WARNING: Ignoring /home/pmos/packages//pmos: No such file or directory
WARNING: Ignoring /mnt/pmbootstrap-packages: No such file or directory
fetch http://mirror.postmarketos.org/postmarketos/v21.03/x86_64/APKINDEX.tar.gz
ERROR: http://mirror.postmarketos.org/postmarketos/v21.03: No such file or directory
WARNING: Ignoring http://mirror.postmarketos.org/postmarketos/v21.03: No such file or directory
(1/156) Installing dbus-libs (1.12.20-r1)
(2/156) Installing libffi (3.3-r2)
(3/156) Installing libintl (0.20.2-r2)
(4/156) Installing libblkid (2.36.1-r1)
(5/156) Installing libmount (2.36.1-r1)
(6/156) Installing pcre (8.44-r0)
(7/156) Installing glib (2.66.7-r0)
(8/156) Installing icu-libs (67.1-r2)
(9/156) Installing libpcre2-16 (10.36-r0)
(10/156) Installing qt5-qtbase (5.15.2-r0)
(11/156) Installing sqlite-libs (3.34.1-r0)
(12/156) Installing qt5-qtbase-sqlite (5.15.2-r0)
(13/156) Installing ncurses-terminfo-base (6.2_p20210109-r0)
(14/156) Installing ncurses-libs (6.2_p20210109-r0)
(15/156) Installing readline (8.1.0-r0)
(16/156) Installing unixodbc (2.3.9-r1)
(17/156) Installing qt5-qtbase-odbc (5.15.2-r0)
(18/156) Installing gdbm (1.19-r0)
(19/156) Installing libsasl (2.1.27-r10)
(20/156) Installing libldap (2.4.57-r0)
(21/156) Installing libpq (13.1-r2)
(22/156) Installing qt5-qtbase-postgresql (5.15.2-r0)
(23/156) Installing mariadb-connector-c (3.1.11-r0)
(24/156) Installing qt5-qtbase-mysql (5.15.2-r0)
(25/156) Installing freetds (1.2.18-r0)
(26/156) Installing qt5-qtbase-tds (5.15.2-r0)
(27/156) Installing hicolor-icon-theme (0.17-r1)
(28/156) Installing mesa (20.3.3-r0)
(29/156) Installing libxau (1.0.9-r0)
(30/156) Installing libbsd (0.10.0-r0)
(31/156) Installing libxdmcp (1.1.3-r0)
(32/156) Installing libxcb (1.14-r1)
(33/156) Installing libx11 (1.7.0-r0)
(34/156) Installing libpciaccess (0.16-r0)
(35/156) Installing libdrm (2.4.104-r0)
(36/156) Installing wayland-libs-server (1.18.0-r5)
(37/156) Installing mesa-gbm (20.3.3-r0)
(38/156) Installing mesa-glapi (20.3.3-r0)
(39/156) Installing wayland-libs-client (1.18.0-r5)
(40/156) Installing libxdamage (1.1.5-r1)
(41/156) Installing libxext (1.3.4-r0)
(42/156) Installing libxfixes (5.0.3-r2)
(43/156) Installing libxxf86vm (1.1.4-r2)
(44/156) Installing libxshmfence (1.3-r1)
(45/156) Installing mesa-gl (20.3.3-r0)
(46/156) Installing qt5-qtdeclarative (5.15.2-r0)
(47/156) Installing libxcomposite (0.4.5-r0)
(48/156) Installing libbz2 (1.0.8-r1)
(49/156) Installing libpng (1.6.37-r1)
(50/156) Installing freetype (2.10.4-r1)
(51/156) Installing libuuid (2.36.1-r1)
(52/156) Installing fontconfig (2.13.1-r3)
(53/156) Installing wayland-libs-cursor (1.18.0-r5)
(54/156) Installing wayland-libs-egl (1.18.0-r5)
(55/156) Installing xkeyboard-config (2.31-r0)
(56/156) Installing xz-libs (5.2.5-r0)
(57/156) Installing libxml2 (2.9.10-r6)
(58/156) Installing libxkbcommon (1.0.3-r0)
(59/156) Installing qt5-qtwayland (5.15.2-r0)
(60/156) Installing mesa-egl (20.3.3-r0)
(61/156) Installing libice (1.0.10-r0)
(62/156) Installing libsm (1.2.3-r0)
(63/156) Installing avahi-libs (0.8-r2)
(64/156) Installing nettle (3.7-r0)
(65/156) Installing p11-kit (0.23.22-r0)
(66/156) Installing libtasn1 (4.16.0-r1)
(67/156) Installing libunistring (0.9.10-r0)
(68/156) Installing gnutls (3.7.0-r0)
(69/156) Installing cups-libs (2.3.3-r1)
(70/156) Installing graphite2 (1.3.14-r0)
(71/156) Installing harfbuzz (2.7.4-r1)
(72/156) Installing libevdev (1.10.1-r0)
(73/156) Installing mtdev (1.1.6-r0)
(74/156) Installing eudev-libs (3.2.9-r3)
(75/156) Installing libinput-libs (1.16.4-r0)
(76/156) Installing libjpeg-turbo (2.0.6-r0)
(77/156) Installing xcb-util-wm (0.4.1-r1)
(78/156) Installing xcb-util (0.4.0-r3)
(79/156) Installing xcb-util-image (0.4.0-r1)
(80/156) Installing xcb-util-keysyms (0.4.0-r1)
(81/156) Installing xcb-util-renderutil (0.3.9-r1)
(82/156) Installing libxkbcommon-x11 (1.0.3-r0)
(83/156) Installing qt5-qtbase-x11 (5.15.2-r0)
(84/156) Installing qt5-qtbase-dbg (5.15.2-r0)
(85/156) Installing blkid (2.36.1-r1)
(86/156) Installing libcap-ng (0.8.2-r0)
(87/156) Installing setpriv (2.36.1-r1)
(88/156) Installing libsmartcols (2.36.1-r1)
(89/156) Installing findmnt (2.36.1-r1)
(90/156) Installing mcookie (2.36.1-r1)
(91/156) Installing hexdump (2.36.1-r1)
(92/156) Installing lsblk (2.36.1-r1)
(93/156) Installing libfdisk (2.36.1-r1)
(94/156) Installing sfdisk (2.36.1-r1)
(95/156) Installing cfdisk (2.36.1-r1)
(96/156) Installing partx (2.36.1-r1)
(97/156) Installing libeconf (0.3.8-r0)
(98/156) Installing util-linux (2.36.1-r1)
(99/156) Installing util-linux-dev (2.36.1-r1)
(100/156) Installing dbus-dev (1.12.20-r1)
(101/156) Installing expat-dev (2.2.10-r1)
(102/156) Installing brotli-dev (1.0.9-r3)
(103/156) Installing zlib-dev (1.2.11-r3)
(104/156) Installing libpng-dev (1.6.37-r1)
(105/156) Installing freetype-dev (2.10.4-r1)
(106/156) Installing fontconfig-dev (2.13.1-r3)
(107/156) Installing python3 (3.8.7-r1)
(108/156) Installing gettext-asprintf (0.20.2-r2)
(109/156) Installing gettext-libs (0.20.2-r2)
(110/156) Installing gettext (0.20.2-r2)
(111/156) Installing gettext-dev (0.20.2-r2)
(112/156) Installing bzip2-dev (1.0.8-r1)
(113/156) Installing libxml2-utils (2.9.10-r6)
(114/156) Installing libgpg-error (1.41-r0)
(115/156) Installing libgcrypt (1.8.7-r0)
(116/156) Installing libxslt (1.1.34-r0)
(117/156) Installing docbook-xml (4.5-r6)
Executing docbook-xml-4.5-r6.post-install
(118/156) Installing docbook-xsl (1.79.2-r2)
Executing docbook-xsl-1.79.2-r2.post-install
(119/156) Installing linux-headers (5.7.8-r0)
(120/156) Installing libffi-dev (3.3-r2)
(121/156) Installing libpcre16 (8.44-r0)
(122/156) Installing libpcre32 (8.44-r0)
(123/156) Installing libpcrecpp (8.44-r0)
(124/156) Installing pcre-dev (8.44-r0)
(125/156) Installing glib-dev (2.66.7-r0)
(126/156) Installing xorgproto (2020.1-r0)
(127/156) Installing libice-dev (1.0.10-r0)
(128/156) Installing libsm-dev (1.2.3-r0)
(129/156) Installing libxau-dev (1.0.9-r0)
(130/156) Installing xcb-proto (1.14.1-r0)
(131/156) Installing libxdmcp-dev (1.1.3-r0)
(132/156) Installing libxcb-dev (1.14-r1)
(133/156) Installing xtrans (1.4.0-r1)
(134/156) Installing libx11-dev (1.7.0-r0)
(135/156) Installing libxext-dev (1.3.4-r0)
(136/156) Installing libdrm-dev (2.4.104-r0)
(137/156) Installing libxfixes-dev (5.0.3-r2)
(138/156) Installing libxdamage-dev (1.1.5-r1)
(139/156) Installing libxshmfence-dev (1.3-r1)
(140/156) Installing mesa-gles (20.3.3-r0)
(141/156) Installing llvm10-libs (10.0.1-r1)
(142/156) Installing zstd-libs (1.4.5-r3)
(143/156) Installing mesa-osmesa (20.3.3-r0)
(144/156) Installing mesa-xatracker (20.3.3-r0)
(145/156) Installing libxxf86vm-dev (1.1.4-r2)
(146/156) Installing mesa-dev (20.3.3-r0)
(147/156) Installing openssl-dev (1.1.1j-r0)
(148/156) Installing perl (5.32.0-r0)
(149/156) Installing sqlite-dev (3.34.1-r0)
(150/156) Installing qt5-qtbase-dev (5.15.2-r0)
(151/156) Installing qt5-qtdeclarative-dev (5.15.2-r0)
(152/156) Installing .makedepends-qmltermwidget (20210222.060257)
(153/156) Installing util-linux-openrc (2.36.1-r1)
(154/156) Installing perl-error (0.17029-r1)
(155/156) Installing perl-git (2.30.1-r0)
(156/156) Installing git-perl (2.30.1-r0)
Executing busybox-1.32.1-r3.trigger
Executing glib-2.66.7-r0.trigger
No schema files found: doing nothing.
OK: 748 MiB in 214 packages
]0;>>> qmltermwidget: Cleaning up srcdir
]0;>>> qmltermwidget: Cleaning up pkgdir
>>> qmltermwidget: Fetching qmltermwidget-0.2.0.tar.gz::https://github.com/swordfish90/qmltermwidget/archive/0.2.0.tar.gz
  % Total    % Received % Xferd  Average Speed   Time    Time     Time  Current
                                 Dload  Upload   Total   Spent    Left  Speed

  0     0    0     0    0     0      0      0 --:--:-- --:--:-- --:--:--     0
100   132  100   132    0     0    660      0 --:--:-- --:--:-- --:--:--   660

100  214k    0  214k    0     0   562k      0 --:--:-- --:--:-- --:--:--  562k
>>> qmltermwidget: Fetching qmltermwidget-0.2.0.tar.gz::https://github.com/swordfish90/qmltermwidget/archive/0.2.0.tar.gz
>>> qmltermwidget: Checking sha512sums...
qmltermwidget-0.2.0.tar.gz: OK
>>> qmltermwidget: Unpacking /var/cache/distfiles/qmltermwidget-0.2.0.tar.gz...
Info: creating stash file /home/pmos/build/src/qmltermwidget-0.2.0/.qmake.stash
g++ -c -pipe -Os -fomit-frame-pointer -g -D_REENTRANT -Wall -Wextra -fPIC -DHAVE_POSIX_OPENPT -DHAVE_SYS_TIME_H -DQT_NO_DEBUG -DQT_PLUGIN -DQT_QUICK_LIB -DQT_WIDGETS_LIB -DQT_GUI_LIB -DQT_QMLMODELS_LIB -DQT_QML_LIB -DQT_NETWORK_LIB -DQT_CORE_LIB -I. -Ilib -Isrc -I/usr/include/QtQuick -I/usr/include/QtWidgets -I/usr/include/QtGui -I/usr/include/QtQmlModels -I/usr/include/QtQml -I/usr/include/QtNetwork -I/usr/include/QtCore -I. -I/usr/include/libdrm -I/usr/lib/qt5/mkspecs/linux-g++ -o BlockArray.o lib/BlockArray.cpp
g++ -c -pipe -Os -fomit-frame-pointer -g -D_REENTRANT -Wall -Wextra -fPIC -DHAVE_POSIX_OPENPT -DHAVE_SYS_TIME_H -DQT_NO_DEBUG -DQT_PLUGIN -DQT_QUICK_LIB -DQT_WIDGETS_LIB -DQT_GUI_LIB -DQT_QMLMODELS_LIB -DQT_QML_LIB -DQT_NETWORK_LIB -DQT_CORE_LIB -I. -Ilib -Isrc -I/usr/include/QtQuick -I/usr/include/QtWidgets -I/usr/include/QtGui -I/usr/include/QtQmlModels -I/usr/include/QtQml -I/usr/include/QtNetwork -I/usr/include/QtCore -I. -I/usr/include/libdrm -I/usr/lib/qt5/mkspecs/linux-g++ -o ColorScheme.o lib/ColorScheme.cpp
g++ -c -pipe -Os -fomit-frame-pointer -g -D_REENTRANT -Wall -Wextra -fPIC -DHAVE_POSIX_OPENPT -DHAVE_SYS_TIME_H -DQT_NO_DEBUG -DQT_PLUGIN -DQT_QUICK_LIB -DQT_WIDGETS_LIB -DQT_GUI_LIB -DQT_QMLMODELS_LIB -DQT_QML_LIB -DQT_NETWORK_LIB -DQT_CORE_LIB -I. -Ilib -Isrc -I/usr/include/QtQuick -I/usr/include/QtWidgets -I/usr/include/QtGui -I/usr/include/QtQmlModels -I/usr/include/QtQml -I/usr/include/QtNetwork -I/usr/include/QtCore -I. -I/usr/include/libdrm -I/usr/lib/qt5/mkspecs/linux-g++ -o Emulation.o lib/Emulation.cpp
g++ -c -pipe -Os -fomit-frame-pointer -g -D_REENTRANT -Wall -Wextra -fPIC -DHAVE_POSIX_OPENPT -DHAVE_SYS_TIME_H -DQT_NO_DEBUG -DQT_PLUGIN -DQT_QUICK_LIB -DQT_WIDGETS_LIB -DQT_GUI_LIB -DQT_QMLMODELS_LIB -DQT_QML_LIB -DQT_NETWORK_LIB -DQT_CORE_LIB -I. -Ilib -Isrc -I/usr/include/QtQuick -I/usr/include/QtWidgets -I/usr/include/QtGui -I/usr/include/QtQmlModels -I/usr/include/QtQml -I/usr/include/QtNetwork -I/usr/include/QtCore -I. -I/usr/include/libdrm -I/usr/lib/qt5/mkspecs/linux-g++ -o Filter.o lib/Filter.cpp
lib/ColorScheme.cpp: In member function 'Konsole::ColorEntry Konsole::ColorScheme::colorEntry(int, uint) const':
lib/ColorScheme.cpp:183:26: warning: 'void qsrand(uint)' is deprecated: use QRandomGenerator instead [-Wdeprecated-declarations]
  183 |         qsrand(randomSeed);
      |                          ^
In file included from /usr/include/QtCore/qchar.h:43,
                 from /usr/include/QtCore/qhash.h:44,
                 from /usr/include/QtCore/QHash:1,
                 from lib/ColorScheme.h:26,
                 from lib/ColorScheme.cpp:23:
/usr/include/QtCore/qglobal.h:1278:81: note: declared here
 1278 | Q_CORE_EXPORT QT_DEPRECATED_VERSION_X_5_15("use QRandomGenerator instead") void qsrand(uint seed);
      |                                                                                 ^~~~~~
lib/ColorScheme.cpp:185:42: warning: implicitly-declared 'constexpr Konsole::ColorEntry::ColorEntry(const Konsole::ColorEntry&)' is deprecated [-Wdeprecated-copy]
  185 |     ColorEntry entry = colorTable()[index];
      |                                          ^
In file included from lib/ColorScheme.h:34,
                 from lib/ColorScheme.cpp:23:
lib/CharacterColor.h:84:8: note: because 'Konsole::ColorEntry' has user-provided 'void Konsole::ColorEntry::operator=(const Konsole::ColorEntry&)'
   84 |   void operator=(const ColorEntry& rhs)
      |        ^~~~~~~~
lib/ColorScheme.cpp:194:48: warning: 'int qrand()' is deprecated: use QRandomGenerator instead [-Wdeprecated-declarations]
  194 |         int hueDifference = range.hue ? (qrand() % range.hue) - range.hue/2 : 0;
      |                                                ^
In file included from /usr/include/QtCore/qchar.h:43,
                 from /usr/include/QtCore/qhash.h:44,
                 from /usr/include/QtCore/QHash:1,
                 from lib/ColorScheme.h:26,
                 from lib/ColorScheme.cpp:23:
/usr/include/QtCore/qglobal.h:1279:80: note: declared here
 1279 | Q_CORE_EXPORT QT_DEPRECATED_VERSION_X_5_15("use QRandomGenerator instead") int qrand();
      |                                                                                ^~~~~
lib/ColorScheme.cpp:195:62: warning: 'int qrand()' is deprecated: use QRandomGenerator instead [-Wdeprecated-declarations]
  195 |         int saturationDifference = range.saturation ? (qrand() % range.saturation) - range.saturation/2 : 0;
      |                                                              ^
In file included from /usr/include/QtCore/qchar.h:43,
                 from /usr/include/QtCore/qhash.h:44,
                 from /usr/include/QtCore/QHash:1,
                 from lib/ColorScheme.h:26,
                 from lib/ColorScheme.cpp:23:
/usr/include/QtCore/qglobal.h:1279:80: note: declared here
 1279 | Q_CORE_EXPORT QT_DEPRECATED_VERSION_X_5_15("use QRandomGenerator instead") int qrand();
      |                                                                                ^~~~~
lib/ColorScheme.cpp:196:53: warning: 'int qrand()' is deprecated: use QRandomGenerator instead [-Wdeprecated-declarations]
  196 |         int  valueDifference = range.value ? (qrand() % range.value) - range.value/2 : 0;
      |                                                     ^
In file included from /usr/include/QtCore/qchar.h:43,
                 from /usr/include/QtCore/qhash.h:44,
                 from /usr/include/QtCore/QHash:1,
                 from lib/ColorScheme.h:26,
                 from lib/ColorScheme.cpp:23:
/usr/include/QtCore/qglobal.h:1279:80: note: declared here
 1279 | Q_CORE_EXPORT QT_DEPRECATED_VERSION_X_5_15("use QRandomGenerator instead") int qrand();
      |                                                                                ^~~~~
lib/ColorScheme.cpp:207:12: warning: implicitly-declared 'constexpr Konsole::ColorEntry::ColorEntry(const Konsole::ColorEntry&)' is deprecated [-Wdeprecated-copy]
  207 |     return entry;
      |            ^~~~~
In file included from lib/ColorScheme.h:34,
                 from lib/ColorScheme.cpp:23:
lib/CharacterColor.h:84:8: note: because 'Konsole::ColorEntry' has user-provided 'void Konsole::ColorEntry::operator=(const Konsole::ColorEntry&)'
   84 |   void operator=(const ColorEntry& rhs)
      |        ^~~~~~~~
g++ -c -pipe -Os -fomit-frame-pointer -g -D_REENTRANT -Wall -Wextra -fPIC -DHAVE_POSIX_OPENPT -DHAVE_SYS_TIME_H -DQT_NO_DEBUG -DQT_PLUGIN -DQT_QUICK_LIB -DQT_WIDGETS_LIB -DQT_GUI_LIB -DQT_QMLMODELS_LIB -DQT_QML_LIB -DQT_NETWORK_LIB -DQT_CORE_LIB -I. -Ilib -Isrc -I/usr/include/QtQuick -I/usr/include/QtWidgets -I/usr/include/QtGui -I/usr/include/QtQmlModels -I/usr/include/QtQml -I/usr/include/QtNetwork -I/usr/include/QtCore -I. -I/usr/include/libdrm -I/usr/lib/qt5/mkspecs/linux-g++ -o History.o lib/History.cpp
g++ -c -pipe -Os -fomit-frame-pointer -g -D_REENTRANT -Wall -Wextra -fPIC -DHAVE_POSIX_OPENPT -DHAVE_SYS_TIME_H -DQT_NO_DEBUG -DQT_PLUGIN -DQT_QUICK_LIB -DQT_WIDGETS_LIB -DQT_GUI_LIB -DQT_QMLMODELS_LIB -DQT_QML_LIB -DQT_NETWORK_LIB -DQT_CORE_LIB -I. -Ilib -Isrc -I/usr/include/QtQuick -I/usr/include/QtWidgets -I/usr/include/QtGui -I/usr/include/QtQmlModels -I/usr/include/QtQml -I/usr/include/QtNetwork -I/usr/include/QtCore -I. -I/usr/include/libdrm -I/usr/lib/qt5/mkspecs/linux-g++ -o HistorySearch.o lib/HistorySearch.cpp
lib/History.cpp: In member function 'virtual void Konsole::HistoryScrollBuffer::addCells(const Konsole::Character*, int)':
lib/History.cpp:316:34: warning: 'OutputIterator qCopy(InputIterator, InputIterator, OutputIterator) [with InputIterator = const Konsole::Character*; OutputIterator = Konsole::Character*]' is deprecated: Use std::copy [-Wdeprecated-declarations]
  316 |   qCopy(a,a+count,newLine.begin());
      |                                  ^
In file included from /usr/include/QtCore/qlist.h:43,
                 from /usr/include/QtCore/qhash.h:46,
                 from /usr/include/QtCore/QHash:1,
                 from lib/History.h:26,
                 from lib/History.cpp:22:
/usr/include/QtCore/qalgorithms.h:82:56: note: declared here
   82 | QT_DEPRECATED_X("Use std::copy") inline OutputIterator qCopy(InputIterator begin, InputIterator end, OutputIterator dest)
      |                                                        ^~~~~
lib/History.cpp: In member function 'virtual void Konsole::CompactHistoryScroll::addCells(const Konsole::Character*, int)':
lib/History.cpp:732:37: warning: 'OutputIterator qCopy(InputIterator, InputIterator, OutputIterator) [with InputIterator = const Konsole::Character*; OutputIterator = Konsole::Character*]' is deprecated: Use std::copy [-Wdeprecated-declarations]
  732 |   qCopy ( a,a+count,newLine.begin() );
      |                                     ^
In file included from /usr/include/QtCore/qlist.h:43,
                 from /usr/include/QtCore/qhash.h:46,
                 from /usr/include/QtCore/QHash:1,
                 from lib/History.h:26,
                 from lib/History.cpp:22:
/usr/include/QtCore/qalgorithms.h:82:56: note: declared here
   82 | QT_DEPRECATED_X("Use std::copy") inline OutputIterator qCopy(InputIterator begin, InputIterator end, OutputIterator dest)
      |                                                        ^~~~~
g++ -c -pipe -Os -fomit-frame-pointer -g -D_REENTRANT -Wall -Wextra -fPIC -DHAVE_POSIX_OPENPT -DHAVE_SYS_TIME_H -DQT_NO_DEBUG -DQT_PLUGIN -DQT_QUICK_LIB -DQT_WIDGETS_LIB -DQT_GUI_LIB -DQT_QMLMODELS_LIB -DQT_QML_LIB -DQT_NETWORK_LIB -DQT_CORE_LIB -I. -Ilib -Isrc -I/usr/include/QtQuick -I/usr/include/QtWidgets -I/usr/include/QtGui -I/usr/include/QtQmlModels -I/usr/include/QtQml -I/usr/include/QtNetwork -I/usr/include/QtCore -I. -I/usr/include/libdrm -I/usr/lib/qt5/mkspecs/linux-g++ -o KeyboardTranslator.o lib/KeyboardTranslator.cpp
g++ -c -pipe -Os -fomit-frame-pointer -g -D_REENTRANT -Wall -Wextra -fPIC -DHAVE_POSIX_OPENPT -DHAVE_SYS_TIME_H -DQT_NO_DEBUG -DQT_PLUGIN -DQT_QUICK_LIB -DQT_WIDGETS_LIB -DQT_GUI_LIB -DQT_QMLMODELS_LIB -DQT_QML_LIB -DQT_NETWORK_LIB -DQT_CORE_LIB -I. -Ilib -Isrc -I/usr/include/QtQuick -I/usr/include/QtWidgets -I/usr/include/QtGui -I/usr/include/QtQmlModels -I/usr/include/QtQml -I/usr/include/QtNetwork -I/usr/include/QtCore -I. -I/usr/include/libdrm -I/usr/lib/qt5/mkspecs/linux-g++ -o konsole_wcwidth.o lib/konsole_wcwidth.cpp
g++ -c -pipe -Os -fomit-frame-pointer -g -D_REENTRANT -Wall -Wextra -fPIC -DHAVE_POSIX_OPENPT -DHAVE_SYS_TIME_H -DQT_NO_DEBUG -DQT_PLUGIN -DQT_QUICK_LIB -DQT_WIDGETS_LIB -DQT_GUI_LIB -DQT_QMLMODELS_LIB -DQT_QML_LIB -DQT_NETWORK_LIB -DQT_CORE_LIB -I. -Ilib -Isrc -I/usr/include/QtQuick -I/usr/include/QtWidgets -I/usr/include/QtGui -I/usr/include/QtQmlModels -I/usr/include/QtQml -I/usr/include/QtNetwork -I/usr/include/QtCore -I. -I/usr/include/libdrm -I/usr/lib/qt5/mkspecs/linux-g++ -o kprocess.o lib/kprocess.cpp
g++ -c -pipe -Os -fomit-frame-pointer -g -D_REENTRANT -Wall -Wextra -fPIC -DHAVE_POSIX_OPENPT -DHAVE_SYS_TIME_H -DQT_NO_DEBUG -DQT_PLUGIN -DQT_QUICK_LIB -DQT_WIDGETS_LIB -DQT_GUI_LIB -DQT_QMLMODELS_LIB -DQT_QML_LIB -DQT_NETWORK_LIB -DQT_CORE_LIB -I. -Ilib -Isrc -I/usr/include/QtQuick -I/usr/include/QtWidgets -I/usr/include/QtGui -I/usr/include/QtQmlModels -I/usr/include/QtQml -I/usr/include/QtNetwork -I/usr/include/QtCore -I. -I/usr/include/libdrm -I/usr/lib/qt5/mkspecs/linux-g++ -o kpty.o lib/kpty.cpp
lib/kprocess.cpp: In member function 'int KProcess::pid() const':
lib/kprocess.cpp:407:28: warning: 'Q_PID QProcess::pid() const' is deprecated: Use processId() instead [-Wdeprecated-declarations]
  407 |     return (int) QProcess::pid();
      |                            ^~~
In file included from /usr/include/QtCore/QProcess:1,
                 from lib/kprocess.h:35,
                 from lib/kprocess.cpp:30:
/usr/include/QtCore/qprocess.h:237:11: note: declared here
  237 |     Q_PID pid() const;
      |           ^~~
lib/kprocess.cpp:407:32: warning: 'Q_PID QProcess::pid() const' is deprecated: Use processId() instead [-Wdeprecated-declarations]
  407 |     return (int) QProcess::pid();
      |                                ^
In file included from /usr/include/QtCore/QProcess:1,
                 from lib/kprocess.h:35,
                 from lib/kprocess.cpp:30:
/usr/include/QtCore/qprocess.h:237:11: note: declared here
  237 |     Q_PID pid() const;
      |           ^~~
g++ -c -pipe -Os -fomit-frame-pointer -g -D_REENTRANT -Wall -Wextra -fPIC -DHAVE_POSIX_OPENPT -DHAVE_SYS_TIME_H -DQT_NO_DEBUG -DQT_PLUGIN -DQT_QUICK_LIB -DQT_WIDGETS_LIB -DQT_GUI_LIB -DQT_QMLMODELS_LIB -DQT_QML_LIB -DQT_NETWORK_LIB -DQT_CORE_LIB -I. -Ilib -Isrc -I/usr/include/QtQuick -I/usr/include/QtWidgets -I/usr/include/QtGui -I/usr/include/QtQmlModels -I/usr/include/QtQml -I/usr/include/QtNetwork -I/usr/include/QtCore -I. -I/usr/include/libdrm -I/usr/lib/qt5/mkspecs/linux-g++ -o kptydevice.o lib/kptydevice.cpp
lib/kpty.cpp: In member function 'bool KPty::open()':
lib/kpty.cpp:282:65: warning: 'QString& QString::sprintf(const char*, ...)' is deprecated: Use asprintf(), arg() or QTextStream instead [-Wdeprecated-declarations]
  282 |             ptyName = QString().sprintf("/dev/pty%c%c", *s3, *s4).toUtf8();
      |                                                                 ^
In file included from /usr/include/QtCore/qobject.h:47,
                 from /usr/include/QtCore/QObject:1,
                 from lib/kpty.h:26,
                 from lib/kpty_p.h:26,
                 from lib/kpty.cpp:25:
/usr/include/QtCore/qstring.h:393:14: note: declared here
  393 |     QString &sprintf(const char *format, ...) Q_ATTRIBUTE_FORMAT_PRINTF(2, 3);
      |              ^~~~~~~
lib/kpty.cpp:283:68: warning: 'QString& QString::sprintf(const char*, ...)' is deprecated: Use asprintf(), arg() or QTextStream instead [-Wdeprecated-declarations]
  283 |             d->ttyName = QString().sprintf("/dev/tty%c%c", *s3, *s4).toUtf8();
      |                                                                    ^
In file included from /usr/include/QtCore/qobject.h:47,
                 from /usr/include/QtCore/QObject:1,
                 from lib/kpty.h:26,
                 from lib/kpty_p.h:26,
                 from lib/kpty.cpp:25:
/usr/include/QtCore/qstring.h:393:14: note: declared here
  393 |     QString &sprintf(const char *format, ...) Q_ATTRIBUTE_FORMAT_PRINTF(2, 3);
      |              ^~~~~~~
lib/kpty.cpp:334:69: warning: 'QTextStream& QTextStreamFunctions::endl(QTextStream&)' is deprecated: Use Qt::endl [-Wdeprecated-declarations]
  334 |         << "\nThis means the communication can be eavesdropped." << endl;
      |                                                                     ^~~~
In file included from /usr/include/QtCore/qdebug.h:49,
                 from /usr/include/QtCore/QtDebug:1,
                 from lib/kpty.cpp:27:
/usr/include/QtCore/qtextstream.h:293:75: note: declared here
  293 | Q_CORE_EXPORT QT_DEPRECATED_VERSION_X(5, 15, "Use Qt::endl") QTextStream &endl(QTextStream &s);
      |                                                                           ^~~~
lib/kpty.cpp:334:69: warning: 'QTextStream& QTextStreamFunctions::endl(QTextStream&)' is deprecated: Use Qt::endl [-Wdeprecated-declarations]
  334 |         << "\nThis means the communication can be eavesdropped." << endl;
      |                                                                     ^~~~
In file included from /usr/include/QtCore/qdebug.h:49,
                 from /usr/include/QtCore/QtDebug:1,
                 from lib/kpty.cpp:27:
/usr/include/QtCore/qtextstream.h:293:75: note: declared here
  293 | Q_CORE_EXPORT QT_DEPRECATED_VERSION_X(5, 15, "Use Qt::endl") QTextStream &endl(QTextStream &s);
      |                                                                           ^~~~
g++ -c -pipe -Os -fomit-frame-pointer -g -D_REENTRANT -Wall -Wextra -fPIC -DHAVE_POSIX_OPENPT -DHAVE_SYS_TIME_H -DQT_NO_DEBUG -DQT_PLUGIN -DQT_QUICK_LIB -DQT_WIDGETS_LIB -DQT_GUI_LIB -DQT_QMLMODELS_LIB -DQT_QML_LIB -DQT_NETWORK_LIB -DQT_CORE_LIB -I. -Ilib -Isrc -I/usr/include/QtQuick -I/usr/include/QtWidgets -I/usr/include/QtGui -I/usr/include/QtQmlModels -I/usr/include/QtQml -I/usr/include/QtNetwork -I/usr/include/QtCore -I. -I/usr/include/libdrm -I/usr/lib/qt5/mkspecs/linux-g++ -o kptyprocess.o lib/kptyprocess.cpp
g++ -c -pipe -Os -fomit-frame-pointer -g -D_REENTRANT -Wall -Wextra -fPIC -DHAVE_POSIX_OPENPT -DHAVE_SYS_TIME_H -DQT_NO_DEBUG -DQT_PLUGIN -DQT_QUICK_LIB -DQT_WIDGETS_LIB -DQT_GUI_LIB -DQT_QMLMODELS_LIB -DQT_QML_LIB -DQT_NETWORK_LIB -DQT_CORE_LIB -I. -Ilib -Isrc -I/usr/include/QtQuick -I/usr/include/QtWidgets -I/usr/include/QtGui -I/usr/include/QtQmlModels -I/usr/include/QtQml -I/usr/include/QtNetwork -I/usr/include/QtCore -I. -I/usr/include/libdrm -I/usr/lib/qt5/mkspecs/linux-g++ -o ProcessInfo.o lib/ProcessInfo.cpp
In file included from lib/kptydevice.cpp:32:
lib/kptydevice.h:330:5: warning: 'template<class T> class QLinkedList' is deprecated: Use std::list instead [-Wdeprecated-declarations]
  330 |     QLinkedList<QByteArray> buffers;
      |     ^~~~~~~~~~~
In file included from /usr/include/QtCore/qvarlengtharray.h:43,
                 from /usr/include/QtCore/qmetatype.h:48,
                 from /usr/include/QtCore/qobject.h:54,
                 from /usr/include/QtCore/QObject:1,
                 from lib/kpty.h:26,
                 from lib/kpty_p.h:26,
                 from lib/kptydevice.h:32,
                 from lib/kptydevice.cpp:32:
/usr/include/QtCore/qcontainerfwd.h:51:26: note: declared here
   51 | template <class T> class QLinkedList;
      |                          ^~~~~~~~~~~
In file included from lib/kptydevice.cpp:32:
lib/kptydevice.h: In member function 'int KRingBuffer::indexAfter(char, int) const':
lib/kptydevice.h:281:9: warning: 'template<class T> class QLinkedList' is deprecated: Use std::list instead [-Wdeprecated-declarations]
  281 |         QLinkedList<QByteArray>::ConstIterator it = buffers.constBegin();
      |         ^~~~~~~~~~~
In file included from /usr/include/QtCore/qvarlengtharray.h:43,
                 from /usr/include/QtCore/qmetatype.h:48,
                 from /usr/include/QtCore/qobject.h:54,
                 from /usr/include/QtCore/QObject:1,
                 from lib/kpty.h:26,
                 from lib/kpty_p.h:26,
                 from lib/kptydevice.h:32,
                 from lib/kptydevice.cpp:32:
/usr/include/QtCore/qcontainerfwd.h:51:26: note: declared here
   51 | template <class T> class QLinkedList;
      |                          ^~~~~~~~~~~
g++ -c -pipe -Os -fomit-frame-pointer -g -D_REENTRANT -Wall -Wextra -fPIC -DHAVE_POSIX_OPENPT -DHAVE_SYS_TIME_H -DQT_NO_DEBUG -DQT_PLUGIN -DQT_QUICK_LIB -DQT_WIDGETS_LIB -DQT_GUI_LIB -DQT_QMLMODELS_LIB -DQT_QML_LIB -DQT_NETWORK_LIB -DQT_CORE_LIB -I. -Ilib -Isrc -I/usr/include/QtQuick -I/usr/include/QtWidgets -I/usr/include/QtGui -I/usr/include/QtQmlModels -I/usr/include/QtQml -I/usr/include/QtNetwork -I/usr/include/QtCore -I. -I/usr/include/libdrm -I/usr/lib/qt5/mkspecs/linux-g++ -o Pty.o lib/Pty.cpp
In file included from lib/kptyprocess.h:34,
                 from lib/kptyprocess.cpp:31:
lib/kptydevice.h:330:5: warning: 'template<class T> class QLinkedList' is deprecated: Use std::list instead [-Wdeprecated-declarations]
  330 |     QLinkedList<QByteArray> buffers;
      |     ^~~~~~~~~~~
In file included from /usr/include/QtCore/qvarlengtharray.h:43,
                 from /usr/include/QtCore/qmetatype.h:48,
                 from /usr/include/QtCore/qobject.h:54,
                 from /usr/include/QtCore/qiodevice.h:45,
                 from /usr/include/QtCore/qprocess.h:43,
                 from /usr/include/QtCore/QProcess:1,
                 from lib/kprocess.h:35,
                 from lib/kptyprocess.h:33,
                 from lib/kptyprocess.cpp:31:
/usr/include/QtCore/qcontainerfwd.h:51:26: note: declared here
   51 | template <class T> class QLinkedList;
      |                          ^~~~~~~~~~~
In file included from lib/kptyprocess.h:34,
                 from lib/kptyprocess.cpp:31:
lib/kptydevice.h: In member function 'int KRingBuffer::indexAfter(char, int) const':
lib/kptydevice.h:281:9: warning: 'template<class T> class QLinkedList' is deprecated: Use std::list instead [-Wdeprecated-declarations]
  281 |         QLinkedList<QByteArray>::ConstIterator it = buffers.constBegin();
      |         ^~~~~~~~~~~
In file included from /usr/include/QtCore/qvarlengtharray.h:43,
                 from /usr/include/QtCore/qmetatype.h:48,
                 from /usr/include/QtCore/qobject.h:54,
                 from /usr/include/QtCore/qiodevice.h:45,
                 from /usr/include/QtCore/qprocess.h:43,
                 from /usr/include/QtCore/QProcess:1,
                 from lib/kprocess.h:35,
                 from lib/kptyprocess.h:33,
                 from lib/kptyprocess.cpp:31:
/usr/include/QtCore/qcontainerfwd.h:51:26: note: declared here
   51 | template <class T> class QLinkedList;
      |                          ^~~~~~~~~~~
lib/ProcessInfo.cpp: In member function 'virtual bool LinuxProcessInfo::readProcInfo(int)':
lib/ProcessInfo.cpp:445:70: warning: 'QStringList QString::split(QChar, QString::SplitBehavior, Qt::CaseSensitivity) const' is deprecated: Use Qt::SplitBehavior variant instead [-Wdeprecated-declarations]
  445 |             uidStrings << uidLine.split('\t', QString::SkipEmptyParts);
      |                                                                      ^
In file included from /usr/include/QtCore/qobject.h:47,
                 from /usr/include/QtCore/qiodevice.h:45,
                 from /usr/include/QtCore/qfiledevice.h:43,
                 from /usr/include/QtCore/qfile.h:44,
                 from /usr/include/QtCore/QFile:1,
                 from lib/ProcessInfo.h:24,
                 from lib/ProcessInfo.cpp:21:
/usr/include/QtCore/qstring.h:615:17: note: declared here
  615 |     QStringList split(QChar sep, SplitBehavior behavior,
      |                 ^~~~~
g++ -c -pipe -Os -fomit-frame-pointer -g -D_REENTRANT -Wall -Wextra -fPIC -DHAVE_POSIX_OPENPT -DHAVE_SYS_TIME_H -DQT_NO_DEBUG -DQT_PLUGIN -DQT_QUICK_LIB -DQT_WIDGETS_LIB -DQT_GUI_LIB -DQT_QMLMODELS_LIB -DQT_QML_LIB -DQT_NETWORK_LIB -DQT_CORE_LIB -I. -Ilib -Isrc -I/usr/include/QtQuick -I/usr/include/QtWidgets -I/usr/include/QtGui -I/usr/include/QtQmlModels -I/usr/include/QtQml -I/usr/include/QtNetwork -I/usr/include/QtCore -I. -I/usr/include/libdrm -I/usr/lib/qt5/mkspecs/linux-g++ -o Screen.o lib/Screen.cpp
In file included from lib/kptyprocess.h:34,
                 from lib/Pty.h:41,
                 from lib/Pty.cpp:30:
lib/kptydevice.h:330:5: warning: 'template<class T> class QLinkedList' is deprecated: Use std::list instead [-Wdeprecated-declarations]
  330 |     QLinkedList<QByteArray> buffers;
      |     ^~~~~~~~~~~
In file included from /usr/include/QtCore/qvarlengtharray.h:43,
                 from /usr/include/QtCore/qmetatype.h:48,
                 from /usr/include/QtCore/qobject.h:54,
                 from /usr/include/QtCore/qiodevice.h:45,
                 from /usr/include/QtCore/qprocess.h:43,
                 from /usr/include/QtCore/QProcess:1,
                 from lib/kprocess.h:35,
                 from lib/kptyprocess.h:33,
                 from lib/Pty.h:41,
                 from lib/Pty.cpp:30:
/usr/include/QtCore/qcontainerfwd.h:51:26: note: declared here
   51 | template <class T> class QLinkedList;
      |                          ^~~~~~~~~~~
In file included from lib/kptyprocess.h:34,
                 from lib/Pty.h:41,
                 from lib/Pty.cpp:30:
lib/kptydevice.h: In member function 'int KRingBuffer::indexAfter(char, int) const':
lib/kptydevice.h:281:9: warning: 'template<class T> class QLinkedList' is deprecated: Use std::list instead [-Wdeprecated-declarations]
  281 |         QLinkedList<QByteArray>::ConstIterator it = buffers.constBegin();
      |         ^~~~~~~~~~~
In file included from /usr/include/QtCore/qvarlengtharray.h:43,
                 from /usr/include/QtCore/qmetatype.h:48,
                 from /usr/include/QtCore/qobject.h:54,
                 from /usr/include/QtCore/qiodevice.h:45,
                 from /usr/include/QtCore/qprocess.h:43,
                 from /usr/include/QtCore/QProcess:1,
                 from lib/kprocess.h:35,
                 from lib/kptyprocess.h:33,
                 from lib/Pty.h:41,
                 from lib/Pty.cpp:30:
/usr/include/QtCore/qcontainerfwd.h:51:26: note: declared here
   51 | template <class T> class QLinkedList;
      |                          ^~~~~~~~~~~
g++ -c -pipe -Os -fomit-frame-pointer -g -D_REENTRANT -Wall -Wextra -fPIC -DHAVE_POSIX_OPENPT -DHAVE_SYS_TIME_H -DQT_NO_DEBUG -DQT_PLUGIN -DQT_QUICK_LIB -DQT_WIDGETS_LIB -DQT_GUI_LIB -DQT_QMLMODELS_LIB -DQT_QML_LIB -DQT_NETWORK_LIB -DQT_CORE_LIB -I. -Ilib -Isrc -I/usr/include/QtQuick -I/usr/include/QtWidgets -I/usr/include/QtGui -I/usr/include/QtQmlModels -I/usr/include/QtQml -I/usr/include/QtNetwork -I/usr/include/QtCore -I. -I/usr/include/libdrm -I/usr/lib/qt5/mkspecs/linux-g++ -o ScreenWindow.o lib/ScreenWindow.cpp
g++ -c -pipe -Os -fomit-frame-pointer -g -D_REENTRANT -Wall -Wextra -fPIC -DHAVE_POSIX_OPENPT -DHAVE_SYS_TIME_H -DQT_NO_DEBUG -DQT_PLUGIN -DQT_QUICK_LIB -DQT_WIDGETS_LIB -DQT_GUI_LIB -DQT_QMLMODELS_LIB -DQT_QML_LIB -DQT_NETWORK_LIB -DQT_CORE_LIB -I. -Ilib -Isrc -I/usr/include/QtQuick -I/usr/include/QtWidgets -I/usr/include/QtGui -I/usr/include/QtQmlModels -I/usr/include/QtQml -I/usr/include/QtNetwork -I/usr/include/QtCore -I. -I/usr/include/libdrm -I/usr/lib/qt5/mkspecs/linux-g++ -o Session.o lib/Session.cpp
In file included from lib/Session.cpp:43:
lib/TerminalDisplay.h:142:5: warning: "/*" within comment [-Wcomment]
  142 |     /** Sets the background image of the terminal display. */
      |      
g++ -c -pipe -Os -fomit-frame-pointer -g -D_REENTRANT -Wall -Wextra -fPIC -DHAVE_POSIX_OPENPT -DHAVE_SYS_TIME_H -DQT_NO_DEBUG -DQT_PLUGIN -DQT_QUICK_LIB -DQT_WIDGETS_LIB -DQT_GUI_LIB -DQT_QMLMODELS_LIB -DQT_QML_LIB -DQT_NETWORK_LIB -DQT_CORE_LIB -I. -Ilib -Isrc -I/usr/include/QtQuick -I/usr/include/QtWidgets -I/usr/include/QtGui -I/usr/include/QtQmlModels -I/usr/include/QtQml -I/usr/include/QtNetwork -I/usr/include/QtCore -I. -I/usr/include/libdrm -I/usr/lib/qt5/mkspecs/linux-g++ -o ShellCommand.o lib/ShellCommand.cpp
g++ -c -pipe -Os -fomit-frame-pointer -g -D_REENTRANT -Wall -Wextra -fPIC -DHAVE_POSIX_OPENPT -DHAVE_SYS_TIME_H -DQT_NO_DEBUG -DQT_PLUGIN -DQT_QUICK_LIB -DQT_WIDGETS_LIB -DQT_GUI_LIB -DQT_QMLMODELS_LIB -DQT_QML_LIB -DQT_NETWORK_LIB -DQT_CORE_LIB -I. -Ilib -Isrc -I/usr/include/QtQuick -I/usr/include/QtWidgets -I/usr/include/QtGui -I/usr/include/QtQmlModels -I/usr/include/QtQml -I/usr/include/QtNetwork -I/usr/include/QtCore -I. -I/usr/include/libdrm -I/usr/lib/qt5/mkspecs/linux-g++ -o TerminalCharacterDecoder.o lib/TerminalCharacterDecoder.cpp
In file included from lib/kptyprocess.h:34,
                 from lib/Pty.h:41,
                 from lib/Session.cpp:41:
lib/kptydevice.h:330:5: warning: 'template<class T> class QLinkedList' is deprecated: Use std::list instead [-Wdeprecated-declarations]
  330 |     QLinkedList<QByteArray> buffers;
      |     ^~~~~~~~~~~
In file included from /usr/include/QtCore/qvarlengtharray.h:43,
                 from /usr/include/QtCore/qmetatype.h:48,
                 from /usr/include/QtCore/qobject.h:54,
                 from /usr/include/QtWidgets/qwidget.h:45,
                 from /usr/include/QtWidgets/QWidget:1,
                 from lib/Session.h:29,
                 from lib/Session.cpp:26:
/usr/include/QtCore/qcontainerfwd.h:51:26: note: declared here
   51 | template <class T> class QLinkedList;
      |                          ^~~~~~~~~~~
In file included from lib/kptyprocess.h:34,
                 from lib/Pty.h:41,
                 from lib/Session.cpp:41:
lib/kptydevice.h: In member function 'int KRingBuffer::indexAfter(char, int) const':
lib/kptydevice.h:281:9: warning: 'template<class T> class QLinkedList' is deprecated: Use std::list instead [-Wdeprecated-declarations]
  281 |         QLinkedList<QByteArray>::ConstIterator it = buffers.constBegin();
      |         ^~~~~~~~~~~
In file included from /usr/include/QtCore/qvarlengtharray.h:43,
                 from /usr/include/QtCore/qmetatype.h:48,
                 from /usr/include/QtCore/qobject.h:54,
                 from /usr/include/QtWidgets/qwidget.h:45,
                 from /usr/include/QtWidgets/QWidget:1,
                 from lib/Session.h:29,
                 from lib/Session.cpp:26:
/usr/include/QtCore/qcontainerfwd.h:51:26: note: declared here
   51 | template <class T> class QLinkedList;
      |                          ^~~~~~~~~~~
lib/Session.cpp: In member function 'void Konsole::Session::activityStateSet(int)':
lib/Session.cpp:460:68: warning: 'QString& QString::sprintf(const char*, ...)' is deprecated: Use asprintf(), arg() or QTextStream instead [-Wdeprecated-declarations]
  460 |         s.sprintf("Bell in session '%s'",_nameTitle.toUtf8().data());
      |                                                                    ^
In file included from /usr/include/QtCore/qhashfunctions.h:44,
                 from /usr/include/QtCore/qlist.h:47,
                 from /usr/include/QtCore/qstringlist.h:41,
                 from /usr/include/QtCore/QStringList:1,
                 from lib/Session.h:28,
                 from lib/Session.cpp:26:
/usr/include/QtCore/qstring.h:393:14: note: declared here
  393 |     QString &sprintf(const char *format, ...) Q_ATTRIBUTE_FORMAT_PRINTF(2, 3);
      |              ^~~~~~~
lib/Session.cpp: In member function 'void Konsole::Session::done(int)':
lib/Session.cpp:606:65: warning: 'QString& QString::sprintf(const char*, ...)' is deprecated: Use asprintf(), arg() or QTextStream instead [-Wdeprecated-declarations]
  606 |                           _nameTitle.toUtf8().data(), exitStatus);
      |                                                                 ^
In file included from /usr/include/QtCore/qhashfunctions.h:44,
                 from /usr/include/QtCore/qlist.h:47,
                 from /usr/include/QtCore/qstringlist.h:41,
                 from /usr/include/QtCore/QStringList:1,
                 from lib/Session.h:28,
                 from lib/Session.cpp:26:
/usr/include/QtCore/qstring.h:393:14: note: declared here
  393 |     QString &sprintf(const char *format, ...) Q_ATTRIBUTE_FORMAT_PRINTF(2, 3);
      |              ^~~~~~~
lib/Session.cpp:609:53: warning: 'QString& QString::sprintf(const char*, ...)' is deprecated: Use asprintf(), arg() or QTextStream instead [-Wdeprecated-declarations]
  609 |                           _nameTitle.toUtf8().data());
      |                                                     ^
In file included from /usr/include/QtCore/qhashfunctions.h:44,
                 from /usr/include/QtCore/qlist.h:47,
                 from /usr/include/QtCore/qstringlist.h:41,
                 from /usr/include/QtCore/QStringList:1,
                 from lib/Session.h:28,
                 from lib/Session.cpp:26:
/usr/include/QtCore/qstring.h:393:14: note: declared here
  393 |     QString &sprintf(const char *format, ...) Q_ATTRIBUTE_FORMAT_PRINTF(2, 3);
      |              ^~~~~~~
lib/Session.cpp:615:51: warning: 'QString& QString::sprintf(const char*, ...)' is deprecated: Use asprintf(), arg() or QTextStream instead [-Wdeprecated-declarations]
  615 |                         _nameTitle.toUtf8().data());
      |                                                   ^
In file included from /usr/include/QtCore/qhashfunctions.h:44,
                 from /usr/include/QtCore/qlist.h:47,
                 from /usr/include/QtCore/qstringlist.h:41,
                 from /usr/include/QtCore/QStringList:1,
                 from lib/Session.h:28,
                 from lib/Session.cpp:26:
/usr/include/QtCore/qstring.h:393:14: note: declared here
  393 |     QString &sprintf(const char *format, ...) Q_ATTRIBUTE_FORMAT_PRINTF(2, 3);
      |              ^~~~~~~
g++ -c -pipe -Os -fomit-frame-pointer -g -D_REENTRANT -Wall -Wextra -fPIC -DHAVE_POSIX_OPENPT -DHAVE_SYS_TIME_H -DQT_NO_DEBUG -DQT_PLUGIN -DQT_QUICK_LIB -DQT_WIDGETS_LIB -DQT_GUI_LIB -DQT_QMLMODELS_LIB -DQT_QML_LIB -DQT_NETWORK_LIB -DQT_CORE_LIB -I. -Ilib -Isrc -I/usr/include/QtQuick -I/usr/include/QtWidgets -I/usr/include/QtGui -I/usr/include/QtQmlModels -I/usr/include/QtQml -I/usr/include/QtNetwork -I/usr/include/QtCore -I. -I/usr/include/libdrm -I/usr/lib/qt5/mkspecs/linux-g++ -o TerminalDisplay.o lib/TerminalDisplay.cpp
lib/TerminalCharacterDecoder.cpp: In member function 'virtual void Konsole::HTMLDecoder::decodeLine(const Konsole::Character*, int, Konsole::LineProperty)':
lib/TerminalCharacterDecoder.cpp:205:18: error: 'iswspace' is not a member of 'std'; did you mean 'isspace'?
  205 |         if (std::iswspace(ch))
      |                  ^~~~~~~~
      |                  isspace
make: *** [Makefile:798: TerminalCharacterDecoder.o] Error 1
make: *** Waiting for unfinished jobs....
In file included from lib/TerminalDisplay.cpp:24:
lib/TerminalDisplay.h:142:5: warning: "/*" within comment [-Wcomment]
  142 |     /** Sets the background image of the terminal display. */
      |      
lib/TerminalDisplay.cpp: In member function 'virtual void Konsole::TerminalDisplay::fontChange(const QFont&)':
lib/TerminalDisplay.cpp:224:62: warning: 'int QFontMetrics::width(const QString&, int) const' is deprecated: Use QFontMetrics::horizontalAdvance [-Wdeprecated-declarations]
  224 |   _fontWidth = qRound((double)fm.width(QLatin1String(REPCHAR))/(double)qstrlen(REPCHAR));
      |                                                              ^
In file included from /usr/include/QtWidgets/qwidget.h:50,
                 from /usr/include/QtWidgets/qaction.h:46,
                 from /usr/include/QtWidgets/QAction:1,
                 from lib/Filter.h:24,
                 from lib/TerminalDisplay.h:31,
                 from lib/TerminalDisplay.cpp:24:
/usr/include/QtGui/qfontmetrics.h:106:9: note: declared here
  106 |     int width(const QString &, int len = -1) const;
      |         ^~~~~
lib/TerminalDisplay.cpp:228:44: warning: 'int QFontMetrics::width(QChar) const' is deprecated: Use QFontMetrics::horizontalAdvance [-Wdeprecated-declarations]
  228 |   int fw = fm.width(QLatin1Char(REPCHAR[0]));
      |                                            ^
In file included from /usr/include/QtWidgets/qwidget.h:50,
                 from /usr/include/QtWidgets/qaction.h:46,
                 from /usr/include/QtWidgets/QAction:1,
                 from lib/Filter.h:24,
                 from lib/TerminalDisplay.h:31,
                 from lib/TerminalDisplay.cpp:24:
/usr/include/QtGui/qfontmetrics.h:110:9: note: declared here
  110 |     int width(QChar) const;
      |         ^~~~~
lib/TerminalDisplay.cpp:231:47: warning: 'int QFontMetrics::width(QChar) const' is deprecated: Use QFontMetrics::horizontalAdvance [-Wdeprecated-declarations]
  231 |     if (fw != fm.width(QLatin1Char(REPCHAR[i])))
      |                                               ^
In file included from /usr/include/QtWidgets/qwidget.h:50,
                 from /usr/include/QtWidgets/qaction.h:46,
                 from /usr/include/QtWidgets/QAction:1,
                 from lib/Filter.h:24,
                 from lib/TerminalDisplay.h:31,
                 from lib/TerminalDisplay.cpp:24:
/usr/include/QtGui/qfontmetrics.h:110:9: note: declared here
  110 |     int width(QChar) const;
      |         ^~~~~
In file included from lib/TerminalDisplay.cpp:24:
lib/TerminalDisplay.h: In constructor 'Konsole::TerminalDisplay::TerminalDisplay(QQuickItem*)':
lib/TerminalDisplay.h:899:10: warning: 'Konsole::TerminalDisplay::m_full_cursor_height' will be initialized after [-Wreorder]
  899 |     bool m_full_cursor_height;
      |          ^~~~~~~~~~~~~~~~~~~~
lib/TerminalDisplay.h:891:9: warning:   'int Konsole::TerminalDisplay::_leftBaseMargin' [-Wreorder]
  891 |     int _leftBaseMargin;
      |         ^~~~~~~~~~~~~~~
lib/TerminalDisplay.cpp:301:1: warning:   when initialized here [-Wreorder]
  301 | TerminalDisplay::TerminalDisplay(QQuickItem *parent)
      | ^~~~~~~~~~~~~~~
lib/TerminalDisplay.cpp: In member function 'void Konsole::TerminalDisplay::drawTextFragment(QPainter&, const QRect&, const wstring&, const Konsole::Character*)':
lib/TerminalDisplay.cpp:880:50: warning: 'const QBrush& QPalette::background() const' is deprecated: Use QPalette::window() instead [-Wdeprecated-declarations]
  880 |     if ( backgroundColor != palette().background().color() )
      |                                                  ^
In file included from /usr/include/QtWidgets/qwidget.h:48,
                 from /usr/include/QtWidgets/qaction.h:46,
                 from /usr/include/QtWidgets/QAction:1,
                 from lib/Filter.h:24,
                 from lib/TerminalDisplay.h:31,
                 from lib/TerminalDisplay.cpp:24:
/usr/include/QtGui/qpalette.h:149:26: note: declared here
  149 |     inline const QBrush &background() const { return window(); }
      |                          ^~~~~~~~~~
lib/TerminalDisplay.cpp: In member function 'int Konsole::TerminalDisplay::textWidth(int, int, int) const':
lib/TerminalDisplay.cpp:1537:73: warning: 'int QFontMetrics::width(QChar) const' is deprecated: Use QFontMetrics::horizontalAdvance [-Wdeprecated-declarations]
 1537 |     result += fm.width(_image[loc(startColumn + column, line)].character);
      |                                                                         ^
In file included from /usr/include/QtWidgets/qwidget.h:50,
                 from /usr/include/QtWidgets/qaction.h:46,
                 from /usr/include/QtWidgets/QAction:1,
                 from lib/Filter.h:24,
                 from lib/TerminalDisplay.h:31,
                 from lib/TerminalDisplay.cpp:24:
/usr/include/QtGui/qfontmetrics.h:110:9: note: declared here
  110 |     int width(QChar) const;
      |         ^~~~~
lib/TerminalDisplay.cpp: In member function 'virtual void Konsole::TerminalDisplay::wheelEvent(QWheelEvent*)':
lib/TerminalDisplay.cpp:2474:23: warning: 'Qt::Orientation QWheelEvent::orientation() const' is deprecated: Use angleDelta() [-Wdeprecated-declarations]
 2474 |   if (ev->orientation() != Qt::Vertical)
      |                       ^
In file included from /usr/include/QtQuick/qquickitem.h:49,
                 from /usr/include/QtQuick/qquickpainteditem.h:43,
                 from /usr/include/QtQuick/QQuickPaintedItem:1,
                 from lib/TerminalDisplay.h:28,
                 from lib/TerminalDisplay.cpp:24:
/usr/include/QtGui/qevent.h:222:28: note: declared here
  222 |     inline Qt::Orientation orientation() const { return qt4O; }
      |                            ^~~~~~~~~~~
lib/TerminalDisplay.cpp:2494:29: warning: 'int QWheelEvent::delta() const' is deprecated: Use angleDelta() [-Wdeprecated-declarations]
 2494 |         int key = ev->delta() > 0 ? Qt::Key_Up : Qt::Key_Down;
      |                             ^
In file included from /usr/include/QtQuick/qquickitem.h:49,
                 from /usr/include/QtQuick/qquickpainteditem.h:43,
                 from /usr/include/QtQuick/QQuickPaintedItem:1,
                 from lib/TerminalDisplay.h:28,
                 from lib/TerminalDisplay.cpp:24:
/usr/include/QtGui/qevent.h:219:16: note: declared here
  219 |     inline int delta() const  { return qt4D; }
      |                ^~~~~
lib/TerminalDisplay.cpp:2497:38: warning: 'int QWheelEvent::delta() const' is deprecated: Use angleDelta() [-Wdeprecated-declarations]
 2497 |         int wheelDegrees = ev->delta() / 8;
      |                                      ^
In file included from /usr/include/QtQuick/qquickitem.h:49,
                 from /usr/include/QtQuick/qquickpainteditem.h:43,
                 from /usr/include/QtQuick/QQuickPaintedItem:1,
                 from lib/TerminalDisplay.h:28,
                 from lib/TerminalDisplay.cpp:24:
/usr/include/QtGui/qevent.h:219:16: note: declared here
  219 |     inline int delta() const  { return qt4D; }
      |                ^~~~~
lib/TerminalDisplay.cpp:2512:35: warning: 'QPoint QWheelEvent::pos() const' is deprecated: Use position() [-Wdeprecated-declarations]
 2512 |     getCharacterPosition( ev->pos() , charLine , charColumn );
      |                                   ^
In file included from /usr/include/QtQuick/qquickitem.h:49,
                 from /usr/include/QtQuick/qquickpainteditem.h:43,
                 from /usr/include/QtQuick/QQuickPaintedItem:1,
                 from lib/TerminalDisplay.h:28,
                 from lib/TerminalDisplay.cpp:24:
/usr/include/QtGui/qevent.h:225:19: note: declared here
  225 |     inline QPoint pos() const { return p.toPoint(); }
      |                   ^~~
lib/TerminalDisplay.cpp:2514:33: warning: 'int QWheelEvent::delta() const' is deprecated: Use angleDelta() [-Wdeprecated-declarations]
 2514 |     emit mouseSignal( ev->delta() > 0 ? 4 : 5,
      |                                 ^
In file included from /usr/include/QtQuick/qquickitem.h:49,
                 from /usr/include/QtQuick/qquickpainteditem.h:43,
                 from /usr/include/QtQuick/QQuickPaintedItem:1,
                 from lib/TerminalDisplay.h:28,
                 from lib/TerminalDisplay.cpp:24:
/usr/include/QtGui/qevent.h:219:16: note: declared here
  219 |     inline int delta() const  { return qt4D; }
      |                ^~~~~
lib/TerminalDisplay.cpp: In member function 'void Konsole::TerminalDisplay::swapColorTable()':
lib/TerminalDisplay.cpp:2982:35: warning: implicitly-declared 'constexpr Konsole::ColorEntry::ColorEntry(const Konsole::ColorEntry&)' is deprecated [-Wdeprecated-copy]
 2982 |   ColorEntry color = _colorTable[1];
      |                                   ^
In file included from lib/Character.h:30,
                 from lib/TerminalDisplay.h:32,
                 from lib/TerminalDisplay.cpp:24:
lib/CharacterColor.h:84:8: note: because 'Konsole::ColorEntry' has user-provided 'void Konsole::ColorEntry::operator=(const Konsole::ColorEntry&)'
   84 |   void operator=(const ColorEntry& rhs)
      |        ^~~~~~~~
lib/TerminalDisplay.cpp: In member function 'void Konsole::TerminalDisplay::doDrag()':
lib/TerminalDisplay.cpp:3166:44: warning: 'Qt::DropAction QDrag::start(Qt::DropActions)' is deprecated: Use QDrag::exec() instead [-Wdeprecated-declarations]
 3166 |   dragInfo.dragObject->start(Qt::CopyAction);
      |                                            ^
In file included from /usr/include/QtGui/QDrag:1,
                 from lib/TerminalDisplay.cpp:45:
/usr/include/QtGui/qdrag.h:79:20: note: declared here
   79 |     Qt::DropAction start(Qt::DropActions supportedActions = Qt::CopyAction);
      |                    ^~~~~
lib/TerminalDisplay.cpp: In member function 'void Konsole::TerminalDisplay::simulateWheel(int, int, int, int, QPointF)':
lib/TerminalDisplay.cpp:3412:112: warning: 'QWheelEvent::QWheelEvent(const QPointF&, int, Qt::MouseButtons, Qt::KeyboardModifiers, Qt::Orientation)' is deprecated: Use the last QWheelEvent constructor taking pixelDelta, angleDelta, phase, and inverted [-Wdeprecated-declarations]
 3412 |     QWheelEvent event(QPointF(x,y), angleDelta.y(), (Qt::MouseButton) buttons, (Qt::KeyboardModifier) modifiers);
      |                                                                                                                ^
In file included from /usr/include/QtQuick/qquickitem.h:49,
                 from /usr/include/QtQuick/qquickpainteditem.h:43,
                 from /usr/include/QtQuick/QQuickPaintedItem:1,
                 from lib/TerminalDisplay.h:28,
                 from lib/TerminalDisplay.cpp:24:
/usr/include/QtGui/qevent.h:181:5: note: declared here
  181 |     QWheelEvent(const QPointF &pos, int delta,
      |     ^~~~~~~~~~~
lib/TerminalDisplay.cpp: In member function 'virtual bool Konsole::TerminalDisplay::event(QEvent*)':
lib/TerminalDisplay.cpp:2926:54: warning: this statement may fall through [-Wimplicit-fallthrough=]
 2926 |         _scrollBar->setPalette( QApplication::palette() );
      |                                 ~~~~~~~~~~~~~~~~~~~~~^~
lib/TerminalDisplay.cpp:2927:5: note: here
 2927 |     case QEvent::InputMethodQuery:
      |     ^~~~
>>> ERROR: qmltermwidget: build failed
]0;(002259) [06:03:54] ^^^^^^^^^^^^^^^^^^^^^^^^^^^^^^^^^^^^^^^^^^^^^^^^^^^^^^^^^^^^^^^^^^^^^^
(002259) [06:03:54] NOTE: The failed command's output is above the ^^^ line in the log file: /home/build/.local/var/pmbootstrap/log.txt
(002259) [06:03:54] ERROR: Command failed: (native) % cd /home/pmos/build; busybox su pmos -c CARCH=x86_64 SUDO_APK='abuild-apk --no-progress' CCACHE_DISABLE=1 HOME=/home/pmos abuild -D postmarketOS -r -f
(002259) [06:03:54] See also: <https://postmarketos.org/troubleshooting>
(002259) [06:03:54] Traceback (most recent call last):
  File "/home/build/pmbootstrap/pmb/__init__.py", line 49, in main
    getattr(frontend, args.action)(args)
  File "/home/build/pmbootstrap/pmb/helpers/frontend.py", line 115, in build
    if not pmb.build.package(args, package, arch_package, force,
  File "/home/build/pmbootstrap/pmb/build/_package.py", line 517, in package
    (output, cmd, env) = run_abuild(args, apkbuild, arch, strict, force, cross,
  File "/home/build/pmbootstrap/pmb/build/_package.py", line 447, in run_abuild
    pmb.chroot.user(args, cmd, suffix, "/home/pmos/build", env=env)
  File "/home/build/pmbootstrap/pmb/chroot/user.py", line 26, in user
    return pmb.chroot.root(args, cmd, suffix, working_dir, output,
  File "/home/build/pmbootstrap/pmb/chroot/root.py", line 74, in root
    return pmb.helpers.run_core.core(args, msg, cmd_sudo, None, output,
  File "/home/build/pmbootstrap/pmb/helpers/run_core.py", line 342, in core
    check_return_code(args, code, log_message)
  File "/home/build/pmbootstrap/pmb/helpers/run_core.py", line 218, in check_return_code
    raise RuntimeError("Command failed: " + log_message)
RuntimeError: Command failed: (native) % cd /home/pmos/build; busybox su pmos -c CARCH=x86_64 SUDO_APK='abuild-apk --no-progress' CCACHE_DISABLE=1 HOME=/home/pmos abuild -D postmarketOS -r -f

Run 'pmbootstrap log' for details.
Build complete: failed 9 days ago (took a minute)