#433826 failed

Build package: v21.03/x86_64/mapbox-gl-native-1.5.0.3-r0

Owner
~postmarketos
Created
12 days ago
Updated
12 days ago
Build manifest
view manifest »

Tasks

view log »
bpo_setup view log »
install_pubkey view log »
pmbootstrap_build view log »
checksums view log »
submit view log »
go to bottom »
setup
1
2
3
4
5
6
7
8
9
10
11
12
13
14
15
16
17
18
19
20
21
22
23
24
25
26
27
28
29
30
31
32
33
34
35
36
37
38
39
40
41
42
43
44
45
46
47
48
49
50
51
52
53
54
55
56
57
58
59
60
61
[#433826] 2021/02/21 19:09:34 Booting image alpine/latest (default) on port 22760
[#433826] 2021/02/21 19:09:38 Waiting for guest to settle
[#433826] 2021/02/21 19:09:46 Sending tasks
[#433826] 2021/02/21 19:09:47 Sending build environment
[#433826] 2021/02/21 19:09:47 Sending secrets
[#433826] 2021/02/21 19:09:47 Resolving secret 482975ec-22f7-49fd-9b54-486b0b1947c3
[#433826] 2021/02/21 19:09:47 Installing packages
Warning: Permanently added '[localhost]:22760' (ECDSA) to the list of known hosts.
fetch http://dl-cdn.alpinelinux.org/alpine/v3.13/main/x86_64/APKINDEX.tar.gz
fetch http://dl-cdn.alpinelinux.org/alpine/v3.13/community/x86_64/APKINDEX.tar.gz
v3.13.2-8-g7bb1c88019 [http://dl-cdn.alpinelinux.org/alpine/v3.13/main]
v3.13.2-12-gea23800845 [http://dl-cdn.alpinelinux.org/alpine/v3.13/community]
OK: 13877 distinct packages available
Warning: Permanently added '[localhost]:22760' (ECDSA) to the list of known hosts.
(1/18) Installing skalibs (2.10.0.0-r0)
(2/18) Installing s6-ipcserver (2.10.0.0-r0)
(3/18) Installing utmps (0.1.0.0-r0)
Executing utmps-0.1.0.0-r0.pre-install
(4/18) Installing utmps-openrc (0.1.0.0-r0)
(5/18) Installing coreutils (8.32-r2)
(6/18) Installing libproc (3.3.16-r0)
(7/18) Installing procps (3.3.16-r0)
(8/18) Installing py3-ordered-set (4.0.2-r0)
(9/18) Installing py3-appdirs (1.4.4-r1)
(10/18) Installing py3-parsing (2.4.7-r1)
(11/18) Installing py3-six (1.15.0-r0)
(12/18) Installing py3-packaging (20.9-r0)
(13/18) Installing py3-setuptools (51.3.3-r0)
(14/18) Installing py3-chardet (4.0.0-r0)
(15/18) Installing py3-idna (3.1-r0)
(16/18) Installing py3-urllib3 (1.26.2-r1)
(17/18) Installing py3-requests (2.25.1-r1)
(18/18) Installing xz (5.2.5-r0)
Executing busybox-1.32.1-r3.trigger
OK: 1205 MiB in 224 packages
[#433826] 2021/02/21 19:09:50 Cloning repositories
Cloning into 'pmaports'...
+ cd pmaports
+ git submodule update --init
Cloning into 'pmbootstrap'...
+ cd pmbootstrap
+ git submodule update --init
Cloning into 'build.postmarketos.org'...
+ cd build.postmarketos.org
+ git submodule update --init
[#433826] 2021/02/21 19:10:00 Running task bpo_setup
[#433826] 2021/02/21 19:10:01 Running task install_pubkey
[#433826] 2021/02/21 19:10:02 Running task pmbootstrap_build
[#433826] 2021/02/21 19:10:56 Processing post-failed triggers...
[#433826] 2021/02/21 19:10:57 Sending webhook...
[#433826] 2021/02/21 19:11:00 Webhook response: 200
[#433826] 2021/02/21 19:11:00 done
[#433826] 2021/02/21 19:11:00 Build failed.
[#433826] 2021/02/21 19:11:00 The build environment will be kept alive for 10 minutes.
[#433826] 2021/02/21 19:11:00 To log in with SSH and examine it, use the following command:
[#433826] 2021/02/21 19:11:00 
[#433826] 2021/02/21 19:11:00 	ssh -t builds@azusa.runners.sr.ht connect 433826
[#433826] 2021/02/21 19:11:00 
[#433826] 2021/02/21 19:11:00 After logging in, the deadline is increased to your remaining build time.
[#433826] 2021/02/21 19:21:00 Deadline elapsed. Terminating build environment.
[#433826] 2021/02/21 19:21:00 Error: Running task on guest: exit status 1
bpo_setup
1
2
3
4
5
6
7
8
9
10
11
12
13
14
15
16
+ export BPO_JOB_ID=433826
+ BPO_JOB_ID=433826
+ mkdir -p /home/build/.config
+ echo '[pmbootstrap]'
+ echo 'is_default_channel = False'
+ git -C pmaports checkout v21.03
Branch 'v21.03' set up to track remote branch 'v21.03' from 'origin'.
Switched to a new branch 'v21.03'
+ sudo ln -s /home/build/pmbootstrap/pmbootstrap.py /usr/bin/pmbootstrap
+ yes ''
+ pmbootstrap --aports=/home/build/pmaports -q init
[19:10:01] Work path [/home/build/.local/var/pmbootstrap]: [19:10:01] Channel [stable-next]: [19:10:01] Vendor [qemu]: [19:10:01] Device codename [amd64]: [19:10:01] Kernel [virt]: [19:10:01] Username [user]: [19:10:01] User interface [weston]: [19:10:01] Change them? (y/n) [n]: [19:10:01] Extra packages [none]: [19:10:01] Choose default locale for installation (y/n) [C.UTF-8]: [19:10:01] Device hostname (short form, e.g. 'foo') [qemu-amd64]: [19:10:01] Build outdated packages during 'pmbootstrap install'? (y/n) [y]: + sudo modprobe binfmt_misc
+ sudo mount -t binfmt_misc none /proc/sys/fs/binfmt_misc
++ git -C pmaports rev-parse --abbrev-ref HEAD
+ branch=v21.03
+ '[' v21.03 '!=' v21.03 ']'
install_pubkey
1
2
3
4
5
6
7
8
9
10
11
12
+ export BPO_JOB_ID=433826
+ BPO_JOB_ID=433826
+ echo -n '-----BEGIN PUBLIC KEY-----
MIIBIjANBgkqhkiG9w0BAQEFAAOCAQ8AMIIBCgKCAQEA3xn8DlD4ZJuioKYBqsYH
jY2dEtS9iIQ7Ud06HoxgY7QpiBB8GyXNpqW79vgkuhfayHv5C2eeRSs5fVhx4T5d
Kr+SlqOp5wmo+3MfhL0zfYlKrt0XkjmkMiUwFEn9BcTAf6cDsJ838KCUyAmbCKDS
Pivr5bZf1LDHK7/M//CVixoNJ8+Tj50X0BKbcz6LnyZ+R4Nk4udgymkzjZxoSlWF
/bkduoeNrR5Me83C1YfVLzCT2QTdiw6OEU0EH2IzrgHkIx5bZF2Ezf4a4WQxEGSg
L6L6smQSsDoMqYavpy8EmeOLK/28IS8WVgU18m5upZ1O/26icGp+QkOC/SlKkRu0
iwIDAQAB
-----END PUBLIC KEY-----
'
pmbootstrap_build
1
2
3
4
5
6
7
8
9
10
11
12
13
14
15
16
17
18
19
20
21
22
23
24
25
26
27
28
29
30
31
32
33
34
35
36
37
38
39
40
41
42
43
44
45
46
47
48
49
50
51
52
53
54
55
56
57
58
59
60
61
62
63
64
65
66
67
68
69
70
71
72
73
74
75
76
77
78
79
80
81
82
83
84
85
86
87
88
89
90
91
92
93
94
95
96
97
98
99
100
101
102
103
104
105
106
107
108
109
110
111
112
113
114
115
116
117
118
119
120
121
122
123
124
125
126
127
128
129
130
131
132
133
134
135
136
137
138
139
140
141
142
143
144
145
146
147
148
149
150
151
152
153
154
155
156
157
158
159
160
161
162
163
164
165
166
167
168
169
170
171
172
173
174
175
176
177
178
179
180
181
182
183
184
185
186
187
188
189
190
191
192
193
194
195
196
197
198
199
200
201
202
203
204
205
206
207
208
209
210
211
212
213
214
215
216
217
218
219
220
221
222
223
224
225
226
227
228
229
230
231
232
233
234
235
236
237
238
239
240
241
242
243
244
245
246
247
248
249
250
251
252
253
254
255
256
257
258
259
260
261
262
263
264
265
266
267
268
269
270
271
272
273
274
275
276
277
278
279
280
281
282
283
284
285
286
287
288
289
290
291
292
293
294
295
296
297
298
299
300
301
302
303
304
305
306
307
308
309
310
311
312
313
314
315
316
317
318
319
320
321
322
323
324
325
326
327
328
329
330
331
332
333
334
335
336
337
338
339
340
341
342
343
344
345
346
347
348
349
350
351
352
353
354
355
356
357
358
359
360
361
362
363
364
365
366
367
368
369
370
371
372
373
374
375
376
377
378
379
380
381
382
383
384
385
386
387
388
389
390
391
392
393
394
395
396
397
398
399
400
401
402
403
404
405
406
407
408
409
410
411
412
413
414
415
416
417
418
419
420
421
422
423
424
425
426
427
428
429
430
431
432
433
434
435
436
437
438
439
440
441
442
443
444
445
446
447
448
449
450
451
452
453
454
455
456
457
458
459
460
461
462
463
464
465
466
467
468
469
470
471
472
473
474
475
476
477
478
479
480
481
482
483
484
485
486
487
488
489
490
491
492
493
494
495
496
497
498
499
500
501
502
503
504
+ export BPO_JOB_ID=433826
+ BPO_JOB_ID=433826
+ pmbootstrap -m http://dl-2.alpinelinux.org/alpine/ -mp http://build.postmarketos.org/wip/ -mp http://mirror.postmarketos.org/postmarketos/ --aports=/home/build/pmaports --no-ccache --timeout 900 --details-to-stdout build --no-depends --strict --arch x86_64 --force mapbox-gl-native
(002273) [19:10:03] % cd /home/build/pmaports; git remote -v
origin	https://gitlab.com/postmarketOS/pmaports.git/ (fetch)
origin	https://gitlab.com/postmarketOS/pmaports.git/ (push)
(002273) [19:10:03] % cd /home/build/pmaports; git show origin/master:channels.cfg
# Reference: https://postmarketos.org/channels.cfg
[channels.cfg]
recommended=edge

[edge]
description=Rolling release channel
branch_pmaports=master
branch_aports=master
mirrordir_alpine=edge

[stable]
description=Stable release channel (first beta v20.05, does not have many devices yet)
branch_pmaports=v20.05
branch_aports=3.12-stable
mirrordir_alpine=v3.12

[stable-next]
description=Upcoming second beta v21.03. DO NOT USE.
branch_pmaports=v21.03
branch_aports=3.13-stable
mirrordir_alpine=v3.13
(002273) [19:10:03] Shutdown complete
(002273) [19:10:03] Calculate work folder size
(002273) [19:10:03] % sudo du --summarize --block-size=1 /home/build/.local/var/pmbootstrap
20480	/home/build/.local/var/pmbootstrap
(002273) [19:10:03] Shutdown complete
(002273) [19:10:03] % sudo du --summarize --block-size=1 /home/build/.local/var/pmbootstrap
20480	/home/build/.local/var/pmbootstrap
(002273) [19:10:03] Cleared up ~0 MB of space
(002273) [19:10:03] APKINDEX outdated (file does not exist yet): http://build.postmarketos.org/wip/v21.03/x86_64/APKINDEX.tar.gz
(002273) [19:10:03] APKINDEX outdated (file does not exist yet): http://mirror.postmarketos.org/postmarketos/v21.03/x86_64/APKINDEX.tar.gz
(002273) [19:10:03] APKINDEX outdated (file does not exist yet): http://dl-2.alpinelinux.org/alpine/v3.13/main/x86_64/APKINDEX.tar.gz
(002273) [19:10:03] APKINDEX outdated (file does not exist yet): http://dl-2.alpinelinux.org/alpine/v3.13/community/x86_64/APKINDEX.tar.gz
(002273) [19:10:03] Update package index for x86_64 (4 file(s))
(002273) [19:10:03] % mkdir -p /home/build/.local/var/pmbootstrap/cache_http
(002273) [19:10:03] Download http://build.postmarketos.org/wip/v21.03/x86_64/APKINDEX.tar.gz
(002273) [19:10:03] % sudo mkdir -p /home/build/.local/var/pmbootstrap/cache_apk_x86_64
(002273) [19:10:03] % sudo cp /home/build/.local/var/pmbootstrap/cache_http/APKINDEX_40c7a24b27dd238be178699a2ca80b05060e56905f6c4ebe6f6ac2ac77a9c4af /home/build/.local/var/pmbootstrap/cache_apk_x86_64/APKINDEX.cf67b0ff.tar.gz
(002273) [19:10:03] Download http://mirror.postmarketos.org/postmarketos/v21.03/x86_64/APKINDEX.tar.gz
(002273) [19:10:04] WARNING: file not found: http://mirror.postmarketos.org/postmarketos/v21.03/x86_64/APKINDEX.tar.gz
(002273) [19:10:04] Download http://dl-2.alpinelinux.org/alpine/v3.13/main/x86_64/APKINDEX.tar.gz
(002273) [19:10:04] % sudo cp /home/build/.local/var/pmbootstrap/cache_http/APKINDEX_b45a26b68f4b8a322cc0d8712fd4769825bff4922e99e09827b6624eb85a7f2f /home/build/.local/var/pmbootstrap/cache_apk_x86_64/APKINDEX.6a9bd0af.tar.gz
(002273) [19:10:04] Download http://dl-2.alpinelinux.org/alpine/v3.13/community/x86_64/APKINDEX.tar.gz
(002273) [19:10:04] % sudo cp /home/build/.local/var/pmbootstrap/cache_http/APKINDEX_dd6cd26cf416edcd1a63f93b53af66614b16490666a245df00cc3f263d39980e /home/build/.local/var/pmbootstrap/cache_apk_x86_64/APKINDEX.d9df3a78.tar.gz
(002273) [19:10:07] Build is necessary for package 'mapbox-gl-native': No binary package available
(002273) [19:10:07] NOTE: Skipped apk version check for chroot 'native', because it is not installed yet!
(002273) [19:10:07] % sudo mkdir -p /home/build/.local/var/pmbootstrap/chroot_native/dev
(002273) [19:10:07] % sudo mount -t tmpfs -o size=1M,noexec,dev tmpfs /home/build/.local/var/pmbootstrap/chroot_native/dev
(002273) [19:10:07] % sudo mkdir -p /home/build/.local/var/pmbootstrap/chroot_native/dev/pts /home/build/.local/var/pmbootstrap/chroot_native/dev/shm
(002273) [19:10:07] % sudo mount -t tmpfs -o nodev,nosuid,noexec tmpfs /home/build/.local/var/pmbootstrap/chroot_native/dev/shm
(002273) [19:10:07] % sudo mknod -m 666 /home/build/.local/var/pmbootstrap/chroot_native/dev/null c 1 3
(002273) [19:10:07] % sudo mknod -m 666 /home/build/.local/var/pmbootstrap/chroot_native/dev/zero c 1 5
(002273) [19:10:07] % sudo mknod -m 666 /home/build/.local/var/pmbootstrap/chroot_native/dev/full c 1 7
(002273) [19:10:07] % sudo mknod -m 644 /home/build/.local/var/pmbootstrap/chroot_native/dev/random c 1 8
(002273) [19:10:07] % sudo mknod -m 644 /home/build/.local/var/pmbootstrap/chroot_native/dev/urandom c 1 9
(002273) [19:10:07] % sudo mkdir -p /home/build/.local/var/pmbootstrap/chroot_native/proc
(002273) [19:10:07] % sudo mount --bind /proc /home/build/.local/var/pmbootstrap/chroot_native/proc
(002273) [19:10:07] % sudo mkdir -p /home/build/.local/var/pmbootstrap/chroot_native/var/cache/apk
(002273) [19:10:07] % sudo mount --bind /home/build/.local/var/pmbootstrap/cache_apk_x86_64 /home/build/.local/var/pmbootstrap/chroot_native/var/cache/apk
(002273) [19:10:07] % sudo mkdir -p /home/build/.local/var/pmbootstrap/cache_ccache_x86_64
(002273) [19:10:07] % sudo mkdir -p /home/build/.local/var/pmbootstrap/chroot_native/mnt/pmbootstrap-ccache
(002273) [19:10:07] % sudo mount --bind /home/build/.local/var/pmbootstrap/cache_ccache_x86_64 /home/build/.local/var/pmbootstrap/chroot_native/mnt/pmbootstrap-ccache
(002273) [19:10:07] % sudo mkdir -p /home/build/.local/var/pmbootstrap/cache_distfiles
(002273) [19:10:07] % sudo mkdir -p /home/build/.local/var/pmbootstrap/chroot_native/var/cache/distfiles
(002273) [19:10:07] % sudo mount --bind /home/build/.local/var/pmbootstrap/cache_distfiles /home/build/.local/var/pmbootstrap/chroot_native/var/cache/distfiles
(002273) [19:10:07] % sudo mkdir -p /home/build/.local/var/pmbootstrap/chroot_native/mnt/pmbootstrap-git
(002273) [19:10:07] % sudo mount --bind /home/build/.local/var/pmbootstrap/cache_git /home/build/.local/var/pmbootstrap/chroot_native/mnt/pmbootstrap-git
(002273) [19:10:07] % sudo mkdir -p /home/build/.local/var/pmbootstrap/cache_rust
(002273) [19:10:07] % sudo mkdir -p /home/build/.local/var/pmbootstrap/chroot_native/mnt/pmbootstrap-rust
(002273) [19:10:07] % sudo mount --bind /home/build/.local/var/pmbootstrap/cache_rust /home/build/.local/var/pmbootstrap/chroot_native/mnt/pmbootstrap-rust
(002273) [19:10:07] % sudo mkdir -p /home/build/.local/var/pmbootstrap/config_abuild
(002273) [19:10:07] % sudo mkdir -p /home/build/.local/var/pmbootstrap/chroot_native/mnt/pmbootstrap-abuild-config
(002273) [19:10:07] % sudo mount --bind /home/build/.local/var/pmbootstrap/config_abuild /home/build/.local/var/pmbootstrap/chroot_native/mnt/pmbootstrap-abuild-config
(002273) [19:10:07] % sudo mkdir -p /home/build/.local/var/pmbootstrap/config_apk_keys
(002273) [19:10:07] % sudo mkdir -p /home/build/.local/var/pmbootstrap/chroot_native/etc/apk/keys
(002273) [19:10:07] % sudo mount --bind /home/build/.local/var/pmbootstrap/config_apk_keys /home/build/.local/var/pmbootstrap/chroot_native/etc/apk/keys
(002273) [19:10:07] % sudo mkdir -p /home/build/.local/var/pmbootstrap/packages/stable-next
(002273) [19:10:07] % sudo mkdir -p /home/build/.local/var/pmbootstrap/chroot_native/mnt/pmbootstrap-packages
(002273) [19:10:07] % sudo mount --bind /home/build/.local/var/pmbootstrap/packages/stable-next /home/build/.local/var/pmbootstrap/chroot_native/mnt/pmbootstrap-packages
(002273) [19:10:07] Download http://dl-2.alpinelinux.org/alpine/v3.13/main/x86_64/apk-tools-static-2.12.1-r0.apk
(002273) [19:10:09] sigfilename: sbin/apk.static.SIGN.RSA.alpine-devel@lists.alpinelinux.org-4a6a0840.rsa.pub
(002273) [19:10:09] sigkey: alpine-devel@lists.alpinelinux.org-4a6a0840.rsa.pub
(002273) [19:10:10] extracted: /tmp/pmbootstrap57bxgl8fapk
(002273) [19:10:10] extracted: /tmp/pmbootstrapbragmo5fsig
(002273) [19:10:10] Verify apk.static signature with /home/build/pmbootstrap/pmb/data/keys/alpine-devel@lists.alpinelinux.org-4a6a0840.rsa.pub
(002273) [19:10:10] % openssl dgst -sha1 -verify /home/build/pmbootstrap/pmb/data/keys/alpine-devel@lists.alpinelinux.org-4a6a0840.rsa.pub -signature /tmp/pmbootstrapbragmo5fsig /tmp/pmbootstrap57bxgl8fapk
Verified OK
(002273) [19:10:10] Verify the version reported by the apk.static binary (must match the package version 2.12.1-r0)
(002273) [19:10:10] % /tmp/pmbootstrap57bxgl8fapk --version
apk-tools 2.12.1, compiled for x86_64.
(002273) [19:10:10] (native) install alpine-base
(002273) [19:10:10] % sudo ln -s -f /var/cache/apk /home/build/.local/var/pmbootstrap/chroot_native/etc/apk/cache
(002273) [19:10:10] % sudo cp /home/build/pmbootstrap/pmb/data/keys/alpine-devel@lists.alpinelinux.org-4a6a0840.rsa.pub /home/build/.local/var/pmbootstrap/config_apk_keys/
(002273) [19:10:10] % sudo cp /home/build/pmbootstrap/pmb/data/keys/alpine-devel@lists.alpinelinux.org-58e4f17d.rsa.pub /home/build/.local/var/pmbootstrap/config_apk_keys/
(002273) [19:10:10] % sudo cp /home/build/pmbootstrap/pmb/data/keys/alpine-devel@lists.alpinelinux.org-5243ef4b.rsa.pub /home/build/.local/var/pmbootstrap/config_apk_keys/
(002273) [19:10:10] % sudo cp /home/build/pmbootstrap/pmb/data/keys/alpine-devel@lists.alpinelinux.org-524d27bb.rsa.pub /home/build/.local/var/pmbootstrap/config_apk_keys/
(002273) [19:10:10] % sudo cp /home/build/pmbootstrap/pmb/data/keys/alpine-devel@lists.alpinelinux.org-58cbb476.rsa.pub /home/build/.local/var/pmbootstrap/config_apk_keys/
(002273) [19:10:10] % sudo cp /home/build/pmbootstrap/pmb/data/keys/alpine-devel@lists.alpinelinux.org-58199dcc.rsa.pub /home/build/.local/var/pmbootstrap/config_apk_keys/
(002273) [19:10:10] % sudo cp /home/build/pmbootstrap/pmb/data/keys/wip.rsa.pub /home/build/.local/var/pmbootstrap/config_apk_keys/
(002273) [19:10:10] % sudo cp /home/build/pmbootstrap/pmb/data/keys/build.postmarketos.org.rsa.pub /home/build/.local/var/pmbootstrap/config_apk_keys/
(002273) [19:10:10] % sudo cp /home/build/pmbootstrap/pmb/data/keys/alpine-devel@lists.alpinelinux.org-5261cecb.rsa.pub /home/build/.local/var/pmbootstrap/config_apk_keys/
(002273) [19:10:10] % sudo cp /etc/resolv.conf /home/build/.local/var/pmbootstrap/chroot_native/etc/resolv.conf
(002273) [19:10:10] % sudo mkdir -p /home/build/.local/var/pmbootstrap/chroot_native/etc/apk
(002273) [19:10:10] (native) update /etc/apk/repositories
(002273) [19:10:10] % sudo sh -c echo /mnt/pmbootstrap-packages >> /home/build/.local/var/pmbootstrap/chroot_native/etc/apk/repositories
(002273) [19:10:10] % sudo sh -c echo http://build.postmarketos.org/wip/v21.03 >> /home/build/.local/var/pmbootstrap/chroot_native/etc/apk/repositories
(002273) [19:10:10] % sudo sh -c echo http://mirror.postmarketos.org/postmarketos/v21.03 >> /home/build/.local/var/pmbootstrap/chroot_native/etc/apk/repositories
(002273) [19:10:10] % sudo sh -c echo http://dl-2.alpinelinux.org/alpine/v3.13/main >> /home/build/.local/var/pmbootstrap/chroot_native/etc/apk/repositories
(002273) [19:10:10] % sudo sh -c echo http://dl-2.alpinelinux.org/alpine/v3.13/community >> /home/build/.local/var/pmbootstrap/chroot_native/etc/apk/repositories
(002273) [19:10:10] % sudo mkdir -p /home/build/.local/var/pmbootstrap/tmp
(002273) [19:10:10] % sudo mkfifo /home/build/.local/var/pmbootstrap/tmp/apk_progress_fifo
(002273) [19:10:10] % sudo cat /home/build/.local/var/pmbootstrap/tmp/apk_progress_fifo
(002273) [19:10:10] % sudo sh -c exec 3>/home/build/.local/var/pmbootstrap/tmp/apk_progress_fifo; /home/build/.local/var/pmbootstrap/apk.static --no-progress --progress-fd 3 --root /home/build/.local/var/pmbootstrap/chroot_native --cache-dir /home/build/.local/var/pmbootstrap/cache_apk_x86_64 --initdb --arch x86_64 add alpine-base
(002273) [19:10:10] New background process: pid=2339, output=background
WARNING: Ignoring /mnt/pmbootstrap-packages: No such file or directory
fetch http://mirror.postmarketos.org/postmarketos/v21.03/x86_64/APKINDEX.tar.gz
ERROR: http://mirror.postmarketos.org/postmarketos/v21.03: No such file or directory
WARNING: Ignoring http://mirror.postmarketos.org/postmarketos/v21.03: No such file or directory
(1/20) Installing musl (1.2.2-r0)
(2/20) Installing busybox (1.32.1-r3)
Executing busybox-1.32.1-r3.post-install
(3/20) Installing alpine-baselayout (3.2.0-r8)
Executing alpine-baselayout-3.2.0-r8.pre-install
Executing alpine-baselayout-3.2.0-r8.post-install
(4/20) Installing ifupdown-ng (0.10.2-r2)
(5/20) Installing openrc (0.42.1-r19)
Executing openrc-0.42.1-r19.post-install
(6/20) Installing alpine-conf (3.11.0-r2)
(7/20) Installing libcrypto1.1 (1.1.1j-r0)
(8/20) Installing libssl1.1 (1.1.1j-r0)
(9/20) Installing ca-certificates-bundle (20191127-r5)
(10/20) Installing libtls-standalone (2.9.1-r1)
(11/20) Installing ssl_client (1.32.1-r3)
(12/20) Installing zlib (1.2.11-r3)
(13/20) Installing apk-tools (2.12.1-r0)
(14/20) Installing busybox-suid (1.32.1-r3)
(15/20) Installing busybox-initscripts (3.2-r2)
Executing busybox-initscripts-3.2-r2.post-install
(16/20) Installing scanelf (1.2.8-r0)
(17/20) Installing musl-utils (1.2.2-r0)
(18/20) Installing libc-utils (0.7.2-r3)
(19/20) Installing alpine-keys (2.2-r0)
(20/20) Installing alpine-base (3.13.2-r0)
Executing busybox-1.32.1-r3.trigger
OK: 9 MiB in 20 packages
(002273) [19:10:11] (native) % adduser -D pmos -u 12345
(002273) [19:10:11] (native) % busybox su pmos -c HOME=/home/pmos ln -s /mnt/pmbootstrap-abuild-config /home/pmos/.abuild
(002273) [19:10:11] (native) % chown pmos:pmos /mnt/pmbootstrap-abuild-config
(002273) [19:10:11] (native) % busybox su pmos -c HOME=/home/pmos ln -s /mnt/pmbootstrap-ccache /home/pmos/.ccache
(002273) [19:10:11] (native) % chown pmos:pmos /mnt/pmbootstrap-ccache
(002273) [19:10:11] (native) % busybox su pmos -c HOME=/home/pmos mkdir -p /home/pmos/packages
(002273) [19:10:11] (native) % busybox su pmos -c HOME=/home/pmos ln -s /mnt/pmbootstrap-packages /home/pmos/packages/pmos
(002273) [19:10:11] (native) % chown pmos:pmos /mnt/pmbootstrap-packages
(002273) [19:10:11] (native) % busybox su pmos -c HOME=/home/pmos mkdir -p /home/pmos/.cargo/registry
(002273) [19:10:11] (native) % mkdir -p /mnt/pmbootstrap-rust/registry/index
(002273) [19:10:11] (native) % busybox su pmos -c HOME=/home/pmos ln -s /mnt/pmbootstrap-rust/registry/index /home/pmos/.cargo/registry/index
(002273) [19:10:11] (native) % chown pmos:pmos /mnt/pmbootstrap-rust/registry/index
(002273) [19:10:11] (native) % mkdir -p /mnt/pmbootstrap-rust/registry/cache
(002273) [19:10:11] (native) % busybox su pmos -c HOME=/home/pmos ln -s /mnt/pmbootstrap-rust/registry/cache /home/pmos/.cargo/registry/cache
(002273) [19:10:11] (native) % chown pmos:pmos /mnt/pmbootstrap-rust/registry/cache
(002273) [19:10:11] (native) % busybox su pmos -c HOME=/home/pmos mkdir -p /home/pmos/.cargo/git
(002273) [19:10:11] (native) % mkdir -p /mnt/pmbootstrap-rust/git/db
(002273) [19:10:11] (native) % busybox su pmos -c HOME=/home/pmos ln -s /mnt/pmbootstrap-rust/git/db /home/pmos/.cargo/git/db
(002273) [19:10:11] (native) % chown pmos:pmos /mnt/pmbootstrap-rust/git/db
(002273) [19:10:11] (native) calculate depends of abuild, build-base, ccache, git (pmbootstrap -v for details)
(002273) [19:10:11] (native) install abuild build-base ccache git
(002273) [19:10:11] % sudo mkfifo /home/build/.local/var/pmbootstrap/chroot_native/tmp/apk_progress_fifo
(002273) [19:10:11] (native) % cat /tmp/apk_progress_fifo
(002273) [19:10:11] (native) % sh -c exec 3>/tmp/apk_progress_fifo; apk --no-progress --progress-fd 3 add -u --virtual .pmbootstrap abuild build-base ccache git fakeroot openssl attr tar pkgconf patch lzip curl binutils file gcc g++ make libc-dev fortify-headers libcurl expat pcre2 libattr libacl libgcc libstdc++ ca-certificates libmagic libgomp libatomic libgphobos gmp isl22 mpc1 mpfr4 musl-dev brotli-libs nghttp2-libs
(002273) [19:10:11] New background process: pid=2375, output=background
WARNING: Ignoring /mnt/pmbootstrap-packages: No such file or directory
fetch http://mirror.postmarketos.org/postmarketos/v21.03/x86_64/APKINDEX.tar.gz
ERROR: http://mirror.postmarketos.org/postmarketos/v21.03: No such file or directory
WARNING: Ignoring http://mirror.postmarketos.org/postmarketos/v21.03: No such file or directory
(1/39) Installing fakeroot (1.25.3-r3)
(2/39) Installing openssl (1.1.1j-r0)
(3/39) Installing libattr (2.4.48-r0)
(4/39) Installing attr (2.4.48-r0)
(5/39) Installing libacl (2.2.53-r0)
(6/39) Installing tar (1.33-r1)
(7/39) Installing pkgconf (1.7.3-r0)
(8/39) Installing patch (2.7.6-r6)
(9/39) Installing libgcc (10.2.1_pre1-r3)
(10/39) Installing libstdc++ (10.2.1_pre1-r3)
(11/39) Installing lzip (1.21-r0)
(12/39) Installing ca-certificates (20191127-r5)
(13/39) Installing brotli-libs (1.0.9-r3)
(14/39) Installing nghttp2-libs (1.42.0-r1)
(15/39) Installing libcurl (7.74.0-r0)
(16/39) Installing curl (7.74.0-r0)
(17/39) Installing abuild (3.7.0-r0)
Executing abuild-3.7.0-r0.pre-install
(18/39) Installing binutils (2.35.1-r1)
(19/39) Installing libmagic (5.39-r0)
(20/39) Installing file (5.39-r0)
(21/39) Installing libgomp (10.2.1_pre1-r3)
(22/39) Installing libatomic (10.2.1_pre1-r3)
(23/39) Installing libgphobos (10.2.1_pre1-r3)
(24/39) Installing gmp (6.2.1-r0)
(25/39) Installing isl22 (0.22-r0)
(26/39) Installing mpfr4 (4.1.0-r0)
(27/39) Installing mpc1 (1.2.0-r0)
(28/39) Installing gcc (10.2.1_pre1-r3)
(29/39) Installing musl-dev (1.2.2-r0)
(30/39) Installing libc-dev (0.7.2-r3)
(31/39) Installing g++ (10.2.1_pre1-r3)
(32/39) Installing make (4.3-r0)
(33/39) Installing fortify-headers (1.1-r0)
(34/39) Installing build-base (0.5-r2)
(35/39) Installing ccache (3.7.12-r0)
(36/39) Installing expat (2.2.10-r1)
(37/39) Installing pcre2 (10.36-r0)
(38/39) Installing git (2.30.1-r0)
(39/39) Installing .pmbootstrap (20210221.191012)
Executing busybox-1.32.1-r3.trigger
Executing ca-certificates-20191127-r5.trigger
OK: 213 MiB in 59 packages
(002273) [19:10:26] (native) % apk --no-progress add abuild build-base ccache git
WARNING: Ignoring /mnt/pmbootstrap-packages: No such file or directory
fetch http://mirror.postmarketos.org/postmarketos/v21.03/x86_64/APKINDEX.tar.gz
ERROR: http://mirror.postmarketos.org/postmarketos/v21.03: No such file or directory
WARNING: Ignoring http://mirror.postmarketos.org/postmarketos/v21.03: No such file or directory
OK: 213 MiB in 59 packages
(002273) [19:10:26] (native) % apk --no-progress del .pmbootstrap
WARNING: Ignoring /mnt/pmbootstrap-packages: No such file or directory
WARNING: Ignoring http://mirror.postmarketos.org/postmarketos/v21.03: No such file or directory
(1/1) Purging .pmbootstrap (20210221.191012)
OK: 213 MiB in 58 packages
(002273) [19:10:26] (native) % chown root:abuild /var/cache/distfiles
(002273) [19:10:26] (native) % chmod g+w /var/cache/distfiles
(002273) [19:10:26] (native) generate abuild keys
(002273) [19:10:26] (native) % busybox su pmos -c HOME=/home/pmos abuild-keygen -n -q -a
Generating RSA private key, 2048 bit long modulus (2 primes)
......................+++++
.............................+++++
e is 65537 (0x010001)
writing RSA key
(002273) [19:10:27] (native) % cp /mnt/pmbootstrap-abuild-config/pmos-6032b022.rsa.pub /etc/apk/keys/
(002273) [19:10:27] (native) % cp /tmp/gzip_wrapper.sh /usr/local/bin/gzip
(002273) [19:10:27] (native) % chmod +x /usr/local/bin/gzip
(002273) [19:10:27] (native) % adduser pmos abuild
(002273) [19:10:27] (native) % sed -i -e s/^CLEANUP=.*/CLEANUP=''/ /etc/abuild.conf
(002273) [19:10:27] (native) % sed -i -e s/^ERROR_CLEANUP=.*/ERROR_CLEANUP=''/ /etc/abuild.conf
(002273) [19:10:27] (native) % touch /var/local/pmbootstrap_chroot_build_init_done
(002273) [19:10:27] (native) % sed -i -e s/^export JOBS=.*/export JOBS=3/ /etc/abuild.conf
(002273) [19:10:27] (native) % busybox su pmos -c HOME=/home/pmos ccache --max-size 5G
Set cache size limit to 5.0 GB
(002273) [19:10:27] (native) build x86_64/mapbox-gl-native-1.5.0.3-r0.apk
(002273) [19:10:27] % sudo cp -rL /home/build/pmaports/main/mapbox-gl-native/ /home/build/.local/var/pmbootstrap/chroot_native/home/pmos/build
(002273) [19:10:27] (native) % chown -R pmos:pmos /home/pmos/build
(002273) [19:10:27] % sudo mkdir -p /home/build/.local/var/pmbootstrap/chroot_native/mnt/pmaports
(002273) [19:10:27] % sudo mount --bind /home/build/pmaports /home/build/.local/var/pmbootstrap/chroot_native/mnt/pmaports
(002273) [19:10:27] (native) % busybox su pmos -c HOME=/home/pmos mkdir -p /home/pmos/build
(002273) [19:10:27] (native) % busybox su pmos -c HOME=/home/pmos ln -sf /mnt/pmaports/.git /home/pmos/build/.git
(002273) [19:10:27] (native) % cd /home/pmos/build; busybox su pmos -c CARCH=x86_64 SUDO_APK='abuild-apk --no-progress' CCACHE_DISABLE=1 HOME=/home/pmos abuild -D postmarketOS -r -f
]0;abuild: mapbox-gl-native>>> mapbox-gl-native: Building pmos/mapbox-gl-native 1.5.0.3-r0 (using abuild 3.7.0-r0) started Sun, 21 Feb 2021 19:10:27 +0000
>>> mapbox-gl-native: Checking sanity of /home/pmos/build/APKBUILD...
>>> mapbox-gl-native: Analyzing dependencies...
>>> mapbox-gl-native: Installing for build: build-base qt5-qtbase-dev icu-dev
WARNING: Ignoring /home/pmos/packages//pmos: No such file or directory
WARNING: Ignoring /mnt/pmbootstrap-packages: No such file or directory
fetch http://mirror.postmarketos.org/postmarketos/v21.03/x86_64/APKINDEX.tar.gz
ERROR: http://mirror.postmarketos.org/postmarketos/v21.03: No such file or directory
WARNING: Ignoring http://mirror.postmarketos.org/postmarketos/v21.03: No such file or directory
(1/157) Installing dbus-libs (1.12.20-r1)
(2/157) Installing libffi (3.3-r2)
(3/157) Installing libintl (0.20.2-r2)
(4/157) Installing libblkid (2.36.1-r1)
(5/157) Installing libmount (2.36.1-r1)
(6/157) Installing pcre (8.44-r0)
(7/157) Installing glib (2.66.7-r0)
(8/157) Installing icu-libs (67.1-r2)
(9/157) Installing libpcre2-16 (10.36-r0)
(10/157) Installing qt5-qtbase (5.15.2-r0)
(11/157) Installing sqlite-libs (3.34.1-r0)
(12/157) Installing qt5-qtbase-sqlite (5.15.2-r0)
(13/157) Installing ncurses-terminfo-base (6.2_p20210109-r0)
(14/157) Installing ncurses-libs (6.2_p20210109-r0)
(15/157) Installing readline (8.1.0-r0)
(16/157) Installing unixodbc (2.3.9-r1)
(17/157) Installing qt5-qtbase-odbc (5.15.2-r0)
(18/157) Installing gdbm (1.19-r0)
(19/157) Installing libsasl (2.1.27-r10)
(20/157) Installing libldap (2.4.57-r0)
(21/157) Installing libpq (13.1-r2)
(22/157) Installing qt5-qtbase-postgresql (5.15.2-r0)
(23/157) Installing mariadb-connector-c (3.1.11-r0)
(24/157) Installing qt5-qtbase-mysql (5.15.2-r0)
(25/157) Installing freetds (1.2.18-r0)
(26/157) Installing qt5-qtbase-tds (5.15.2-r0)
(27/157) Installing hicolor-icon-theme (0.17-r1)
(28/157) Installing mesa (20.3.3-r0)
(29/157) Installing libxau (1.0.9-r0)
(30/157) Installing libbsd (0.10.0-r0)
(31/157) Installing libxdmcp (1.1.3-r0)
(32/157) Installing libxcb (1.14-r1)
(33/157) Installing libx11 (1.7.0-r0)
(34/157) Installing libpciaccess (0.16-r0)
(35/157) Installing libdrm (2.4.104-r0)
(36/157) Installing wayland-libs-server (1.18.0-r5)
(37/157) Installing mesa-gbm (20.3.3-r0)
(38/157) Installing mesa-glapi (20.3.3-r0)
(39/157) Installing wayland-libs-client (1.18.0-r5)
(40/157) Installing libxdamage (1.1.5-r1)
(41/157) Installing libxext (1.3.4-r0)
(42/157) Installing libxfixes (5.0.3-r2)
(43/157) Installing libxxf86vm (1.1.4-r2)
(44/157) Installing libxshmfence (1.3-r1)
(45/157) Installing mesa-gl (20.3.3-r0)
(46/157) Installing qt5-qtdeclarative (5.15.2-r0)
(47/157) Installing libxcomposite (0.4.5-r0)
(48/157) Installing libbz2 (1.0.8-r1)
(49/157) Installing libpng (1.6.37-r1)
(50/157) Installing freetype (2.10.4-r1)
(51/157) Installing libuuid (2.36.1-r1)
(52/157) Installing fontconfig (2.13.1-r3)
(53/157) Installing wayland-libs-cursor (1.18.0-r5)
(54/157) Installing wayland-libs-egl (1.18.0-r5)
(55/157) Installing xkeyboard-config (2.31-r0)
(56/157) Installing xz-libs (5.2.5-r0)
(57/157) Installing libxml2 (2.9.10-r6)
(58/157) Installing libxkbcommon (1.0.3-r0)
(59/157) Installing qt5-qtwayland (5.15.2-r0)
(60/157) Installing mesa-egl (20.3.3-r0)
(61/157) Installing libice (1.0.10-r0)
(62/157) Installing libsm (1.2.3-r0)
(63/157) Installing avahi-libs (0.8-r2)
(64/157) Installing nettle (3.7-r0)
(65/157) Installing p11-kit (0.23.22-r0)
(66/157) Installing libtasn1 (4.16.0-r1)
(67/157) Installing libunistring (0.9.10-r0)
(68/157) Installing gnutls (3.7.0-r0)
(69/157) Installing cups-libs (2.3.3-r1)
(70/157) Installing graphite2 (1.3.14-r0)
(71/157) Installing harfbuzz (2.7.4-r1)
(72/157) Installing libevdev (1.10.1-r0)
(73/157) Installing mtdev (1.1.6-r0)
(74/157) Installing eudev-libs (3.2.9-r3)
(75/157) Installing libinput-libs (1.16.4-r0)
(76/157) Installing libjpeg-turbo (2.0.6-r0)
(77/157) Installing xcb-util-wm (0.4.1-r1)
(78/157) Installing xcb-util (0.4.0-r3)
(79/157) Installing xcb-util-image (0.4.0-r1)
(80/157) Installing xcb-util-keysyms (0.4.0-r1)
(81/157) Installing xcb-util-renderutil (0.3.9-r1)
(82/157) Installing libxkbcommon-x11 (1.0.3-r0)
(83/157) Installing qt5-qtbase-x11 (5.15.2-r0)
(84/157) Installing qt5-qtbase-dbg (5.15.2-r0)
(85/157) Installing blkid (2.36.1-r1)
(86/157) Installing libcap-ng (0.8.2-r0)
(87/157) Installing setpriv (2.36.1-r1)
(88/157) Installing libsmartcols (2.36.1-r1)
(89/157) Installing findmnt (2.36.1-r1)
(90/157) Installing mcookie (2.36.1-r1)
(91/157) Installing hexdump (2.36.1-r1)
(92/157) Installing lsblk (2.36.1-r1)
(93/157) Installing libfdisk (2.36.1-r1)
(94/157) Installing sfdisk (2.36.1-r1)
(95/157) Installing cfdisk (2.36.1-r1)
(96/157) Installing partx (2.36.1-r1)
(97/157) Installing libeconf (0.3.8-r0)
(98/157) Installing util-linux (2.36.1-r1)
(99/157) Installing util-linux-dev (2.36.1-r1)
(100/157) Installing dbus-dev (1.12.20-r1)
(101/157) Installing expat-dev (2.2.10-r1)
(102/157) Installing brotli-dev (1.0.9-r3)
(103/157) Installing zlib-dev (1.2.11-r3)
(104/157) Installing libpng-dev (1.6.37-r1)
(105/157) Installing freetype-dev (2.10.4-r1)
(106/157) Installing fontconfig-dev (2.13.1-r3)
(107/157) Installing python3 (3.8.7-r1)
(108/157) Installing gettext-asprintf (0.20.2-r2)
(109/157) Installing gettext-libs (0.20.2-r2)
(110/157) Installing gettext (0.20.2-r2)
(111/157) Installing gettext-dev (0.20.2-r2)
(112/157) Installing bzip2-dev (1.0.8-r1)
(113/157) Installing libxml2-utils (2.9.10-r6)
(114/157) Installing libgpg-error (1.41-r0)
(115/157) Installing libgcrypt (1.8.7-r0)
(116/157) Installing libxslt (1.1.34-r0)
(117/157) Installing docbook-xml (4.5-r6)
Executing docbook-xml-4.5-r6.post-install
(118/157) Installing docbook-xsl (1.79.2-r2)
Executing docbook-xsl-1.79.2-r2.post-install
(119/157) Installing linux-headers (5.7.8-r0)
(120/157) Installing libffi-dev (3.3-r2)
(121/157) Installing libpcre16 (8.44-r0)
(122/157) Installing libpcre32 (8.44-r0)
(123/157) Installing libpcrecpp (8.44-r0)
(124/157) Installing pcre-dev (8.44-r0)
(125/157) Installing glib-dev (2.66.7-r0)
(126/157) Installing xorgproto (2020.1-r0)
(127/157) Installing libice-dev (1.0.10-r0)
(128/157) Installing libsm-dev (1.2.3-r0)
(129/157) Installing libxau-dev (1.0.9-r0)
(130/157) Installing xcb-proto (1.14.1-r0)
(131/157) Installing libxdmcp-dev (1.1.3-r0)
(132/157) Installing libxcb-dev (1.14-r1)
(133/157) Installing xtrans (1.4.0-r1)
(134/157) Installing libx11-dev (1.7.0-r0)
(135/157) Installing libxext-dev (1.3.4-r0)
(136/157) Installing libdrm-dev (2.4.104-r0)
(137/157) Installing libxfixes-dev (5.0.3-r2)
(138/157) Installing libxdamage-dev (1.1.5-r1)
(139/157) Installing libxshmfence-dev (1.3-r1)
(140/157) Installing mesa-gles (20.3.3-r0)
(141/157) Installing llvm10-libs (10.0.1-r1)
(142/157) Installing zstd-libs (1.4.5-r3)
(143/157) Installing mesa-osmesa (20.3.3-r0)
(144/157) Installing mesa-xatracker (20.3.3-r0)
(145/157) Installing libxxf86vm-dev (1.1.4-r2)
(146/157) Installing mesa-dev (20.3.3-r0)
(147/157) Installing openssl-dev (1.1.1j-r0)
(148/157) Installing perl (5.32.0-r0)
(149/157) Installing sqlite-dev (3.34.1-r0)
(150/157) Installing qt5-qtbase-dev (5.15.2-r0)
(151/157) Installing icu (67.1-r2)
(152/157) Installing icu-dev (67.1-r2)
(153/157) Installing .makedepends-mapbox-gl-native (20210221.191028)
(154/157) Installing util-linux-openrc (2.36.1-r1)
(155/157) Installing perl-error (0.17029-r1)
(156/157) Installing perl-git (2.30.1-r0)
(157/157) Installing git-perl (2.30.1-r0)
Executing busybox-1.32.1-r3.trigger
Executing glib-2.66.7-r0.trigger
No schema files found: doing nothing.
OK: 723 MiB in 215 packages
]0;>>> mapbox-gl-native: Cleaning up srcdir
]0;>>> mapbox-gl-native: Cleaning up pkgdir
>>> mapbox-gl-native: Fetching mapbox-gl-native-lib-0d63f5661ed15d43fbbf0462d82c85e634a2e8d7.pro::https://raw.githubusercontent.com/rinigus/pkg-mapbox-gl-native/0d63f5661ed15d43fbbf0462d82c85e634a2e8d7/mapbox-gl-native-lib.pro
  % Total    % Received % Xferd  Average Speed   Time    Time     Time  Current
                                 Dload  Upload   Total   Spent    Left  Speed

  0     0    0     0    0     0      0      0 --:--:-- --:--:-- --:--:--     0
100 16969  100 16969    0     0   436k      0 --:--:-- --:--:-- --:--:--  436k
>>> mapbox-gl-native: Fetching mapbox-gl-native-974c87bd9cc25b7f0a2fc31adcc51df4db694270.tar.gz::https://github.com/rinigus/mapbox-gl-native/archive/974c87bd9cc25b7f0a2fc31adcc51df4db694270.tar.gz
  % Total    % Received % Xferd  Average Speed   Time    Time     Time  Current
                                 Dload  Upload   Total   Spent    Left  Speed

  0     0    0     0    0     0      0      0 --:--:-- --:--:-- --:--:--     0
100   166    0   166    0     0   1551      0 --:--:-- --:--:-- --:--:--  1551

100 1298k    0 1298k    0     0  2013k      0 --:--:-- --:--:-- --:--:-- 2013k
100 3634k    0 3634k    0     0  3239k      0 --:--:--  0:00:01 --:--:-- 4907k
>>> mapbox-gl-native: Fetching mapbox-gl-native-lib-0d63f5661ed15d43fbbf0462d82c85e634a2e8d7.pro::https://raw.githubusercontent.com/rinigus/pkg-mapbox-gl-native/0d63f5661ed15d43fbbf0462d82c85e634a2e8d7/mapbox-gl-native-lib.pro
>>> mapbox-gl-native: Fetching mapbox-gl-native-974c87bd9cc25b7f0a2fc31adcc51df4db694270.tar.gz::https://github.com/rinigus/mapbox-gl-native/archive/974c87bd9cc25b7f0a2fc31adcc51df4db694270.tar.gz
>>> mapbox-gl-native: Checking sha512sums...
mapbox-gl-native-lib-0d63f5661ed15d43fbbf0462d82c85e634a2e8d7.pro: OK
mapbox-gl-native-974c87bd9cc25b7f0a2fc31adcc51df4db694270.tar.gz: OK
>>> mapbox-gl-native: Unpacking /var/cache/distfiles/mapbox-gl-native-974c87bd9cc25b7f0a2fc31adcc51df4db694270.tar.gz...
Info: creating stash file /home/pmos/build/src/mapbox-gl-native-974c87bd9cc25b7f0a2fc31adcc51df4db694270/.qmake.stash
g++ -c -pipe -DNDEBUG -DQT_IMAGE_DECODERS -DQT_BUILD_MAPBOXGL_LIB -DRAPIDJSON_HAS_STDSTRING=1 -DMBGL_USE_GLES2 -D__QT__ -O3 -ftemplate-depth=1024 -fvisibility-inlines-hidden -fvisibility=hidden -DMBGL_VERSION_REV=\"qt-v1.5.0\" -Os -fomit-frame-pointer -g -std=gnu++1y -w -D_REENTRANT -fPIC -DQT_NO_DEBUG -DQT_GUI_LIB -DQT_NETWORK_LIB -DQT_SQL_LIB -DQT_CORE_LIB -I. -Ideps/boost/1.65.1 -Ideps/boost/1.65.1/include -Ideps/earcut/0.12.4 -Ideps/earcut/0.12.4/include -Ideps/geojson/0.4.2 -Ideps/geojson/0.4.2/include -Ideps/geojsonvt/6.5.1 -Ideps/geojsonvt/6.5.1/include -Ideps/geometry/0.9.3 -Ideps/geometry/0.9.3/include -Ideps/kdbush/0.1.1-1 -Ideps/kdbush/0.1.1-1/include -Ideps/optional/f27e7908 -Ideps/optional/f27e7908/include -Ideps/polylabel/1.0.3 -Ideps/polylabel/1.0.3/include -Ideps/protozero/1.5.2 -Ideps/protozero/1.5.2/include -Ideps/rapidjson/1.1.0 -Ideps/rapidjson/1.1.0/include -Ideps/shelf-pack/2.1.1 -Ideps/shelf-pack/2.1.1/include -Ideps/supercluster/0.2.2 -Ideps/supercluster/0.2.2/include -Ideps/tao_tuple/28626e99 -Ideps/tao_tuple/28626e99/include -Ideps/unique_resource/cba309e -Ideps/unique_resource/cba309e/include -Ideps/variant/1.1.4 -Ideps/variant/1.1.4/include -Ideps/vector-tile/1.0.2 -Ideps/vector-tile/1.0.2/include -Ideps/wagyu/0.4.3 -Ideps/wagyu/0.4.3/include -Iinclude -Iplatform/default -Iplatform/qt -Iplatform/qt/include -Isrc -Ivendor/nunicode/include -I/usr/include/QtGui -I/usr/include/QtNetwork -I/usr/include/QtSql -I/usr/include/QtCore -I. -I/usr/include/libdrm -I/usr/lib/qt5/mkspecs/linux-g++ -o platform/qt/src/thread.o platform/qt/src/thread.cpp
g++ -c -pipe -DNDEBUG -DQT_IMAGE_DECODERS -DQT_BUILD_MAPBOXGL_LIB -DRAPIDJSON_HAS_STDSTRING=1 -DMBGL_USE_GLES2 -D__QT__ -O3 -ftemplate-depth=1024 -fvisibility-inlines-hidden -fvisibility=hidden -DMBGL_VERSION_REV=\"qt-v1.5.0\" -Os -fomit-frame-pointer -g -std=gnu++1y -w -D_REENTRANT -fPIC -DQT_NO_DEBUG -DQT_GUI_LIB -DQT_NETWORK_LIB -DQT_SQL_LIB -DQT_CORE_LIB -I. -Ideps/boost/1.65.1 -Ideps/boost/1.65.1/include -Ideps/earcut/0.12.4 -Ideps/earcut/0.12.4/include -Ideps/geojson/0.4.2 -Ideps/geojson/0.4.2/include -Ideps/geojsonvt/6.5.1 -Ideps/geojsonvt/6.5.1/include -Ideps/geometry/0.9.3 -Ideps/geometry/0.9.3/include -Ideps/kdbush/0.1.1-1 -Ideps/kdbush/0.1.1-1/include -Ideps/optional/f27e7908 -Ideps/optional/f27e7908/include -Ideps/polylabel/1.0.3 -Ideps/polylabel/1.0.3/include -Ideps/protozero/1.5.2 -Ideps/protozero/1.5.2/include -Ideps/rapidjson/1.1.0 -Ideps/rapidjson/1.1.0/include -Ideps/shelf-pack/2.1.1 -Ideps/shelf-pack/2.1.1/include -Ideps/supercluster/0.2.2 -Ideps/supercluster/0.2.2/include -Ideps/tao_tuple/28626e99 -Ideps/tao_tuple/28626e99/include -Ideps/unique_resource/cba309e -Ideps/unique_resource/cba309e/include -Ideps/variant/1.1.4 -Ideps/variant/1.1.4/include -Ideps/vector-tile/1.0.2 -Ideps/vector-tile/1.0.2/include -Ideps/wagyu/0.4.3 -Ideps/wagyu/0.4.3/include -Iinclude -Iplatform/default -Iplatform/qt -Iplatform/qt/include -Isrc -Ivendor/nunicode/include -I/usr/include/QtGui -I/usr/include/QtNetwork -I/usr/include/QtSql -I/usr/include/QtCore -I. -I/usr/include/libdrm -I/usr/lib/qt5/mkspecs/linux-g++ -o platform/default/bidi.o platform/default/bidi.cpp
g++ -c -pipe -DNDEBUG -DQT_IMAGE_DECODERS -DQT_BUILD_MAPBOXGL_LIB -DRAPIDJSON_HAS_STDSTRING=1 -DMBGL_USE_GLES2 -D__QT__ -O3 -ftemplate-depth=1024 -fvisibility-inlines-hidden -fvisibility=hidden -DMBGL_VERSION_REV=\"qt-v1.5.0\" -Os -fomit-frame-pointer -g -std=gnu++1y -w -D_REENTRANT -fPIC -DQT_NO_DEBUG -DQT_GUI_LIB -DQT_NETWORK_LIB -DQT_SQL_LIB -DQT_CORE_LIB -I. -Ideps/boost/1.65.1 -Ideps/boost/1.65.1/include -Ideps/earcut/0.12.4 -Ideps/earcut/0.12.4/include -Ideps/geojson/0.4.2 -Ideps/geojson/0.4.2/include -Ideps/geojsonvt/6.5.1 -Ideps/geojsonvt/6.5.1/include -Ideps/geometry/0.9.3 -Ideps/geometry/0.9.3/include -Ideps/kdbush/0.1.1-1 -Ideps/kdbush/0.1.1-1/include -Ideps/optional/f27e7908 -Ideps/optional/f27e7908/include -Ideps/polylabel/1.0.3 -Ideps/polylabel/1.0.3/include -Ideps/protozero/1.5.2 -Ideps/protozero/1.5.2/include -Ideps/rapidjson/1.1.0 -Ideps/rapidjson/1.1.0/include -Ideps/shelf-pack/2.1.1 -Ideps/shelf-pack/2.1.1/include -Ideps/supercluster/0.2.2 -Ideps/supercluster/0.2.2/include -Ideps/tao_tuple/28626e99 -Ideps/tao_tuple/28626e99/include -Ideps/unique_resource/cba309e -Ideps/unique_resource/cba309e/include -Ideps/variant/1.1.4 -Ideps/variant/1.1.4/include -Ideps/vector-tile/1.0.2 -Ideps/vector-tile/1.0.2/include -Ideps/wagyu/0.4.3 -Ideps/wagyu/0.4.3/include -Iinclude -Iplatform/default -Iplatform/qt -Iplatform/qt/include -Isrc -Ivendor/nunicode/include -I/usr/include/QtGui -I/usr/include/QtNetwork -I/usr/include/QtSql -I/usr/include/QtCore -I. -I/usr/include/libdrm -I/usr/lib/qt5/mkspecs/linux-g++ -o platform/qt/src/async_task.o platform/qt/src/async_task.cpp
platform/default/bidi.cpp: In member function 'void mbgl::BiDi::mergeParagraphLineBreaks(std::set<long unsigned int>&)':
platform/default/bidi.cpp:63:24: error: 'runtime_error' is not a member of 'std'
   63 |             throw std::runtime_error(std::string("ProcessedBiDiText::mergeParagraphLineBreaks: ") +
      |                        ^~~~~~~~~~~~~
platform/default/bidi.cpp: In member function 'std::vector<std::__cxx11::basic_string<char16_t> > mbgl::BiDi::processText(const u16string&, std::set<long unsigned int>)':
platform/default/bidi.cpp:98:20: error: 'runtime_error' is not a member of 'std'
   98 |         throw std::runtime_error(std::string("BiDi::processText: ") + u_errorName(errorCode));
      |                    ^~~~~~~~~~~~~
g++ -c -pipe -DNDEBUG -DQT_IMAGE_DECODERS -DQT_BUILD_MAPBOXGL_LIB -DRAPIDJSON_HAS_STDSTRING=1 -DMBGL_USE_GLES2 -D__QT__ -O3 -ftemplate-depth=1024 -fvisibility-inlines-hidden -fvisibility=hidden -DMBGL_VERSION_REV=\"qt-v1.5.0\" -Os -fomit-frame-pointer -g -std=gnu++1y -w -D_REENTRANT -fPIC -DQT_NO_DEBUG -DQT_GUI_LIB -DQT_NETWORK_LIB -DQT_SQL_LIB -DQT_CORE_LIB -I. -Ideps/boost/1.65.1 -Ideps/boost/1.65.1/include -Ideps/earcut/0.12.4 -Ideps/earcut/0.12.4/include -Ideps/geojson/0.4.2 -Ideps/geojson/0.4.2/include -Ideps/geojsonvt/6.5.1 -Ideps/geojsonvt/6.5.1/include -Ideps/geometry/0.9.3 -Ideps/geometry/0.9.3/include -Ideps/kdbush/0.1.1-1 -Ideps/kdbush/0.1.1-1/include -Ideps/optional/f27e7908 -Ideps/optional/f27e7908/include -Ideps/polylabel/1.0.3 -Ideps/polylabel/1.0.3/include -Ideps/protozero/1.5.2 -Ideps/protozero/1.5.2/include -Ideps/rapidjson/1.1.0 -Ideps/rapidjson/1.1.0/include -Ideps/shelf-pack/2.1.1 -Ideps/shelf-pack/2.1.1/include -Ideps/supercluster/0.2.2 -Ideps/supercluster/0.2.2/include -Ideps/tao_tuple/28626e99 -Ideps/tao_tuple/28626e99/include -Ideps/unique_resource/cba309e -Ideps/unique_resource/cba309e/include -Ideps/variant/1.1.4 -Ideps/variant/1.1.4/include -Ideps/vector-tile/1.0.2 -Ideps/vector-tile/1.0.2/include -Ideps/wagyu/0.4.3 -Ideps/wagyu/0.4.3/include -Iinclude -Iplatform/default -Iplatform/qt -Iplatform/qt/include -Isrc -Ivendor/nunicode/include -I/usr/include/QtGui -I/usr/include/QtNetwork -I/usr/include/QtSql -I/usr/include/QtCore -I. -I/usr/include/libdrm -I/usr/lib/qt5/mkspecs/linux-g++ -o platform/qt/src/http_file_source.o platform/qt/src/http_file_source.cpp
platform/default/bidi.cpp: In member function 'std::u16string mbgl::BiDi::getLine(std::size_t, std::size_t)':
platform/default/bidi.cpp:109:20: error: 'runtime_error' is not a member of 'std'
  109 |         throw std::runtime_error(std::string("BiDi::getLine (setLine): ") + u_errorName(errorCode));
      |                    ^~~~~~~~~~~~~
platform/default/bidi.cpp:125:20: error: 'runtime_error' is not a member of 'std'
  125 |         throw std::runtime_error(std::string("BiDi::getLine (writeReordered): ") +
      |                    ^~~~~~~~~~~~~
make: *** [Makefile:1686: platform/default/bidi.o] Error 1
make: *** Waiting for unfinished jobs....
>>> ERROR: mapbox-gl-native: build failed
]0;(002273) [19:10:56] ^^^^^^^^^^^^^^^^^^^^^^^^^^^^^^^^^^^^^^^^^^^^^^^^^^^^^^^^^^^^^^^^^^^^^^
(002273) [19:10:56] NOTE: The failed command's output is above the ^^^ line in the log file: /home/build/.local/var/pmbootstrap/log.txt
(002273) [19:10:56] ERROR: Command failed: (native) % cd /home/pmos/build; busybox su pmos -c CARCH=x86_64 SUDO_APK='abuild-apk --no-progress' CCACHE_DISABLE=1 HOME=/home/pmos abuild -D postmarketOS -r -f
(002273) [19:10:56] See also: <https://postmarketos.org/troubleshooting>
(002273) [19:10:56] Traceback (most recent call last):
  File "/home/build/pmbootstrap/pmb/__init__.py", line 49, in main
    getattr(frontend, args.action)(args)
  File "/home/build/pmbootstrap/pmb/helpers/frontend.py", line 115, in build
    if not pmb.build.package(args, package, arch_package, force,
  File "/home/build/pmbootstrap/pmb/build/_package.py", line 517, in package
    (output, cmd, env) = run_abuild(args, apkbuild, arch, strict, force, cross,
  File "/home/build/pmbootstrap/pmb/build/_package.py", line 447, in run_abuild
    pmb.chroot.user(args, cmd, suffix, "/home/pmos/build", env=env)
  File "/home/build/pmbootstrap/pmb/chroot/user.py", line 26, in user
    return pmb.chroot.root(args, cmd, suffix, working_dir, output,
  File "/home/build/pmbootstrap/pmb/chroot/root.py", line 74, in root
    return pmb.helpers.run_core.core(args, msg, cmd_sudo, None, output,
  File "/home/build/pmbootstrap/pmb/helpers/run_core.py", line 342, in core
    check_return_code(args, code, log_message)
  File "/home/build/pmbootstrap/pmb/helpers/run_core.py", line 218, in check_return_code
    raise RuntimeError("Command failed: " + log_message)
RuntimeError: Command failed: (native) % cd /home/pmos/build; busybox su pmos -c CARCH=x86_64 SUDO_APK='abuild-apk --no-progress' CCACHE_DISABLE=1 HOME=/home/pmos abuild -D postmarketOS -r -f

Run 'pmbootstrap log' for details.
Build complete: failed 12 days ago (took a minute)