~postmarketos/#1185320

failed

Build package: master_staging_systemd/x86_64/devicepkg-dev-0.18.0-r0

Owner
~postmarketos
Created
15 days ago
Updated
15 days ago
Build manifest
view manifest »

Tasks

view log »
bpo_setup view log »
install_pubkey view log »
pmbootstrap_build view log »
checksums view log »
submit view log »
go to bottom »
go to top »
setup
1
2
3
4
5
6
7
8
9
10
11
12
13
14
15
16
17
18
19
20
21
22
23
24
25
26
27
28
29
30
31
32
33
34
35
36
37
38
39
40
41
42
43
44
45
46
47
48
49
50
51
52
53
54
55
56
57
58
59
60
61
62
63
64
65
66
67
68
69
70
[#1185320] 2024/04/02 22:27:46 Booting image alpine/latest (default) on port 22649
[#1185320] 2024/04/02 22:27:47 Waiting for guest to settle
[#1185320] 2024/04/02 22:27:56 Sending tasks
[#1185320] 2024/04/02 22:27:58 Sending build environment
[#1185320] 2024/04/02 22:27:59 Sending secrets
[#1185320] 2024/04/02 22:27:59 Resolving secret 482975ec-22f7-49fd-9b54-486b0b1947c3
[#1185320] 2024/04/02 22:27:59 Installing packages
Warning: Permanently added '[localhost]:22649' (ED25519) to the list of known hosts.
fetch http://dl-cdn.alpinelinux.org/alpine/v3.19/main/x86_64/APKINDEX.tar.gz
fetch http://dl-cdn.alpinelinux.org/alpine/v3.19/community/x86_64/APKINDEX.tar.gz
Upgrading critical system libraries and apk-tools:
(1/1) Upgrading apk-tools (2.14.0-r5 -> 2.14.3-r1)
Executing busybox-1.36.1-r15.trigger
Continuing the upgrade transaction with new apk-tools:
fetch http://dl-cdn.alpinelinux.org/alpine/v3.19/main/x86_64/APKINDEX.tar.gz
fetch http://dl-cdn.alpinelinux.org/alpine/v3.19/community/x86_64/APKINDEX.tar.gz
OK: 469 MiB in 140 packages
Warning: Permanently added '[localhost]:22649' (ED25519) to the list of known hosts.
(1/20) Installing coreutils-env (9.4-r2)
(2/20) Installing coreutils-fmt (9.4-r2)
(3/20) Installing coreutils-sha512sum (9.4-r2)
(4/20) Installing skalibs (2.14.0.1-r0)
(5/20) Installing utmps-libs (0.1.2.2-r0)
(6/20) Installing coreutils (9.4-r2)
(7/20) Installing libintl (0.22.3-r0)
(8/20) Installing libproc2 (4.0.4-r0)
(9/20) Installing procps-ng (4.0.4-r0)
(10/20) Installing py3-certifi (2024.2.2-r0)
(11/20) Installing py3-certifi-pyc (2024.2.2-r0)
(12/20) Installing py3-charset-normalizer (3.3.2-r0)
(13/20) Installing py3-charset-normalizer-pyc (3.3.2-r0)
(14/20) Installing py3-idna (3.6-r0)
(15/20) Installing py3-idna-pyc (3.6-r0)
(16/20) Installing py3-urllib3 (1.26.18-r0)
(17/20) Installing py3-urllib3-pyc (1.26.18-r0)
(18/20) Installing py3-requests (2.31.0-r1)
(19/20) Installing py3-requests-pyc (2.31.0-r1)
(20/20) Installing xz (5.4.5-r0)
Executing busybox-1.36.1-r15.trigger
OK: 474 MiB in 160 packages
[#1185320] 2024/04/02 22:28:00 Cloning repositories
Cloning into 'pmaports'...
+ cd pmaports
+ git submodule update --init --recursive
Cloning into 'pmbootstrap'...
remote: error: MIDX does not contain the BTMP chunk        
remote: warning: unable to load pack: 'pack-ff544029aee7c8594dc7c496b3ee5ab362f3bc22.idx', disabling pack-reuse        
+ cd pmbootstrap
+ git submodule update --init --recursive
Cloning into 'build.postmarketos.org'...
remote: error: MIDX does not contain the BTMP chunk        
remote: warning: unable to load pack: 'pack-ca8c8d41a88ae061a70b5767faf1d73a6c682c38.idx', disabling pack-reuse        
+ cd build.postmarketos.org
+ git submodule update --init --recursive
[#1185320] 2024/04/02 22:28:09 Running task bpo_setup
[#1185320] 2024/04/02 22:28:11 Running task install_pubkey
[#1185320] 2024/04/02 22:28:12 Running task pmbootstrap_build
[#1185320] 2024/04/02 22:28:12 Processing post-failed triggers...
[#1185320] 2024/04/02 22:28:12 Sending webhook...
[#1185320] 2024/04/02 22:28:18 Webhook response: 200
[#1185320] 2024/04/02 22:28:18 done
[#1185320] 2024/04/02 22:28:18 Build failed.
[#1185320] 2024/04/02 22:28:18 The build environment will be kept alive for 10 minutes.
[#1185320] 2024/04/02 22:28:18 To log in with SSH and examine it, use the following command:
[#1185320] 2024/04/02 22:28:18 
[#1185320] 2024/04/02 22:28:18 	ssh -t builds@fra01.builds.sr.ht connect 1185320
[#1185320] 2024/04/02 22:28:18 
[#1185320] 2024/04/02 22:28:18 After logging in, the deadline is increased to your remaining build time.
[#1185320] 2024/04/02 22:38:18 Deadline elapsed. Terminating build environment.
[#1185320] 2024/04/02 22:38:18 Error: Running task on guest: exit status 1
bpo_setup
1
2
3
4
5
6
7
8
9
10
11
12
13
14
15
16
17
18
19
20
21
22
23
24
25
26
27
28
29
30
31
32
+ export BPO_JOB_ID=1185320
+ BPO_JOB_ID=1185320
+ mkdir -p /home/build/.config
+ echo '[pmbootstrap]'
+ echo 'is_default_channel = False'
+ git -C pmaports checkout master_staging_systemd
branch 'master_staging_systemd' set up to track 'origin/master_staging_systemd'.
Switched to a new branch 'master_staging_systemd'
+ sudo ln -s /home/build/pmbootstrap/pmbootstrap.py /usr/bin/pmbootstrap
+ yes ''
+ pmbootstrap --aports=/home/build/pmaports -q init
[22:28:09] Work path [/home/build/.local/var/pmbootstrap]: [22:28:09] Channel [edge]: [22:28:09] Vendor [qemu]: [22:28:09] Device codename [amd64]: [22:28:09] Kernel [lts]: [22:28:09] Username [user]: [22:28:09] Provider [default]: [22:28:10] User interface [console]: [22:28:10] Install systemd? (default/always/never) [default]: [22:28:10] Change them? (y/n) [n]: [22:28:10] Extra packages [none]: [22:28:10] Locale [en_US]: [22:28:10] Device hostname (short form, e.g. 'foo') [qemu-amd64]: [22:28:10] Build outdated packages during 'pmbootstrap install'? (y/n) [y]: + sudo modprobe binfmt_misc
+ sudo mount -t binfmt_misc none /proc/sys/fs/binfmt_misc
++ git -C pmaports rev-parse --abbrev-ref HEAD
+ branch=master_staging_systemd
+ '[' master_staging_systemd '!=' master_staging_systemd ']'
+ sudo mkdir -p /mnt/tmpfs-for-apks
+ sudo mount -t tmpfs -o size=1500M tmpfs /mnt/tmpfs-for-apks
++ pmbootstrap config work
+ WORK=/home/build/.local/var/pmbootstrap
+ for arch in x86_64 aarch64 armv7
+ mkdir -p /mnt/tmpfs-for-apks/cache_apk_x86_64
+ sudo rm -rf /home/build/.local/var/pmbootstrap/cache_apk_x86_64
+ ln -s /mnt/tmpfs-for-apks/cache_apk_x86_64 /home/build/.local/var/pmbootstrap
+ for arch in x86_64 aarch64 armv7
+ mkdir -p /mnt/tmpfs-for-apks/cache_apk_aarch64
+ sudo rm -rf /home/build/.local/var/pmbootstrap/cache_apk_aarch64
+ ln -s /mnt/tmpfs-for-apks/cache_apk_aarch64 /home/build/.local/var/pmbootstrap
+ for arch in x86_64 aarch64 armv7
+ mkdir -p /mnt/tmpfs-for-apks/cache_apk_armv7
+ sudo rm -rf /home/build/.local/var/pmbootstrap/cache_apk_armv7
+ ln -s /mnt/tmpfs-for-apks/cache_apk_armv7 /home/build/.local/var/pmbootstrap
install_pubkey
1
2
3
4
5
6
7
8
9
10
11
12
+ export BPO_JOB_ID=1185320
+ BPO_JOB_ID=1185320
+ echo -n '-----BEGIN PUBLIC KEY-----
MIIBIjANBgkqhkiG9w0BAQEFAAOCAQ8AMIIBCgKCAQEAnFsP5NKYRgJZxXkPG1JA
2IM1kZjfJZAMBzWoN9Q68D3FWErRbQWn7+Im0ifmHH/zms5kKaaaRNRLjTjrmf3y
kFrJQNhqCvEfZcWz/nvH+tsoGk8/b5fm6+W2hRh8JZpXs/aXR8YeAhB34U4moYol
Zxw9VVbUKeoZGgO6JHnm3aFBoODg26m5yqcZdJFuuDbci8q3I4RqojppYOXr/q4F
o3m8FNcvdKBb6uOCucyDKXqBSZE7KTYHKFT76w0D7EJLVteanhRqzX2D5UGvei5M
SrjiQWm5tv92IS1wdRRgdHoEQ2fTRxV9ps4gatfY3Gz7UkfbnORcxFSSclOl1XCw
VQIDAQAB
-----END PUBLIC KEY-----
'
pmbootstrap_build
1
2
3
4
5
6
7
8
9
10
11
12
13
14
15
16
17
18
19
20
21
22
23
24
25
26
27
28
29
30
31
32
33
34
35
36
37
38
39
40
41
42
43
44
45
46
47
48
49
50
51
52
53
54
55
56
57
58
59
60
61
62
63
64
65
66
67
68
69
70
71
72
73
74
75
76
77
78
79
80
81
82
83
84
85
86
87
88
89
90
91
92
93
94
+ export BPO_JOB_ID=1185320
+ BPO_JOB_ID=1185320
+ pmbootstrap config systemd always
[22:28:11] Config changed: systemd='always'
+ pmbootstrap -m http://dl-cdn.alpinelinux.org/alpine/ -mp http://build.postmarketos.org/wip/staging/systemd/ -mp http://mirror.postmarketos.org/postmarketos/staging/systemd/ --aports=/home/build/pmaports --no-ccache --timeout 900 --details-to-stdout build --no-depends --strict --arch x86_64 --force devicepkg-dev
(002280) [22:28:12] % cd /home/build/pmaports; git remote -v
origin	https://gitlab.com/postmarketOS/pmaports.git/ (fetch)
origin	https://gitlab.com/postmarketOS/pmaports.git/ (push)
(002280) [22:28:12] % cd /home/build/pmaports; git show origin/master:channels.cfg
# Reference: https://postmarketos.org/channels.cfg
[channels.cfg]
recommended=edge

[edge]
description=Rolling release / Most devices / Occasional breakage: https://postmarketos.org/edge
branch_pmaports=master
branch_aports=master
mirrordir_alpine=edge

[v23.12]
description=Latest release / Recommended for best stability
branch_pmaports=v23.12
branch_aports=3.19-stable
mirrordir_alpine=v3.19

[v23.06]
description=Old release (unsupported)
branch_pmaports=v23.06
branch_aports=3.18-stable
mirrordir_alpine=v3.18

[v22.12]
description=Old release (unsupported)
branch_pmaports=v22.12
branch_aports=3.17-stable
mirrordir_alpine=v3.17

[v22.06]
description=Old release (unsupported)
branch_pmaports=v22.06
branch_aports=3.16-stable
mirrordir_alpine=v3.16

[v21.12]
description=Old release (unsupported)
branch_pmaports=v21.12
branch_aports=3.15-stable
mirrordir_alpine=v3.15

[v21.06]
description=Old release (unsupported)
branch_pmaports=v21.06
branch_aports=3.14-stable
mirrordir_alpine=v3.14

[v21.03]
description=Old release (unsupported)
branch_pmaports=v21.03
branch_aports=3.13-stable
mirrordir_alpine=v3.13

[v20.05]
description=Old release (unsupported)
branch_pmaports=v20.05
branch_aports=3.12-stable
mirrordir_alpine=v3.12
(002280) [22:28:12] Shutdown complete
(002280) [22:28:12] Calculate work folder size
(002280) [22:28:12] % sudo du -ks /home/build/.local/var/pmbootstrap
3244	/home/build/.local/var/pmbootstrap
(002280) [22:28:12] Shutdown complete
(002280) [22:28:12] % sudo du -ks /home/build/.local/var/pmbootstrap
3244	/home/build/.local/var/pmbootstrap
(002280) [22:28:12] Cleared up ~0 MB of space
(002280) [22:28:12] ERROR: Trying to build devicepkg-dev for x86_64 with systemd enabled, but the systemd repo needs to be bootstrapped first.
(002280) [22:28:12] ERROR: Run 'pmbootstrap repo_bootstrap systemd --arch=x86_64' and then try again.
(002280) [22:28:12] See also: <https://postmarketos.org/troubleshooting>
(002280) [22:28:12] Traceback (most recent call last):
  File "/home/build/pmbootstrap/pmb/__init__.py", line 65, in main
    getattr(frontend, args.action)(args)
  File "/home/build/pmbootstrap/pmb/helpers/frontend.py", line 117, in build
    pmb.helpers.repo_bootstrap.require_bootstrap(args, arch_package,
  File "/home/build/pmbootstrap/pmb/helpers/repo_bootstrap.py", line 185, in require_bootstrap
    require_bootstrap_error("systemd", arch, trigger_str)
  File "/home/build/pmbootstrap/pmb/helpers/repo_bootstrap.py", line 170, in require_bootstrap_error
    raise RuntimeError(f"Run 'pmbootstrap repo_bootstrap {repo} --arch={arch}'"
RuntimeError: Run 'pmbootstrap repo_bootstrap systemd --arch=x86_64' and then try again.


Run 'pmbootstrap log' for details.

Before you report this error, ensure that pmbootstrap is up to date.
Find the latest version here: https://gitlab.com/postmarketOS/pmbootstrap/-/tags
Your version: 2.2.1
Build complete: failed 15 days ago (took 25 seconds)