#95104 failed

Note

WIP testing new bpo run job code

Owner
~martijnbraam
Created
13 days ago
Updated
13 days ago
Build manifest
view manifest »

Tasks

view log »
bpo_setup view log »
install_pubkey view log »
pmbootstrap_build view log »
submit view log »
go to bottom »
setup
1
2
3
4
5
6
7
8
9
10
11
12
13
14
15
16
17
18
19
20
21
22
23
24
25
26
27
28
29
30
31
32
33
34
35
36
37
38
39
40
41
42
43
[#95104] 2019/10/08 08:16:25 Booting image alpine/latest (default) on port 22196
[#95104] 2019/10/08 08:16:27 Waiting for guest to settle
[#95104] 2019/10/08 08:16:35 Sending tasks
[#95104] 2019/10/08 08:16:36 Sending build environment
[#95104] 2019/10/08 08:16:36 Sending secrets
[#95104] 2019/10/08 08:16:36 Resolving secret 296b27c6-a74c-462f-9a3b-d46b877d4d8d
[#95104] 2019/10/08 08:16:36 Installing packages
Warning: Permanently added '[localhost]:22196' (ECDSA) to the list of known hosts.
fetch http://repo-cache.local/alpine/v3.10/main/x86_64/APKINDEX.tar.gz
fetch http://repo-cache.local/alpine/v3.10/community/x86_64/APKINDEX.tar.gz
v3.10.2-102-ge3e3e39529 [http://repo-cache.local/alpine/v3.10/main]
v3.10.2-103-g1b5ddad804 [http://repo-cache.local/alpine/v3.10/community]
OK: 10334 distinct packages available
Warning: Permanently added '[localhost]:22196' (ECDSA) to the list of known hosts.
(1/8) Installing libacl (2.2.52-r6)
(2/8) Installing coreutils (8.31-r0)
(3/8) Installing python3 (3.7.4-r0)
(4/8) Installing py3-chardet (3.0.4-r1)
(5/8) Installing py3-idna (2.8-r1)
(6/8) Installing py3-certifi (2019.6.16-r0)
(7/8) Installing py3-urllib3 (1.25.3-r0)
(8/8) Installing py3-requests (2.21.0-r4)
Executing busybox-1.30.1-r2.trigger
OK: 980 MiB in 206 packages
[#95104] 2019/10/08 08:16:38 Cloning repositories
Cloning into 'pmaports'...
+ cd pmaports
+ git submodule update --init
Cloning into 'pmbootstrap'...
+ cd pmbootstrap
+ git submodule update --init
[#95104] 2019/10/08 08:16:42 Running task bpo_setup
[#95104] 2019/10/08 08:16:43 Running task install_pubkey
[#95104] 2019/10/08 08:16:43 Running task pmbootstrap_build
[#95104] 2019/10/08 08:17:25 Build failed.
[#95104] 2019/10/08 08:17:25 The build environment will be kept alive for 10 minutes.
[#95104] 2019/10/08 08:17:25 To log in with SSH and examine it, use the following command:
[#95104] 2019/10/08 08:17:25 
[#95104] 2019/10/08 08:17:25 	ssh -t builds@azusa.runners.sr.ht connect 95104
[#95104] 2019/10/08 08:17:25 
[#95104] 2019/10/08 08:17:25 After logging in, the deadline is increased to your remaining build time.
[#95104] 2019/10/08 08:27:25 Deadline elapsed. Terminating build environment.
[#95104] 2019/10/08 08:27:25 Error: Running task on guest: exit status 1
bpo_setup
1
2
3
+ yes ''
+ ./pmbootstrap/pmbootstrap.py --aports=/home/build/pmaports -q init
[08:16:42] Work path [/home/build/.local/var/pmbootstrap]: [08:16:42] Device [samsung-i9100]: [08:16:42] Enable this package? (y/n) [y]: [08:16:42] Username [user]: [08:16:42] User interface [weston]: [08:16:42] Change them? (y/n) [n]: [08:16:42] Extra packages [none]: [08:16:42] Device hostname (short form, e.g. 'foo') [samsung-i9100]: 
install_pubkey
1
2
3
4
5
6
7
8
9
10
+ echo -n '-----BEGIN PUBLIC KEY-----
MIIBIjANBgkqhkiG9w0BAQEFAAOCAQ8AMIIBCgKCAQEA3WEjHjAzm+4HmF/qJxFg
GDjQ78Yfv+aoCja8YtW6iGuq9pX+JheD+l/DDVAlbtupdM/SteyGokO1+SWIvVkL
KKtJzWKTtFf2IfqxQRAzTjfxV5jmw+bgYqCUaxEvDVPxO7WMgBGnrxl5gzwVxMBS
TXtgDKMpdOy7Op5YwVCk20Tp8YuyOTkQI728Gw5O8b1iRByv2BIOp1U2okusY3ox
KnDmB0DWWbWKIfVfLoln++WyQP/1INGA2fVAvEUK8Cm0O6RTruT02Sy4VL+a1rDo
9XEVJDfWWV0UfcTEkTpHbwv3Dcxr2RGIBwqDonUUGZOl1W9vB0/DccWd6T2BmJ+4
dwIDAQAB
-----END PUBLIC KEY-----
'
pmbootstrap_build
1
2
3
4
5
6
7
8
9
10
11
12
13
14
15
16
17
18
19
20
21
22
23
24
25
26
27
28
29
30
31
32
33
34
35
36
37
38
39
40
41
42
43
44
45
46
47
48
49
50
51
52
53
54
55
56
57
58
59
60
61
62
63
64
65
66
67
68
69
70
71
72
73
74
75
76
77
78
79
80
81
82
83
84
85
86
87
88
89
90
91
92
93
94
95
96
97
98
99
100
101
102
103
104
105
106
107
108
109
110
111
112
113
114
115
116
117
118
119
120
121
122
123
124
125
126
127
128
129
130
131
132
133
134
135
136
137
138
139
140
141
142
143
144
145
146
147
148
149
150
151
152
153
154
155
156
157
158
159
160
161
162
163
164
165
166
167
168
169
170
171
172
173
174
175
176
177
178
179
180
181
182
183
184
185
186
187
188
189
190
191
192
193
194
195
196
197
198
199
200
201
202
203
204
205
206
207
208
209
210
211
212
213
214
215
216
217
218
219
220
221
222
223
224
225
226
227
228
229
230
231
232
233
234
235
236
237
238
239
240
241
242
243
244
245
246
247
248
249
250
251
252
253
254
255
256
257
258
259
260
261
262
263
264
265
266
267
268
269
270
271
272
273
274
275
276
277
278
279
280
281
282
283
284
285
286
287
288
289
290
291
292
293
294
295
296
297
298
299
300
301
302
303
304
305
306
307
308
309
310
311
312
313
314
315
316
317
318
319
320
321
322
323
324
325
326
327
328
329
330
331
332
333
334
335
336
337
338
339
340
341
342
343
344
345
346
347
348
349
350
351
352
353
354
355
356
357
358
359
360
361
362
363
364
365
366
367
368
369
370
371
372
373
374
375
376
377
378
379
380
381
382
383
384
385
386
387
388
389
390
391
392
393
394
395
396
397
398
399
400
401
402
403
404
405
406
407
408
409
410
411
412
413
414
415
416
417
418
419
420
421
422
423
424
425
426
427
428
429
430
431
432
433
434
435
436
437
438
439
440
441
442
443
444
445
446
447
448
449
450
451
452
453
454
455
456
457
458
459
460
461
462
463
464
465
466
467
468
469
470
471
472
473
474
475
476
477
478
479
480
481
482
483
484
485
486
487
488
489
490
491
492
493
494
495
496
497
498
499
500
501
502
503
504
505
506
507
508
509
510
511
512
513
514
515
516
517
518
519
520
521
522
523
524
525
526
527
528
529
530
531
532
533
534
535
536
537
538
539
540
541
542
543
544
545
546
547
548
549
550
551
552
553
554
555
556
557
558
559
560
561
562
563
564
565
566
567
568
569
570
571
572
573
574
575
576
577
578
579
580
581
+ ./pmbootstrap/pmbootstrap.py -mp https://build.postmarketos.org/wip/master --mirror-pmOS http://postmarketos.brixit.nl/postmarketos/master/x86_64 --details-to-stdout build --no-depends --strict --arch x86_64 libhildonfm
(002161) [08:16:42] Shutdown complete
(002161) [08:16:42] Calculate work folder size
(002161) [08:16:42] % sudo du --summarize --block-size=1 /home/build/.local/var/pmbootstrap
20480	/home/build/.local/var/pmbootstrap
(002161) [08:16:42] Shutdown complete
(002161) [08:16:42] % sudo du --summarize --block-size=1 /home/build/.local/var/pmbootstrap
20480	/home/build/.local/var/pmbootstrap
(002161) [08:16:42] Cleared up ~0 MB of space
(002161) [08:16:42] APKINDEX outdated (file does not exist yet): https://build.postmarketos.org/wip/master/x86_64/APKINDEX.tar.gz
(002161) [08:16:42] APKINDEX outdated (file does not exist yet): http://postmarketos.brixit.nl/postmarketos/master/x86_64/x86_64/APKINDEX.tar.gz
(002161) [08:16:42] APKINDEX outdated (file does not exist yet): http://dl-cdn.alpinelinux.org/alpine/edge/main/x86_64/APKINDEX.tar.gz
(002161) [08:16:42] APKINDEX outdated (file does not exist yet): http://dl-cdn.alpinelinux.org/alpine/edge/community/x86_64/APKINDEX.tar.gz
(002161) [08:16:42] APKINDEX outdated (file does not exist yet): http://dl-cdn.alpinelinux.org/alpine/edge/testing/x86_64/APKINDEX.tar.gz
(002161) [08:16:42] Update package index for x86_64 (5 file(s))
(002161) [08:16:42] Download https://build.postmarketos.org/wip/master/x86_64/APKINDEX.tar.gz
(002161) [08:16:43] % sudo mkdir -p /home/build/.local/var/pmbootstrap/cache_apk_x86_64
(002161) [08:16:43] % sudo cp /home/build/.local/var/pmbootstrap/cache_http/APKINDEX_53711a85d2d03805fc9e859f0e55eda4941541086fca30263c9338b694af655c /home/build/.local/var/pmbootstrap/cache_apk_x86_64/APKINDEX.73602495.tar.gz
(002161) [08:16:43] Download http://postmarketos.brixit.nl/postmarketos/master/x86_64/x86_64/APKINDEX.tar.gz
(002161) [08:16:43] WARNING: file not found: http://postmarketos.brixit.nl/postmarketos/master/x86_64/x86_64/APKINDEX.tar.gz
(002161) [08:16:43] Download http://dl-cdn.alpinelinux.org/alpine/edge/main/x86_64/APKINDEX.tar.gz
(002161) [08:16:43] % sudo cp /home/build/.local/var/pmbootstrap/cache_http/APKINDEX_b36af8b1d7f948f0d2fcae5bd60c1b876620e69b987bc066e7a90c810687e76f /home/build/.local/var/pmbootstrap/cache_apk_x86_64/APKINDEX.066df28d.tar.gz
(002161) [08:16:43] Download http://dl-cdn.alpinelinux.org/alpine/edge/community/x86_64/APKINDEX.tar.gz
(002161) [08:16:43] % sudo cp /home/build/.local/var/pmbootstrap/cache_http/APKINDEX_0999dbfe3755729bd8aa3997d03dbd36a87187a19b61ce5cea2e01671a6305d6 /home/build/.local/var/pmbootstrap/cache_apk_x86_64/APKINDEX.b53994b4.tar.gz
(002161) [08:16:43] Download http://dl-cdn.alpinelinux.org/alpine/edge/testing/x86_64/APKINDEX.tar.gz
(002161) [08:16:43] % sudo cp /home/build/.local/var/pmbootstrap/cache_http/APKINDEX_6ccac8825a1621fb204ad4b3e645b24ffd8fa9acfe97edc265646cafd18d3e4c /home/build/.local/var/pmbootstrap/cache_apk_x86_64/APKINDEX.30e6f5af.tar.gz
(002161) [08:16:45] Build is necessary for package 'libhildonfm': No binary package available
(002161) [08:16:45] NOTE: Skipped apk version check for chroot 'native', because it is not installed yet!
(002161) [08:16:45] % sudo mkdir -p /home/build/.local/var/pmbootstrap/chroot_native/dev
(002161) [08:16:45] % sudo mount -t tmpfs -o size=1M,noexec,dev tmpfs /home/build/.local/var/pmbootstrap/chroot_native/dev
(002161) [08:16:45] % sudo mkdir -p /home/build/.local/var/pmbootstrap/chroot_native/dev/pts /home/build/.local/var/pmbootstrap/chroot_native/dev/shm
(002161) [08:16:45] % sudo mount -t tmpfs -o nodev,nosuid,noexec tmpfs /home/build/.local/var/pmbootstrap/chroot_native/dev/shm
(002161) [08:16:45] % sudo mknod -m 666 /home/build/.local/var/pmbootstrap/chroot_native/dev/null c 1 3
(002161) [08:16:45] % sudo mknod -m 666 /home/build/.local/var/pmbootstrap/chroot_native/dev/zero c 1 5
(002161) [08:16:45] % sudo mknod -m 666 /home/build/.local/var/pmbootstrap/chroot_native/dev/full c 1 7
(002161) [08:16:45] % sudo mknod -m 644 /home/build/.local/var/pmbootstrap/chroot_native/dev/random c 1 8
(002161) [08:16:45] % sudo mknod -m 644 /home/build/.local/var/pmbootstrap/chroot_native/dev/urandom c 1 9
(002161) [08:16:45] % sudo mkdir -p /home/build/.local/var/pmbootstrap/chroot_native/proc
(002161) [08:16:45] % sudo mount --bind /proc /home/build/.local/var/pmbootstrap/chroot_native/proc
(002161) [08:16:45] % sudo mkdir -p /home/build/.local/var/pmbootstrap/chroot_native/var/cache/apk
(002161) [08:16:45] % sudo mount --bind /home/build/.local/var/pmbootstrap/cache_apk_x86_64 /home/build/.local/var/pmbootstrap/chroot_native/var/cache/apk
(002161) [08:16:45] % sudo mkdir -p /home/build/.local/var/pmbootstrap/cache_ccache_x86_64
(002161) [08:16:45] % sudo mkdir -p /home/build/.local/var/pmbootstrap/chroot_native/mnt/pmbootstrap-ccache
(002161) [08:16:45] % sudo mount --bind /home/build/.local/var/pmbootstrap/cache_ccache_x86_64 /home/build/.local/var/pmbootstrap/chroot_native/mnt/pmbootstrap-ccache
(002161) [08:16:45] % sudo mkdir -p /home/build/.local/var/pmbootstrap/cache_distfiles
(002161) [08:16:45] % sudo mkdir -p /home/build/.local/var/pmbootstrap/chroot_native/var/cache/distfiles
(002161) [08:16:45] % sudo mount --bind /home/build/.local/var/pmbootstrap/cache_distfiles /home/build/.local/var/pmbootstrap/chroot_native/var/cache/distfiles
(002161) [08:16:45] % sudo mkdir -p /home/build/.local/var/pmbootstrap/cache_git
(002161) [08:16:45] % sudo mkdir -p /home/build/.local/var/pmbootstrap/chroot_native/mnt/pmbootstrap-git
(002161) [08:16:45] % sudo mount --bind /home/build/.local/var/pmbootstrap/cache_git /home/build/.local/var/pmbootstrap/chroot_native/mnt/pmbootstrap-git
(002161) [08:16:45] % sudo mkdir -p /home/build/.local/var/pmbootstrap/config_abuild
(002161) [08:16:45] % sudo mkdir -p /home/build/.local/var/pmbootstrap/chroot_native/mnt/pmbootstrap-abuild-config
(002161) [08:16:45] % sudo mount --bind /home/build/.local/var/pmbootstrap/config_abuild /home/build/.local/var/pmbootstrap/chroot_native/mnt/pmbootstrap-abuild-config
(002161) [08:16:45] % sudo mkdir -p /home/build/.local/var/pmbootstrap/config_apk_keys
(002161) [08:16:45] % sudo mkdir -p /home/build/.local/var/pmbootstrap/chroot_native/etc/apk/keys
(002161) [08:16:45] % sudo mount --bind /home/build/.local/var/pmbootstrap/config_apk_keys /home/build/.local/var/pmbootstrap/chroot_native/etc/apk/keys
(002161) [08:16:45] % sudo mkdir -p /home/build/.local/var/pmbootstrap/packages
(002161) [08:16:45] % sudo mkdir -p /home/build/.local/var/pmbootstrap/chroot_native/mnt/pmbootstrap-packages
(002161) [08:16:45] % sudo mount --bind /home/build/.local/var/pmbootstrap/packages /home/build/.local/var/pmbootstrap/chroot_native/mnt/pmbootstrap-packages
(002161) [08:16:45] Download http://dl-cdn.alpinelinux.org/alpine/edge/main/x86_64/apk-tools-static-2.10.4-r3.apk
(002161) [08:16:45] sigfilename: sbin/apk.static.SIGN.RSA.alpine-devel@lists.alpinelinux.org-5261cecb.rsa.pub
(002161) [08:16:45] sigkey: alpine-devel@lists.alpinelinux.org-5261cecb.rsa.pub
(002161) [08:16:45] extracted: /tmp/pmbootstrapw9so7v9gapk
(002161) [08:16:45] extracted: /tmp/pmbootstrap33te6jvosig
(002161) [08:16:45] Verify apk.static signature with /home/build/pmbootstrap/pmb/data/keys/alpine-devel@lists.alpinelinux.org-5261cecb.rsa.pub
(002161) [08:16:45] % openssl dgst -sha1 -verify /home/build/pmbootstrap/pmb/data/keys/alpine-devel@lists.alpinelinux.org-5261cecb.rsa.pub -signature /tmp/pmbootstrap33te6jvosig /tmp/pmbootstrapw9so7v9gapk
Verified OK
(002161) [08:16:45] Verify the version reported by the apk.static binary (must match the package version 2.10.4-r3)
(002161) [08:16:45] % /tmp/pmbootstrapw9so7v9gapk --version
apk-tools 2.10.4, compiled for x86_64.
(002161) [08:16:45] (native) install alpine-base
(002161) [08:16:45] % sudo ln -s -f /var/cache/apk /home/build/.local/var/pmbootstrap/chroot_native/etc/apk/cache
(002161) [08:16:45] % sudo cp /home/build/pmbootstrap/pmb/data/keys/alpine-devel@lists.alpinelinux.org-4a6a0840.rsa.pub /home/build/.local/var/pmbootstrap/config_apk_keys/
(002161) [08:16:45] % sudo cp /home/build/pmbootstrap/pmb/data/keys/pmos-5a03a13a.rsa.pub /home/build/.local/var/pmbootstrap/config_apk_keys/
(002161) [08:16:45] % sudo cp /home/build/pmbootstrap/pmb/data/keys/alpine-devel@lists.alpinelinux.org-58199dcc.rsa.pub /home/build/.local/var/pmbootstrap/config_apk_keys/
(002161) [08:16:45] % sudo cp /home/build/pmbootstrap/pmb/data/keys/alpine-devel@lists.alpinelinux.org-58cbb476.rsa.pub /home/build/.local/var/pmbootstrap/config_apk_keys/
(002161) [08:16:45] % sudo cp /home/build/pmbootstrap/pmb/data/keys/alpine-devel@lists.alpinelinux.org-5243ef4b.rsa.pub /home/build/.local/var/pmbootstrap/config_apk_keys/
(002161) [08:16:45] % sudo cp /home/build/pmbootstrap/pmb/data/keys/wip.rsa.pub /home/build/.local/var/pmbootstrap/config_apk_keys/
(002161) [08:16:45] % sudo cp /home/build/pmbootstrap/pmb/data/keys/alpine-devel@lists.alpinelinux.org-524d27bb.rsa.pub /home/build/.local/var/pmbootstrap/config_apk_keys/
(002161) [08:16:45] % sudo cp /home/build/pmbootstrap/pmb/data/keys/alpine-devel@lists.alpinelinux.org-58e4f17d.rsa.pub /home/build/.local/var/pmbootstrap/config_apk_keys/
(002161) [08:16:45] % sudo cp /home/build/pmbootstrap/pmb/data/keys/alpine-devel@lists.alpinelinux.org-5261cecb.rsa.pub /home/build/.local/var/pmbootstrap/config_apk_keys/
(002161) [08:16:45] % sudo cp /etc/resolv.conf /home/build/.local/var/pmbootstrap/chroot_native/etc/resolv.conf
(002161) [08:16:45] % sudo mkdir -p /home/build/.local/var/pmbootstrap/chroot_native/etc/apk
(002161) [08:16:45] (native) update /etc/apk/repositories
(002161) [08:16:45] % sudo sh -c echo /mnt/pmbootstrap-packages >> /home/build/.local/var/pmbootstrap/chroot_native/etc/apk/repositories
(002161) [08:16:45] % sudo sh -c echo https://build.postmarketos.org/wip/master >> /home/build/.local/var/pmbootstrap/chroot_native/etc/apk/repositories
(002161) [08:16:45] % sudo sh -c echo http://postmarketos.brixit.nl/postmarketos/master/x86_64 >> /home/build/.local/var/pmbootstrap/chroot_native/etc/apk/repositories
(002161) [08:16:45] % sudo sh -c echo http://dl-cdn.alpinelinux.org/alpine/edge/main >> /home/build/.local/var/pmbootstrap/chroot_native/etc/apk/repositories
(002161) [08:16:45] % sudo sh -c echo http://dl-cdn.alpinelinux.org/alpine/edge/community >> /home/build/.local/var/pmbootstrap/chroot_native/etc/apk/repositories
(002161) [08:16:45] % sudo sh -c echo http://dl-cdn.alpinelinux.org/alpine/edge/testing >> /home/build/.local/var/pmbootstrap/chroot_native/etc/apk/repositories
(002161) [08:16:46] % sudo /home/build/.local/var/pmbootstrap/apk.static --no-progress --root /home/build/.local/var/pmbootstrap/chroot_native --cache-dir /home/build/.local/var/pmbootstrap/cache_apk_x86_64 --initdb --arch x86_64 add alpine-base
WARNING: Ignoring /mnt/pmbootstrap-packages/x86_64/APKINDEX.tar.gz: No such file or directory
fetch http://postmarketos.brixit.nl/postmarketos/master/x86_64/x86_64/APKINDEX.tar.gz
ERROR: http://postmarketos.brixit.nl/postmarketos/master/x86_64: No such file or directory
WARNING: Ignoring APKINDEX.ee115b70.tar.gz: No such file or directory
(1/19) Installing musl (1.1.23-r3)
(2/19) Installing busybox (1.31.0-r1)
Executing busybox-1.31.0-r1.post-install
(3/19) Installing alpine-baselayout (3.2.0-r2)
Executing alpine-baselayout-3.2.0-r2.pre-install
Executing alpine-baselayout-3.2.0-r2.post-install
(4/19) Installing openrc (0.42.1-r0)
Executing openrc-0.42.1-r0.post-install
(5/19) Installing alpine-conf (3.8.3-r0)
(6/19) Installing libcrypto1.1 (1.1.1d-r2)
(7/19) Installing libssl1.1 (1.1.1d-r2)
(8/19) Installing ca-certificates-cacert (20190108-r0)
(9/19) Installing libtls-standalone (2.9.1-r0)
(10/19) Installing ssl_client (1.31.0-r1)
(11/19) Installing zlib (1.2.11-r3)
(12/19) Installing apk-tools (2.10.4-r3)
(13/19) Installing busybox-suid (1.31.0-r1)
(14/19) Installing busybox-initscripts (3.2-r0)
Executing busybox-initscripts-3.2-r0.post-install
(15/19) Installing scanelf (1.2.4-r0)
(16/19) Installing musl-utils (1.1.23-r3)
(17/19) Installing libc-utils (0.7.1-r0)
(18/19) Installing alpine-keys (2.1-r2)
(19/19) Installing alpine-base (3.11_alpha20190925-r0)
Executing busybox-1.31.0-r1.trigger
OK: 8 MiB in 19 packages
(002161) [08:16:46] (native) % adduser -D pmos -u 12345
(002161) [08:16:46] (native) % busybox su pmos -c HOME=/home/pmos ln -s /mnt/pmbootstrap-abuild-config /home/pmos/.abuild
(002161) [08:16:46] (native) % chown pmos:pmos /mnt/pmbootstrap-abuild-config
(002161) [08:16:46] (native) % busybox su pmos -c HOME=/home/pmos ln -s /mnt/pmbootstrap-ccache /home/pmos/.ccache
(002161) [08:16:46] (native) % chown pmos:pmos /mnt/pmbootstrap-ccache
(002161) [08:16:46] (native) % busybox su pmos -c HOME=/home/pmos ln -s /mnt/pmbootstrap-git /home/pmos/git
(002161) [08:16:47] (native) % chown pmos:pmos /mnt/pmbootstrap-git
(002161) [08:16:47] (native) % busybox su pmos -c HOME=/home/pmos mkdir -p /home/pmos/packages
(002161) [08:16:47] (native) % busybox su pmos -c HOME=/home/pmos ln -s /mnt/pmbootstrap-packages /home/pmos/packages/pmos
(002161) [08:16:47] (native) % chown pmos:pmos /mnt/pmbootstrap-packages
(002161) [08:16:47] (native) calculate depends of abuild, build-base, ccache (pmbootstrap -v for details)
(002161) [08:16:48] (native) install abuild build-base ccache
(002161) [08:16:48] (native) % apk --no-progress add -u --virtual .pmbootstrap abuild build-base ccache fakeroot sudo pax-utils openssl attr tar pkgconf patch lzip curl binutils file gcc g++ make libc-dev fortify-headers libcap libattr libacl libgcc libstdc++ ca-certificates libcurl libmagic isl libgomp libatomic gmp mpc1 mpfr4 musl-dev nghttp2-libs
WARNING: Ignoring /mnt/pmbootstrap-packages/x86_64/APKINDEX.tar.gz: No such file or directory
fetch http://postmarketos.brixit.nl/postmarketos/master/x86_64/x86_64/APKINDEX.tar.gz
ERROR: http://postmarketos.brixit.nl/postmarketos/master/x86_64: No such file or directory
WARNING: Ignoring APKINDEX.ee115b70.tar.gz: No such file or directory
(1/37) Installing fakeroot (1.24-r0)
(2/37) Installing sudo (1.8.27-r0)
(3/37) Installing libcap (2.27-r0)
(4/37) Installing pax-utils (1.2.4-r0)
(5/37) Installing openssl (1.1.1d-r2)
(6/37) Installing libattr (2.4.48-r0)
(7/37) Installing attr (2.4.48-r0)
(8/37) Installing libacl (2.2.53-r0)
(9/37) Installing tar (1.32-r1)
(10/37) Installing pkgconf (1.6.3-r0)
(11/37) Installing patch (2.7.6-r6)
(12/37) Installing libgcc (9.2.0-r2)
(13/37) Installing libstdc++ (9.2.0-r2)
(14/37) Installing lzip (1.21-r0)
(15/37) Installing ca-certificates (20190108-r0)
(16/37) Installing nghttp2-libs (1.39.2-r2)
(17/37) Installing libcurl (7.66.0-r0)
(18/37) Installing curl (7.66.0-r0)
(19/37) Installing abuild (3.4.0-r1)
Executing abuild-3.4.0-r1.pre-install
(20/37) Installing binutils (2.32-r0)
(21/37) Installing libmagic (5.37-r0)
(22/37) Installing file (5.37-r0)
(23/37) Installing gmp (6.1.2-r1)
(24/37) Installing isl (0.18-r0)
(25/37) Installing libgomp (9.2.0-r2)
(26/37) Installing libatomic (9.2.0-r2)
(27/37) Installing mpfr4 (4.0.2-r1)
(28/37) Installing mpc1 (1.1.0-r1)
(29/37) Installing gcc (9.2.0-r2)
(30/37) Installing musl-dev (1.1.23-r3)
(31/37) Installing libc-dev (0.7.1-r0)
(32/37) Installing g++ (9.2.0-r2)
(33/37) Installing make (4.2.1-r2)
(34/37) Installing fortify-headers (1.1-r0)
(35/37) Installing build-base (0.5-r1)
(36/37) Installing ccache (3.7.4-r0)
(37/37) Installing .pmbootstrap (20191008.081648)
Executing busybox-1.31.0-r1.trigger
Executing ca-certificates-20190108-r0.trigger
OK: 185 MiB in 56 packages
(002161) [08:16:54] (native) % apk --no-progress add abuild build-base ccache
WARNING: Ignoring /mnt/pmbootstrap-packages/x86_64/APKINDEX.tar.gz: No such file or directory
fetch http://postmarketos.brixit.nl/postmarketos/master/x86_64/x86_64/APKINDEX.tar.gz
ERROR: http://postmarketos.brixit.nl/postmarketos/master/x86_64: No such file or directory
WARNING: Ignoring APKINDEX.ee115b70.tar.gz: No such file or directory
OK: 185 MiB in 56 packages
(002161) [08:16:55] (native) % apk --no-progress del .pmbootstrap
WARNING: Ignoring /mnt/pmbootstrap-packages/x86_64/APKINDEX.tar.gz: No such file or directory
WARNING: Ignoring APKINDEX.ee115b70.tar.gz: No such file or directory
(1/1) Purging .pmbootstrap (20191008.081648)
OK: 185 MiB in 55 packages
(002161) [08:16:55] (native) % chown root:abuild /var/cache/distfiles
(002161) [08:16:55] (native) % chmod g+w /var/cache/distfiles
(002161) [08:16:55] (native) generate abuild keys
(002161) [08:16:55] (native) % busybox su pmos -c HOME=/home/pmos abuild-keygen -n -q -a
Generating RSA private key, 2048 bit long modulus (2 primes)
..................................................................+++++
......................................................................+++++
e is 65537 (0x010001)
writing RSA key
(002161) [08:16:55] (native) % cp /mnt/pmbootstrap-abuild-config/pmos-5d9c45f7.rsa.pub /etc/apk/keys/
(002161) [08:16:55] (native) % cp /tmp/gzip_wrapper.sh /usr/local/bin/gzip
(002161) [08:16:55] (native) % chmod +x /usr/local/bin/gzip
(002161) [08:16:55] (native) % adduser pmos abuild
(002161) [08:16:55] (native) % sed -i -e s/^CLEANUP=.*/CLEANUP=''/ /etc/abuild.conf
(002161) [08:16:55] (native) % sed -i -e s/^ERROR_CLEANUP=.*/ERROR_CLEANUP=''/ /etc/abuild.conf
(002161) [08:16:55] (native) % touch /var/local/pmbootstrap_chroot_build_init_done
(002161) [08:16:55] (native) % sed -i -e s/^export JOBS=.*/export JOBS=3/ /etc/abuild.conf
(002161) [08:16:55] (native) % busybox su pmos -c HOME=/home/pmos ccache --max-size 5G
Set cache size limit to 5.0 GB
(002161) [08:16:55] (native) build x86_64/libhildonfm-2.28.22-r1.apk
(002161) [08:16:55] % sudo cp -rL /home/build/pmaports/maemo/libhildonfm/ /home/build/.local/var/pmbootstrap/chroot_native/home/pmos/build
(002161) [08:16:55] (native) % chown -R pmos:pmos /home/pmos/build
(002161) [08:16:55] (native) % cd /home/pmos/build; busybox su pmos -c CARCH=x86_64 SUDO_APK='abuild-apk --no-progress' HOME=/home/pmos abuild -D postmarketOS -r
]0;abuild: libhildonfm>>> libhildonfm: Building pmos/libhildonfm 2.28.22-r1 (using abuild 3.4.0-r1) started Tue, 08 Oct 2019 08:16:55 +0000
>>> libhildonfm: Checking sanity of /home/pmos/build/APKBUILD...
>>> libhildonfm: Analyzing dependencies...
>>> libhildonfm: Installing for build: build-base libhildon gconf-dev gtk-doc mce-headers libhildon-dev libpng-dev libosso-dev hildon-thumbnail-dev libhildonmime-dev autoconf automake m4
WARNING: Ignoring /home/pmos/packages//pmos/x86_64/APKINDEX.tar.gz: No such file or directory
WARNING: Ignoring /mnt/pmbootstrap-packages/x86_64/APKINDEX.tar.gz: No such file or directory
fetch http://postmarketos.brixit.nl/postmarketos/master/x86_64/x86_64/APKINDEX.tar.gz
ERROR: http://postmarketos.brixit.nl/postmarketos/master/x86_64: No such file or directory
WARNING: Ignoring APKINDEX.ee115b70.tar.gz: No such file or directory
(1/216) Installing libffi (3.2.1-r6)
(2/216) Installing xz-libs (5.2.4-r0)
(3/216) Installing xz (5.2.4-r0)
(4/216) Installing libintl (0.20.1-r1)
(5/216) Installing libblkid (2.34-r0)
(6/216) Installing libmount (2.34-r0)
(7/216) Installing pcre (8.43-r0)
(8/216) Installing glib (2.62.0-r0)
(9/216) Installing libxml2 (2.9.9-r2)
(10/216) Installing shared-mime-info (1.12-r1)
(11/216) Installing hicolor-icon-theme (0.17-r1)
(12/216) Installing libxau (1.0.9-r0)
(13/216) Installing libbsd (0.10.0-r0)
(14/216) Installing libxdmcp (1.1.3-r0)
(15/216) Installing libxcb (1.13.1-r0)
(16/216) Installing libx11 (1.6.8-r1)
(17/216) Installing libjpeg-turbo (2.0.3-r0)
(18/216) Installing libpng (1.6.37-r1)
(19/216) Installing tiff (4.0.10-r1)
(20/216) Installing gdk-pixbuf (2.38.2-r0)
(21/216) Installing gtk-update-icon-cache (2.24.32-r1)
(22/216) Installing libxcomposite (0.4.5-r0)
(23/216) Installing libxfixes (5.0.3-r2)
(24/216) Installing libxrender (0.9.10-r3)
(25/216) Installing libxcursor (1.2.0-r0)
(26/216) Installing libxdamage (1.1.5-r0)
(27/216) Installing libxext (1.3.4-r0)
(28/216) Installing libxi (1.7.10-r0)
(29/216) Installing libxrandr (1.5.2-r0)
(30/216) Installing atk (2.34.1-r0)
(31/216) Installing expat (2.2.9-r0)
(32/216) Installing libbz2 (1.0.8-r1)
(33/216) Installing freetype (2.10.1-r0)
(34/216) Installing libuuid (2.34-r0)
(35/216) Installing fontconfig (2.13.1-r2)
(36/216) Installing pixman (0.38.4-r0)
(37/216) Installing cairo (1.16.0-r2)
(38/216) Installing dbus-elogind-libs (1.12.16-r0)
(39/216) Installing avahi-libs (0.7-r2)
(40/216) Installing nettle (3.5.1-r0)
(41/216) Installing p11-kit (0.23.17-r0)
(42/216) Installing libtasn1 (4.14-r0)
(43/216) Installing libunistring (0.9.10-r0)
(44/216) Installing gnutls (3.6.9-r0)
(45/216) Installing cups-libs (2.2.12-r0)
(46/216) Installing libxft (2.3.3-r0)
(47/216) Installing fribidi (1.0.7-r0)
(48/216) Installing graphite2 (1.3.13-r1)
(49/216) Installing harfbuzz (2.6.1-r0)
(50/216) Installing pango (1.44.6-r0)
(51/216) Installing gtk+2.0-maemo (2.24.31-r4)
Executing gtk+2.0-maemo-2.24.31-r4.post-install
(52/216) Installing maemo-l10n (210-r2)
(53/216) Installing alsa-lib (1.1.9-r0)
(54/216) Installing libltdl (2.4.6-r6)
(55/216) Installing libogg (1.3.4-r0)
(56/216) Installing libvorbis (1.3.6-r2)
(57/216) Installing libcanberra (0.30-r3)
(58/216) Installing dbus-glib (0.110-r0)
(59/216) Installing icu-libs (64.2-r0)
(60/216) Installing nspr (4.22-r0)
(61/216) Installing ncurses-terminfo-base (6.1_p20191005-r0)
(62/216) Installing ncurses-terminfo (6.1_p20191005-r0)
(63/216) Installing ncurses-libs (6.1_p20191005-r0)
(64/216) Installing readline (8.0.1-r0)
(65/216) Installing mozjs60 (60.8.0-r0)
(66/216) Installing linux-pam (1.3.1-r0)
(67/216) Installing polkit (0.116-r0)
Executing polkit-0.116-r0.pre-install
(68/216) Installing gconf (3.2.6-r5)
(69/216) Installing libhildon (2.2.25.3-r0)
(70/216) Installing zlib-dev (1.2.11-r3)
(71/216) Installing libxml2-dev (2.9.9-r2)
(72/216) Installing gdbm (1.13-r1)
(73/216) Installing sqlite-libs (3.29.0-r0)
(74/216) Installing python3 (3.7.4-r0)
(75/216) Installing gettext-asprintf (0.20.1-r1)
(76/216) Installing gettext-libs (0.20.1-r1)
(77/216) Installing gettext (0.20.1-r1)
(78/216) Installing gettext-dev (0.20.1-r1)
(79/216) Installing bzip2-dev (1.0.8-r1)
(80/216) Installing libxml2-utils (2.9.9-r2)
(81/216) Installing libgpg-error (1.36-r2)
(82/216) Installing libgcrypt (1.8.5-r0)
(83/216) Installing libxslt (1.1.33-r1)
(84/216) Installing docbook-xml (4.5-r6)
Executing docbook-xml-4.5-r6.post-install
(85/216) Installing docbook-xsl (1.79.1-r1)
Executing docbook-xsl-1.79.1-r1.post-install
(86/216) Installing linux-headers (4.19.36-r0)
(87/216) Installing libffi-dev (3.2.1-r6)
(88/216) Installing libpcre16 (8.43-r0)
(89/216) Installing libpcre32 (8.43-r0)
(90/216) Installing libpcrecpp (8.43-r0)
(91/216) Installing pcre-dev (8.43-r0)
(92/216) Installing libfdisk (2.34-r0)
(93/216) Installing libsmartcols (2.34-r0)
(94/216) Installing util-linux-dev (2.34-r0)
(95/216) Installing glib-dev (2.62.0-r0)
(96/216) Installing atk-dev (2.34.1-r0)
(97/216) Installing xorgproto (2019.1-r1)
(98/216) Installing libxau-dev (1.0.9-r0)
(99/216) Installing xcb-proto (1.13-r3)
(100/216) Installing libpthread-stubs (0.3-r5)
(101/216) Installing libxdmcp-dev (1.1.3-r0)
(102/216) Installing libxcb-dev (1.13.1-r0)
(103/216) Installing xtrans (1.4.0-r1)
(104/216) Installing libx11-dev (1.6.8-r1)
(105/216) Installing gdk-pixbuf-dev (2.38.2-r0)
(106/216) Installing libpciaccess (0.16-r0)
(107/216) Installing libdrm (2.4.99-r1)
(108/216) Installing libdrm-dev (2.4.99-r1)
(109/216) Installing libxext-dev (1.3.4-r0)
(110/216) Installing libxfixes-dev (5.0.3-r2)
(111/216) Installing libxdamage-dev (1.1.5-r0)
(112/216) Installing libxshmfence (1.3-r0)
(113/216) Installing libxshmfence-dev (1.3-r0)
(114/216) Installing mesa (19.1.7-r1)
(115/216) Installing wayland-libs-server (1.17.0-r0)
(116/216) Installing mesa-gbm (19.1.7-r1)
(117/216) Installing mesa-glapi (19.1.7-r1)
(118/216) Installing wayland-libs-client (1.17.0-r0)
(119/216) Installing mesa-egl (19.1.7-r1)
(120/216) Installing libxxf86vm (1.1.4-r2)
(121/216) Installing mesa-gl (19.1.7-r1)
(122/216) Installing mesa-gles (19.1.7-r1)
(123/216) Installing llvm9-libs (9.0.0-r0)
(124/216) Installing mesa-osmesa (19.1.7-r1)
(125/216) Installing mesa-xatracker (19.1.7-r1)
(126/216) Installing libxxf86vm-dev (1.1.4-r2)
(127/216) Installing mesa-dev (19.1.7-r1)
(128/216) Installing libepoxy (1.5.3-r0)
(129/216) Installing libepoxy-dev (1.5.3-r0)
(130/216) Installing libxi-dev (1.7.10-r0)
(131/216) Installing libxinerama (1.1.4-r1)
(132/216) Installing libxinerama-dev (1.1.4-r1)
(133/216) Installing wayland-protocols (1.18-r0)
(134/216) Installing wayland-libs-cursor (1.17.0-r0)
(135/216) Installing libxkbcommon (0.8.4-r1)
(136/216) Installing libxkbcommon-x11 (0.8.4-r1)
(137/216) Installing libxkbcommon-dev (0.8.4-r1)
(138/216) Installing libxtst (1.2.3-r3)
(139/216) Installing at-spi2-core (2.34.0-r0)
(140/216) Installing at-spi2-atk (2.34.0-r0)
(141/216) Installing cairo-gobject (1.16.0-r2)
(142/216) Installing wayland-libs-egl (1.17.0-r0)
(143/216) Installing gtk+3.0 (3.24.11-r1)
Executing gtk+3.0-3.24.11-r1.post-install
(144/216) Installing dbus-elogind-dev (1.12.16-r0)
(145/216) Installing libxtst-dev (1.2.3-r3)
(146/216) Installing at-spi2-core-dev (2.34.0-r0)
(147/216) Installing at-spi2-atk-dev (2.34.0-r0)
(148/216) Installing expat-dev (2.2.9-r0)
(149/216) Installing libpng-dev (1.6.37-r1)
(150/216) Installing freetype-dev (2.10.1-r0)
(151/216) Installing fontconfig-dev (2.13.1-r2)
(152/216) Installing libxrender-dev (0.9.10-r3)
(153/216) Installing pixman-dev (0.38.4-r0)
(154/216) Installing xcb-util (0.4.0-r1)
(155/216) Installing xcb-util-dev (0.4.0-r1)
(156/216) Installing cairo-tools (1.16.0-r2)
(157/216) Installing cairo-dev (1.16.0-r2)
(158/216) Installing fribidi-dev (1.0.7-r0)
(159/216) Installing harfbuzz-icu (2.6.1-r0)
(160/216) Installing graphite2-dev (1.3.13-r1)
(161/216) Installing icu (64.2-r0)
(162/216) Installing icu-dev (64.2-r0)
(163/216) Installing harfbuzz-dev (2.6.1-r0)
(164/216) Installing libxft-dev (2.3.3-r0)
(165/216) Installing pango-dev (1.44.6-r0)
(166/216) Installing wayland-dev (1.17.0-r0)
(167/216) Installing libxcomposite-dev (0.4.5-r0)
(168/216) Installing libxcursor-dev (1.2.0-r0)
(169/216) Installing libxrandr-dev (1.5.2-r0)
(170/216) Installing gtk+3.0-dev (3.24.11-r1)
(171/216) Installing dbus-glib-dev (0.110-r0)
(172/216) Installing polkit-dev (0.116-r0)
(173/216) Installing gconf-dev (3.2.6-r5)
(174/216) Installing py3-six (1.12.0-r1)
(175/216) Installing py3-pygments (2.4.2-r0)
(176/216) Installing gtk-doc (1.32-r0)
(177/216) Installing mce-headers (1.8.19-r2)
(178/216) Installing perl (5.30.0-r0)
(179/216) Installing perl-http-date (6.02-r1)
(180/216) Installing perl-lwp-mediatypes (6.04-r0)
(181/216) Installing perl-encode-locale (1.05-r1)
(182/216) Installing perl-uri (1.76-r0)
(183/216) Installing perl-io-html (1.001-r2)
(184/216) Installing perl-http-message (6.18-r0)
(185/216) Installing perl-http-cookies (6.04-r0)
(186/216) Installing perl-net-http (6.19-r0)
(187/216) Installing perl-http-daemon (6.06-r0)
(188/216) Installing perl-html-tagset (3.20-r1)
(189/216) Installing perl-html-parser (3.72-r4)
(190/216) Installing perl-file-listing (6.04-r1)
(191/216) Installing perl-www-robotrules (6.02-r1)
(192/216) Installing perl-http-negotiate (6.01-r1)
(193/216) Installing perl-capture-tiny (0.48-r0)
(194/216) Installing perl-devel-symdump (2.18-r0)
(195/216) Installing perl-test-pod (1.52-r0)
(196/216) Installing perl-pod-coverage (0.23-r0)
(197/216) Installing perl-try-tiny (0.30-r1)
(198/216) Installing perl-libwww (6.39-r1)
(199/216) Installing perl-xml-parser (2.46-r0)
(200/216) Installing intltool (0.51.0-r4)
(201/216) Installing gtk+2.0-maemo-dev (2.24.31-r4)
(202/216) Installing libcanberra-gtk2 (0.30-r3)
(203/216) Installing libcanberra-gtk3 (0.30-r3)
(204/216) Installing libcanberra-dev (0.30-r3)
(205/216) Installing libhildon-dev (2.2.25.3-r0)
(206/216) Installing libosso (2.35-r0)
(207/216) Installing libosso-dev (2.35-r0)
(208/216) Installing gstreamer (1.16.1-r0)
(209/216) Installing hildon-thumbnail (3.1.2-r0)
(210/216) Installing hildon-thumbnail-dev (3.1.2-r0)
(211/216) Installing libhildonmime (3.0.3-r0)
(212/216) Installing libhildonmime-dev (3.0.3-r0)
(213/216) Installing m4 (1.4.18-r1)
(214/216) Installing autoconf (2.69-r2)
(215/216) Installing automake (1.16.1-r0)
(216/216) Installing .makedepends-libhildonfm (20191008.081656)
Executing busybox-1.31.0-r1.trigger
Executing glib-2.62.0-r0.trigger
Executing shared-mime-info-1.12-r1.trigger
Executing gdk-pixbuf-2.38.2-r0.trigger
Executing gtk-update-icon-cache-2.24.32-r1.trigger
OK: 575 MiB in 271 packages
]0;>>> libhildonfm: Cleaning up srcdir
]0;>>> libhildonfm: Cleaning up pkgdir
>>> libhildonfm: Fetching libhildonfm-2.28.22.tar.gz::https://github.com/maemo-leste/libhildonfm/archive/2.28.22.tar.gz
  % Total    % Received % Xferd  Average Speed   Time    Time     Time  Current
                                 Dload  Upload   Total   Spent    Left  Speed

  0     0    0     0    0     0      0      0 --:--:-- --:--:-- --:--:--     0
  0     0    0     0    0     0      0      0 --:--:-- --:--:-- --:--:--     0
100   132    0   132    0     0    763      0 --:--:-- --:--:-- --:--:--   758

100  264k    0  264k    0     0   702k      0 --:--:-- --:--:-- --:--:--  702k
>>> libhildonfm: Fetching libhildonfm-2.28.22.tar.gz::https://github.com/maemo-leste/libhildonfm/archive/2.28.22.tar.gz
>>> libhildonfm: Checking sha512sums...
libhildonfm-2.28.22.tar.gz: OK
>>> libhildonfm: Unpacking /var/cache/distfiles/libhildonfm-2.28.22.tar.gz...
+ libtoolize --automake
./autogen.sh: line 4: libtoolize: not found
+ aclocal
+ autoconf
configure.ac:11: error: possibly undefined macro: AC_PROG_LIBTOOL
      If this token and others are legitimate, please use m4_pattern_allow.
      See the Autoconf documentation.
+ autoheader
+ automake --add-missing --foreign
configure.ac:2: warning: AM_INIT_AUTOMAKE: two- and three-arguments forms are deprecated.  For more info, see:
configure.ac:2: https://www.gnu.org/software/automake/manual/automake.html#Modernize-AM_005fINIT_005fAUTOMAKE-invocation
configure.ac:7: installing './compile'
configure.ac:5: installing './config.guess'
configure.ac:5: installing './config.sub'
configure.ac:2: installing './install-sh'
configure.ac:2: installing './missing'
hildon-fm/Makefile.am:3: warning: 'INCLUDES' is the old name for 'AM_CPPFLAGS' (or '*_CPPFLAGS')
hildon-fm/Makefile.am:11: error: Libtool library used but 'LIBTOOL' is undefined
hildon-fm/Makefile.am:11:   The usual way to define 'LIBTOOL' is to add 'LT_INIT'
hildon-fm/Makefile.am:11:   to 'configure.ac' and run 'aclocal' and 'autoconf' again.
hildon-fm/Makefile.am:11:   If 'LT_INIT' is in 'configure.ac', make sure
hildon-fm/Makefile.am:11:   its definition is in aclocal's search path.
hildon-fm/Makefile.am:24: warning: source file 'gtkfilesystem/gtkfilechooserutils.c' is in a subdirectory,
hildon-fm/Makefile.am:24: but option 'subdir-objects' is disabled
automake: warning: possible forward-incompatibility.
automake: At least a source file is in a subdirectory, but the 'subdir-objects'
automake: automake option hasn't been enabled.  For now, the corresponding output
automake: object file(s) will be placed in the top-level directory.  However,
automake: this behaviour will change in future Automake versions: they will
automake: unconditionally cause object files to be placed in the same subdirectory
automake: of the corresponding sources.
automake: You are advised to start using 'subdir-objects' option throughout your
automake: project, to avoid future incompatibilities.
hildon-fm/Makefile.am:24: warning: source file 'gtkfilesystem/gtkfilesystem.c' is in a subdirectory,
hildon-fm/Makefile.am:24: but option 'subdir-objects' is disabled
hildon-fm/Makefile.am:24: warning: source file 'gtkfilesystem/gtkfilesystemgio.c' is in a subdirectory,
hildon-fm/Makefile.am:24: but option 'subdir-objects' is disabled
hildon-fm/Makefile.am: installing './depcomp'
+ test x '=' x
+ ./configure --enable-maintainer-mode '--prefix=/usr'
configure: WARNING: unrecognized options: --enable-maintainer-mode
checking for a BSD-compatible install... /usr/bin/install -c
checking whether build environment is sane... yes
checking for a thread-safe mkdir -p... ./install-sh -c -d
checking for gawk... no
checking for mawk... no
checking for nawk... no
checking for awk... awk
checking whether make sets $(MAKE)... yes
checking whether make supports nested variables... yes
checking build system type... x86_64-pc-linux-musl
checking host system type... x86_64-pc-linux-musl
checking for gcc... gcc
checking whether the C compiler works... yes
checking for C compiler default output file name... a.out
checking for suffix of executables... 
checking whether we are cross compiling... no
checking for suffix of object files... o
checking whether we are using the GNU C compiler... yes
checking whether gcc accepts -g... yes
checking for gcc option to accept ISO C89... none needed
checking whether gcc understands -c and -o together... yes
checking whether make supports the include directive... yes (GNU style)
checking dependency style of gcc... gcc3
checking how to run the C preprocessor... gcc -E
checking for gawk... (cached) awk
./configure: line 3916: AC_PROG_LIBTOOL: not found
checking for grep that handles long lines and -e... /bin/grep
checking for egrep... /bin/grep -E
checking for ANSI C header files... yes
checking for pkg-config... /usr/bin/pkg-config
checking pkg-config is at least version 0.9.0... yes
checking for GTK... yes
checking for HILDON... yes
checking for GCONF... yes
checking for HILDON_THUMBNAIL... yes
checking for LIBOSSOMIME... yes
checking for DBUSGLIB... yes
checking for LIBOSSO... yes
checking for MCE... yes
checking for GIO... yes
checking for gtk-doc... yes
checking for gtkdoc-check... gtkdoc-check.test
checking for gtkdoc-check... /usr/bin/gtkdoc-check
checking for gtkdoc-rebase... /usr/bin/gtkdoc-rebase
checking for gtkdoc-mkpdf... /usr/bin/gtkdoc-mkpdf
checking whether to build gtk-doc documentation... no
checking for GTKDOC_DEPS... yes
checking for perl5... no
checking for perl... perl
checking that generated files are newer than configure... done
configure: creating ./config.status
config.status: creating Makefile
config.status: error: cannot find input file: `hildon-fm/Makefile.in'
>>> ERROR: libhildonfm: build failed
]0;(002161) [08:17:24] ^^^^^^^^^^^^^^^^^^^^^^^^^^^^^^^^^^^^^^^^^^^^^^^^^^^^^^^^^^^^^^^^^^^^^^
(002161) [08:17:24] NOTE: The failed command's output is above the ^^^ line in the log file: /home/build/.local/var/pmbootstrap/log.txt
(002161) [08:17:24] ERROR: Command failed: (native) % cd /home/pmos/build; busybox su pmos -c CARCH=x86_64 SUDO_APK='abuild-apk --no-progress' HOME=/home/pmos abuild -D postmarketOS -r
(002161) [08:17:24] See also: <https://postmarketos.org/troubleshooting>
(002161) [08:17:24] Traceback (most recent call last):
  File "/home/build/pmbootstrap/pmb/__init__.py", line 63, in main
    getattr(frontend, args.action)(args)
  File "/home/build/pmbootstrap/pmb/helpers/frontend.py", line 109, in build
    args.strict, src=src):
  File "/home/build/pmbootstrap/pmb/build/_package.py", line 486, in package
    suffix, src)
  File "/home/build/pmbootstrap/pmb/build/_package.py", line 421, in run_abuild
    pmb.chroot.user(args, cmd, suffix, "/home/pmos/build", env=env)
  File "/home/build/pmbootstrap/pmb/chroot/user.py", line 43, in user
    output_return, check, {}, auto_init)
  File "/home/build/pmbootstrap/pmb/chroot/root.py", line 91, in root
    output_return, check, kill_as_root)
  File "/home/build/pmbootstrap/pmb/helpers/run_core.py", line 301, in core
    raise RuntimeError("Command failed: " + log_message)
RuntimeError: Command failed: (native) % cd /home/pmos/build; busybox su pmos -c CARCH=x86_64 SUDO_APK='abuild-apk --no-progress' HOME=/home/pmos abuild -D postmarketOS -r

Run 'pmbootstrap log' for details.
Build complete: failed 13 days ago (took a minute)