#94953 failed

Note

WIP testing new bpo run job code

Owner
~martijnbraam
Created
13 days ago
Updated
13 days ago
Build manifest
view manifest »

Tasks

view log »
bpo_setup view log »
install_pubkey view log »
pmbootstrap_build view log »
submit view log »
go to bottom »
setup
1
2
3
4
5
6
7
8
9
10
11
12
13
14
15
16
17
18
19
20
21
22
23
24
25
26
27
28
29
30
31
32
33
34
35
36
37
38
39
40
41
42
43
[#94953] 2019/10/07 19:49:32 Booting image alpine/latest (default) on port 22045
[#94953] 2019/10/07 19:49:35 Waiting for guest to settle
[#94953] 2019/10/07 19:49:42 Sending tasks
[#94953] 2019/10/07 19:49:43 Sending build environment
[#94953] 2019/10/07 19:49:43 Sending secrets
[#94953] 2019/10/07 19:49:43 Resolving secret 296b27c6-a74c-462f-9a3b-d46b877d4d8d
[#94953] 2019/10/07 19:49:43 Installing packages
Warning: Permanently added '[localhost]:22045' (ECDSA) to the list of known hosts.
fetch http://repo-cache.local/alpine/v3.10/main/x86_64/APKINDEX.tar.gz
fetch http://repo-cache.local/alpine/v3.10/community/x86_64/APKINDEX.tar.gz
v3.10.2-102-ge3e3e39529 [http://repo-cache.local/alpine/v3.10/main]
v3.10.2-103-g1b5ddad804 [http://repo-cache.local/alpine/v3.10/community]
OK: 10334 distinct packages available
Warning: Permanently added '[localhost]:22045' (ECDSA) to the list of known hosts.
(1/8) Installing libacl (2.2.52-r6)
(2/8) Installing coreutils (8.31-r0)
(3/8) Installing python3 (3.7.4-r0)
(4/8) Installing py3-chardet (3.0.4-r1)
(5/8) Installing py3-idna (2.8-r1)
(6/8) Installing py3-certifi (2019.6.16-r0)
(7/8) Installing py3-urllib3 (1.25.3-r0)
(8/8) Installing py3-requests (2.21.0-r4)
Executing busybox-1.30.1-r2.trigger
OK: 980 MiB in 206 packages
[#94953] 2019/10/07 19:49:45 Cloning repositories
Cloning into 'pmaports'...
+ cd pmaports
+ git submodule update --init
Cloning into 'pmbootstrap'...
+ cd pmbootstrap
+ git submodule update --init
[#94953] 2019/10/07 19:49:49 Running task bpo_setup
[#94953] 2019/10/07 19:49:50 Running task install_pubkey
[#94953] 2019/10/07 19:49:50 Running task pmbootstrap_build
[#94953] 2019/10/07 19:50:25 Build failed.
[#94953] 2019/10/07 19:50:25 The build environment will be kept alive for 10 minutes.
[#94953] 2019/10/07 19:50:25 To log in with SSH and examine it, use the following command:
[#94953] 2019/10/07 19:50:25 
[#94953] 2019/10/07 19:50:25 	ssh -t builds@azusa.runners.sr.ht connect 94953
[#94953] 2019/10/07 19:50:25 
[#94953] 2019/10/07 19:50:25 After logging in, the deadline is increased to your remaining build time.
[#94953] 2019/10/07 20:00:25 Deadline elapsed. Terminating build environment.
[#94953] 2019/10/07 20:00:25 Error: Running task on guest: exit status 1
bpo_setup
1
2
3
+ yes ''
+ ./pmbootstrap/pmbootstrap.py --aports=/home/build/pmaports -q init
[19:49:50] Work path [/home/build/.local/var/pmbootstrap]: [19:49:50] Device [samsung-i9100]: [19:49:50] Enable this package? (y/n) [y]: [19:49:50] Username [user]: [19:49:50] User interface [weston]: [19:49:50] Change them? (y/n) [n]: [19:49:50] Extra packages [none]: [19:49:50] Device hostname (short form, e.g. 'foo') [samsung-i9100]: 
install_pubkey
1
2
3
4
5
6
7
8
9
10
+ echo -n '-----BEGIN PUBLIC KEY-----
MIIBIjANBgkqhkiG9w0BAQEFAAOCAQ8AMIIBCgKCAQEA3WEjHjAzm+4HmF/qJxFg
GDjQ78Yfv+aoCja8YtW6iGuq9pX+JheD+l/DDVAlbtupdM/SteyGokO1+SWIvVkL
KKtJzWKTtFf2IfqxQRAzTjfxV5jmw+bgYqCUaxEvDVPxO7WMgBGnrxl5gzwVxMBS
TXtgDKMpdOy7Op5YwVCk20Tp8YuyOTkQI728Gw5O8b1iRByv2BIOp1U2okusY3ox
KnDmB0DWWbWKIfVfLoln++WyQP/1INGA2fVAvEUK8Cm0O6RTruT02Sy4VL+a1rDo
9XEVJDfWWV0UfcTEkTpHbwv3Dcxr2RGIBwqDonUUGZOl1W9vB0/DccWd6T2BmJ+4
dwIDAQAB
-----END PUBLIC KEY-----
'
pmbootstrap_build
1
2
3
4
5
6
7
8
9
10
11
12
13
14
15
16
17
18
19
20
21
22
23
24
25
26
27
28
29
30
31
32
33
34
35
36
37
38
39
40
41
42
43
44
45
46
47
48
49
50
51
52
53
54
55
56
57
58
59
60
61
62
63
64
65
66
67
68
69
70
71
72
73
74
75
76
77
78
79
80
81
82
83
84
85
86
87
88
89
90
91
92
93
94
95
96
97
98
99
100
101
102
103
104
105
106
107
108
109
110
111
112
113
114
115
116
117
118
119
120
121
122
123
124
125
126
127
128
129
130
131
132
133
134
135
136
137
138
139
140
141
142
143
144
145
146
147
148
149
150
151
152
153
154
155
156
157
158
159
160
161
162
163
164
165
166
167
168
169
170
171
172
173
174
175
176
177
178
179
180
181
182
183
184
185
186
187
188
189
190
191
192
193
194
195
196
197
198
199
200
201
202
203
204
205
206
207
208
209
210
211
212
213
214
215
216
217
218
219
220
221
222
223
224
225
226
227
228
229
230
231
232
233
234
235
236
237
238
239
240
241
242
243
244
245
246
247
248
249
250
251
252
253
254
255
256
257
258
259
260
261
262
263
264
265
266
267
268
269
270
271
272
273
274
275
276
277
278
279
280
281
282
283
284
285
286
287
288
289
290
291
292
293
294
295
296
297
298
299
300
301
302
303
304
305
306
307
308
309
310
311
312
313
314
315
316
317
318
319
320
321
322
323
324
325
326
327
328
329
330
331
332
333
334
335
336
337
338
339
340
341
342
343
344
345
346
347
348
349
350
351
352
353
354
355
356
357
358
359
360
361
362
363
364
365
366
367
368
369
370
371
372
373
374
375
376
377
378
379
380
381
382
383
384
385
386
387
388
389
390
391
392
393
394
395
396
397
398
399
400
401
402
403
404
405
406
407
408
409
410
411
412
413
414
415
416
417
418
419
420
421
422
423
424
425
426
427
428
429
430
431
432
433
434
435
436
437
438
439
440
441
442
443
444
445
446
447
448
449
450
451
452
453
454
455
456
457
458
459
460
461
462
463
464
465
466
467
468
469
470
471
472
473
474
475
476
477
478
479
480
481
482
483
484
485
486
487
488
489
490
491
492
493
494
495
496
497
498
499
500
501
502
503
504
505
506
507
508
509
510
511
512
513
514
515
516
517
518
519
520
521
522
523
524
525
526
527
528
529
530
531
532
533
534
535
536
537
538
539
540
541
542
543
544
545
546
547
548
549
550
551
552
553
554
555
556
557
558
559
560
561
562
563
564
565
566
567
568
569
570
571
572
573
574
575
576
577
578
579
580
581
582
583
584
585
586
587
588
589
590
591
592
593
594
595
596
597
598
599
600
601
602
603
604
605
606
607
608
609
610
611
612
613
614
615
616
617
618
619
620
621
622
623
624
625
626
627
628
629
630
631
632
633
634
635
+ ./pmbootstrap/pmbootstrap.py -mp https://build.postmarketos.org/wip/master --mirror-pmOS http://postmarketos.brixit.nl/postmarketos/master/x86_64 --details-to-stdout build --no-depends --strict --arch x86_64 dbus-test-runner
(002157) [19:49:50] Shutdown complete
(002157) [19:49:50] Calculate work folder size
(002157) [19:49:50] % sudo du --summarize --block-size=1 /home/build/.local/var/pmbootstrap
20480	/home/build/.local/var/pmbootstrap
(002157) [19:49:50] Shutdown complete
(002157) [19:49:50] % sudo du --summarize --block-size=1 /home/build/.local/var/pmbootstrap
20480	/home/build/.local/var/pmbootstrap
(002157) [19:49:50] Cleared up ~0 MB of space
(002157) [19:49:50] APKINDEX outdated (file does not exist yet): https://build.postmarketos.org/wip/master/x86_64/APKINDEX.tar.gz
(002157) [19:49:50] APKINDEX outdated (file does not exist yet): http://postmarketos.brixit.nl/postmarketos/master/x86_64/x86_64/APKINDEX.tar.gz
(002157) [19:49:50] APKINDEX outdated (file does not exist yet): http://dl-cdn.alpinelinux.org/alpine/edge/main/x86_64/APKINDEX.tar.gz
(002157) [19:49:50] APKINDEX outdated (file does not exist yet): http://dl-cdn.alpinelinux.org/alpine/edge/community/x86_64/APKINDEX.tar.gz
(002157) [19:49:50] APKINDEX outdated (file does not exist yet): http://dl-cdn.alpinelinux.org/alpine/edge/testing/x86_64/APKINDEX.tar.gz
(002157) [19:49:50] Update package index for x86_64 (5 file(s))
(002157) [19:49:50] Download https://build.postmarketos.org/wip/master/x86_64/APKINDEX.tar.gz
(002157) [19:49:51] % sudo mkdir -p /home/build/.local/var/pmbootstrap/cache_apk_x86_64
(002157) [19:49:51] % sudo cp /home/build/.local/var/pmbootstrap/cache_http/APKINDEX_53711a85d2d03805fc9e859f0e55eda4941541086fca30263c9338b694af655c /home/build/.local/var/pmbootstrap/cache_apk_x86_64/APKINDEX.73602495.tar.gz
(002157) [19:49:51] Download http://postmarketos.brixit.nl/postmarketos/master/x86_64/x86_64/APKINDEX.tar.gz
(002157) [19:49:51] WARNING: file not found: http://postmarketos.brixit.nl/postmarketos/master/x86_64/x86_64/APKINDEX.tar.gz
(002157) [19:49:51] Download http://dl-cdn.alpinelinux.org/alpine/edge/main/x86_64/APKINDEX.tar.gz
(002157) [19:49:51] % sudo cp /home/build/.local/var/pmbootstrap/cache_http/APKINDEX_b36af8b1d7f948f0d2fcae5bd60c1b876620e69b987bc066e7a90c810687e76f /home/build/.local/var/pmbootstrap/cache_apk_x86_64/APKINDEX.066df28d.tar.gz
(002157) [19:49:51] Download http://dl-cdn.alpinelinux.org/alpine/edge/community/x86_64/APKINDEX.tar.gz
(002157) [19:49:51] % sudo cp /home/build/.local/var/pmbootstrap/cache_http/APKINDEX_0999dbfe3755729bd8aa3997d03dbd36a87187a19b61ce5cea2e01671a6305d6 /home/build/.local/var/pmbootstrap/cache_apk_x86_64/APKINDEX.b53994b4.tar.gz
(002157) [19:49:51] Download http://dl-cdn.alpinelinux.org/alpine/edge/testing/x86_64/APKINDEX.tar.gz
(002157) [19:49:51] % sudo cp /home/build/.local/var/pmbootstrap/cache_http/APKINDEX_6ccac8825a1621fb204ad4b3e645b24ffd8fa9acfe97edc265646cafd18d3e4c /home/build/.local/var/pmbootstrap/cache_apk_x86_64/APKINDEX.30e6f5af.tar.gz
(002157) [19:49:53] Build is necessary for package 'dbus-test-runner': No binary package available
(002157) [19:49:53] NOTE: Skipped apk version check for chroot 'native', because it is not installed yet!
(002157) [19:49:53] % sudo mkdir -p /home/build/.local/var/pmbootstrap/chroot_native/dev
(002157) [19:49:53] % sudo mount -t tmpfs -o size=1M,noexec,dev tmpfs /home/build/.local/var/pmbootstrap/chroot_native/dev
(002157) [19:49:53] % sudo mkdir -p /home/build/.local/var/pmbootstrap/chroot_native/dev/pts /home/build/.local/var/pmbootstrap/chroot_native/dev/shm
(002157) [19:49:53] % sudo mount -t tmpfs -o nodev,nosuid,noexec tmpfs /home/build/.local/var/pmbootstrap/chroot_native/dev/shm
(002157) [19:49:53] % sudo mknod -m 666 /home/build/.local/var/pmbootstrap/chroot_native/dev/null c 1 3
(002157) [19:49:53] % sudo mknod -m 666 /home/build/.local/var/pmbootstrap/chroot_native/dev/zero c 1 5
(002157) [19:49:53] % sudo mknod -m 666 /home/build/.local/var/pmbootstrap/chroot_native/dev/full c 1 7
(002157) [19:49:53] % sudo mknod -m 644 /home/build/.local/var/pmbootstrap/chroot_native/dev/random c 1 8
(002157) [19:49:53] % sudo mknod -m 644 /home/build/.local/var/pmbootstrap/chroot_native/dev/urandom c 1 9
(002157) [19:49:53] % sudo mkdir -p /home/build/.local/var/pmbootstrap/chroot_native/proc
(002157) [19:49:53] % sudo mount --bind /proc /home/build/.local/var/pmbootstrap/chroot_native/proc
(002157) [19:49:53] % sudo mkdir -p /home/build/.local/var/pmbootstrap/chroot_native/var/cache/apk
(002157) [19:49:53] % sudo mount --bind /home/build/.local/var/pmbootstrap/cache_apk_x86_64 /home/build/.local/var/pmbootstrap/chroot_native/var/cache/apk
(002157) [19:49:53] % sudo mkdir -p /home/build/.local/var/pmbootstrap/cache_ccache_x86_64
(002157) [19:49:53] % sudo mkdir -p /home/build/.local/var/pmbootstrap/chroot_native/mnt/pmbootstrap-ccache
(002157) [19:49:53] % sudo mount --bind /home/build/.local/var/pmbootstrap/cache_ccache_x86_64 /home/build/.local/var/pmbootstrap/chroot_native/mnt/pmbootstrap-ccache
(002157) [19:49:53] % sudo mkdir -p /home/build/.local/var/pmbootstrap/cache_distfiles
(002157) [19:49:53] % sudo mkdir -p /home/build/.local/var/pmbootstrap/chroot_native/var/cache/distfiles
(002157) [19:49:53] % sudo mount --bind /home/build/.local/var/pmbootstrap/cache_distfiles /home/build/.local/var/pmbootstrap/chroot_native/var/cache/distfiles
(002157) [19:49:53] % sudo mkdir -p /home/build/.local/var/pmbootstrap/cache_git
(002157) [19:49:53] % sudo mkdir -p /home/build/.local/var/pmbootstrap/chroot_native/mnt/pmbootstrap-git
(002157) [19:49:53] % sudo mount --bind /home/build/.local/var/pmbootstrap/cache_git /home/build/.local/var/pmbootstrap/chroot_native/mnt/pmbootstrap-git
(002157) [19:49:53] % sudo mkdir -p /home/build/.local/var/pmbootstrap/config_abuild
(002157) [19:49:53] % sudo mkdir -p /home/build/.local/var/pmbootstrap/chroot_native/mnt/pmbootstrap-abuild-config
(002157) [19:49:53] % sudo mount --bind /home/build/.local/var/pmbootstrap/config_abuild /home/build/.local/var/pmbootstrap/chroot_native/mnt/pmbootstrap-abuild-config
(002157) [19:49:53] % sudo mkdir -p /home/build/.local/var/pmbootstrap/config_apk_keys
(002157) [19:49:53] % sudo mkdir -p /home/build/.local/var/pmbootstrap/chroot_native/etc/apk/keys
(002157) [19:49:53] % sudo mount --bind /home/build/.local/var/pmbootstrap/config_apk_keys /home/build/.local/var/pmbootstrap/chroot_native/etc/apk/keys
(002157) [19:49:53] % sudo mkdir -p /home/build/.local/var/pmbootstrap/packages
(002157) [19:49:53] % sudo mkdir -p /home/build/.local/var/pmbootstrap/chroot_native/mnt/pmbootstrap-packages
(002157) [19:49:53] % sudo mount --bind /home/build/.local/var/pmbootstrap/packages /home/build/.local/var/pmbootstrap/chroot_native/mnt/pmbootstrap-packages
(002157) [19:49:53] Download http://dl-cdn.alpinelinux.org/alpine/edge/main/x86_64/apk-tools-static-2.10.4-r3.apk
(002157) [19:49:53] sigfilename: sbin/apk.static.SIGN.RSA.alpine-devel@lists.alpinelinux.org-5261cecb.rsa.pub
(002157) [19:49:53] sigkey: alpine-devel@lists.alpinelinux.org-5261cecb.rsa.pub
(002157) [19:49:53] extracted: /tmp/pmbootstrap7a00twyxapk
(002157) [19:49:53] extracted: /tmp/pmbootstrapl6memh_psig
(002157) [19:49:53] Verify apk.static signature with /home/build/pmbootstrap/pmb/data/keys/alpine-devel@lists.alpinelinux.org-5261cecb.rsa.pub
(002157) [19:49:53] % openssl dgst -sha1 -verify /home/build/pmbootstrap/pmb/data/keys/alpine-devel@lists.alpinelinux.org-5261cecb.rsa.pub -signature /tmp/pmbootstrapl6memh_psig /tmp/pmbootstrap7a00twyxapk
Verified OK
(002157) [19:49:53] Verify the version reported by the apk.static binary (must match the package version 2.10.4-r3)
(002157) [19:49:53] % /tmp/pmbootstrap7a00twyxapk --version
apk-tools 2.10.4, compiled for x86_64.
(002157) [19:49:53] (native) install alpine-base
(002157) [19:49:53] % sudo ln -s -f /var/cache/apk /home/build/.local/var/pmbootstrap/chroot_native/etc/apk/cache
(002157) [19:49:53] % sudo cp /home/build/pmbootstrap/pmb/data/keys/alpine-devel@lists.alpinelinux.org-4a6a0840.rsa.pub /home/build/.local/var/pmbootstrap/config_apk_keys/
(002157) [19:49:53] % sudo cp /home/build/pmbootstrap/pmb/data/keys/pmos-5a03a13a.rsa.pub /home/build/.local/var/pmbootstrap/config_apk_keys/
(002157) [19:49:53] % sudo cp /home/build/pmbootstrap/pmb/data/keys/alpine-devel@lists.alpinelinux.org-58199dcc.rsa.pub /home/build/.local/var/pmbootstrap/config_apk_keys/
(002157) [19:49:53] % sudo cp /home/build/pmbootstrap/pmb/data/keys/alpine-devel@lists.alpinelinux.org-58cbb476.rsa.pub /home/build/.local/var/pmbootstrap/config_apk_keys/
(002157) [19:49:53] % sudo cp /home/build/pmbootstrap/pmb/data/keys/alpine-devel@lists.alpinelinux.org-5243ef4b.rsa.pub /home/build/.local/var/pmbootstrap/config_apk_keys/
(002157) [19:49:53] % sudo cp /home/build/pmbootstrap/pmb/data/keys/wip.rsa.pub /home/build/.local/var/pmbootstrap/config_apk_keys/
(002157) [19:49:53] % sudo cp /home/build/pmbootstrap/pmb/data/keys/alpine-devel@lists.alpinelinux.org-524d27bb.rsa.pub /home/build/.local/var/pmbootstrap/config_apk_keys/
(002157) [19:49:53] % sudo cp /home/build/pmbootstrap/pmb/data/keys/alpine-devel@lists.alpinelinux.org-58e4f17d.rsa.pub /home/build/.local/var/pmbootstrap/config_apk_keys/
(002157) [19:49:53] % sudo cp /home/build/pmbootstrap/pmb/data/keys/alpine-devel@lists.alpinelinux.org-5261cecb.rsa.pub /home/build/.local/var/pmbootstrap/config_apk_keys/
(002157) [19:49:53] % sudo cp /etc/resolv.conf /home/build/.local/var/pmbootstrap/chroot_native/etc/resolv.conf
(002157) [19:49:53] % sudo mkdir -p /home/build/.local/var/pmbootstrap/chroot_native/etc/apk
(002157) [19:49:53] (native) update /etc/apk/repositories
(002157) [19:49:53] % sudo sh -c echo /mnt/pmbootstrap-packages >> /home/build/.local/var/pmbootstrap/chroot_native/etc/apk/repositories
(002157) [19:49:53] % sudo sh -c echo https://build.postmarketos.org/wip/master >> /home/build/.local/var/pmbootstrap/chroot_native/etc/apk/repositories
(002157) [19:49:53] % sudo sh -c echo http://postmarketos.brixit.nl/postmarketos/master/x86_64 >> /home/build/.local/var/pmbootstrap/chroot_native/etc/apk/repositories
(002157) [19:49:53] % sudo sh -c echo http://dl-cdn.alpinelinux.org/alpine/edge/main >> /home/build/.local/var/pmbootstrap/chroot_native/etc/apk/repositories
(002157) [19:49:53] % sudo sh -c echo http://dl-cdn.alpinelinux.org/alpine/edge/community >> /home/build/.local/var/pmbootstrap/chroot_native/etc/apk/repositories
(002157) [19:49:53] % sudo sh -c echo http://dl-cdn.alpinelinux.org/alpine/edge/testing >> /home/build/.local/var/pmbootstrap/chroot_native/etc/apk/repositories
(002157) [19:49:53] % sudo /home/build/.local/var/pmbootstrap/apk.static --no-progress --root /home/build/.local/var/pmbootstrap/chroot_native --cache-dir /home/build/.local/var/pmbootstrap/cache_apk_x86_64 --initdb --arch x86_64 add alpine-base
WARNING: Ignoring /mnt/pmbootstrap-packages/x86_64/APKINDEX.tar.gz: No such file or directory
fetch http://postmarketos.brixit.nl/postmarketos/master/x86_64/x86_64/APKINDEX.tar.gz
ERROR: http://postmarketos.brixit.nl/postmarketos/master/x86_64: No such file or directory
WARNING: Ignoring APKINDEX.ee115b70.tar.gz: No such file or directory
(1/19) Installing musl (1.1.23-r3)
(2/19) Installing busybox (1.31.0-r1)
Executing busybox-1.31.0-r1.post-install
(3/19) Installing alpine-baselayout (3.2.0-r2)
Executing alpine-baselayout-3.2.0-r2.pre-install
Executing alpine-baselayout-3.2.0-r2.post-install
(4/19) Installing openrc (0.42.1-r0)
Executing openrc-0.42.1-r0.post-install
(5/19) Installing alpine-conf (3.8.3-r0)
(6/19) Installing libcrypto1.1 (1.1.1d-r2)
(7/19) Installing libssl1.1 (1.1.1d-r2)
(8/19) Installing ca-certificates-cacert (20190108-r0)
(9/19) Installing libtls-standalone (2.9.1-r0)
(10/19) Installing ssl_client (1.31.0-r1)
(11/19) Installing zlib (1.2.11-r3)
(12/19) Installing apk-tools (2.10.4-r3)
(13/19) Installing busybox-suid (1.31.0-r1)
(14/19) Installing busybox-initscripts (3.2-r0)
Executing busybox-initscripts-3.2-r0.post-install
(15/19) Installing scanelf (1.2.4-r0)
(16/19) Installing musl-utils (1.1.23-r3)
(17/19) Installing libc-utils (0.7.1-r0)
(18/19) Installing alpine-keys (2.1-r2)
(19/19) Installing alpine-base (3.11_alpha20190925-r0)
Executing busybox-1.31.0-r1.trigger
OK: 8 MiB in 19 packages
(002157) [19:49:54] (native) % adduser -D pmos -u 12345
(002157) [19:49:54] (native) % busybox su pmos -c HOME=/home/pmos ln -s /mnt/pmbootstrap-abuild-config /home/pmos/.abuild
(002157) [19:49:54] (native) % chown pmos:pmos /mnt/pmbootstrap-abuild-config
(002157) [19:49:54] (native) % busybox su pmos -c HOME=/home/pmos ln -s /mnt/pmbootstrap-ccache /home/pmos/.ccache
(002157) [19:49:54] (native) % chown pmos:pmos /mnt/pmbootstrap-ccache
(002157) [19:49:54] (native) % busybox su pmos -c HOME=/home/pmos ln -s /mnt/pmbootstrap-git /home/pmos/git
(002157) [19:49:54] (native) % chown pmos:pmos /mnt/pmbootstrap-git
(002157) [19:49:54] (native) % busybox su pmos -c HOME=/home/pmos mkdir -p /home/pmos/packages
(002157) [19:49:54] (native) % busybox su pmos -c HOME=/home/pmos ln -s /mnt/pmbootstrap-packages /home/pmos/packages/pmos
(002157) [19:49:54] (native) % chown pmos:pmos /mnt/pmbootstrap-packages
(002157) [19:49:54] (native) calculate depends of abuild, build-base, ccache (pmbootstrap -v for details)
(002157) [19:49:55] (native) install abuild build-base ccache
(002157) [19:49:56] (native) % apk --no-progress add -u --virtual .pmbootstrap abuild build-base ccache fakeroot sudo pax-utils openssl attr tar pkgconf patch lzip curl binutils file gcc g++ make libc-dev fortify-headers libcap libattr libacl libgcc libstdc++ ca-certificates libcurl libmagic isl libgomp libatomic gmp mpc1 mpfr4 musl-dev nghttp2-libs
WARNING: Ignoring /mnt/pmbootstrap-packages/x86_64/APKINDEX.tar.gz: No such file or directory
fetch http://postmarketos.brixit.nl/postmarketos/master/x86_64/x86_64/APKINDEX.tar.gz
ERROR: http://postmarketos.brixit.nl/postmarketos/master/x86_64: No such file or directory
WARNING: Ignoring APKINDEX.ee115b70.tar.gz: No such file or directory
(1/37) Installing fakeroot (1.24-r0)
(2/37) Installing sudo (1.8.27-r0)
(3/37) Installing libcap (2.27-r0)
(4/37) Installing pax-utils (1.2.4-r0)
(5/37) Installing openssl (1.1.1d-r2)
(6/37) Installing libattr (2.4.48-r0)
(7/37) Installing attr (2.4.48-r0)
(8/37) Installing libacl (2.2.53-r0)
(9/37) Installing tar (1.32-r1)
(10/37) Installing pkgconf (1.6.3-r0)
(11/37) Installing patch (2.7.6-r6)
(12/37) Installing libgcc (9.2.0-r2)
(13/37) Installing libstdc++ (9.2.0-r2)
(14/37) Installing lzip (1.21-r0)
(15/37) Installing ca-certificates (20190108-r0)
(16/37) Installing nghttp2-libs (1.39.2-r2)
(17/37) Installing libcurl (7.66.0-r0)
(18/37) Installing curl (7.66.0-r0)
(19/37) Installing abuild (3.4.0-r1)
Executing abuild-3.4.0-r1.pre-install
(20/37) Installing binutils (2.32-r0)
(21/37) Installing libmagic (5.37-r0)
(22/37) Installing file (5.37-r0)
(23/37) Installing gmp (6.1.2-r1)
(24/37) Installing isl (0.18-r0)
(25/37) Installing libgomp (9.2.0-r2)
(26/37) Installing libatomic (9.2.0-r2)
(27/37) Installing mpfr4 (4.0.2-r1)
(28/37) Installing mpc1 (1.1.0-r1)
(29/37) Installing gcc (9.2.0-r2)
(30/37) Installing musl-dev (1.1.23-r3)
(31/37) Installing libc-dev (0.7.1-r0)
(32/37) Installing g++ (9.2.0-r2)
(33/37) Installing make (4.2.1-r2)
(34/37) Installing fortify-headers (1.1-r0)
(35/37) Installing build-base (0.5-r1)
(36/37) Installing ccache (3.7.4-r0)
(37/37) Installing .pmbootstrap (20191007.194956)
Executing busybox-1.31.0-r1.trigger
Executing ca-certificates-20190108-r0.trigger
OK: 185 MiB in 56 packages
(002157) [19:50:02] (native) % apk --no-progress add abuild build-base ccache
WARNING: Ignoring /mnt/pmbootstrap-packages/x86_64/APKINDEX.tar.gz: No such file or directory
fetch http://postmarketos.brixit.nl/postmarketos/master/x86_64/x86_64/APKINDEX.tar.gz
ERROR: http://postmarketos.brixit.nl/postmarketos/master/x86_64: No such file or directory
WARNING: Ignoring APKINDEX.ee115b70.tar.gz: No such file or directory
OK: 185 MiB in 56 packages
(002157) [19:50:02] (native) % apk --no-progress del .pmbootstrap
WARNING: Ignoring /mnt/pmbootstrap-packages/x86_64/APKINDEX.tar.gz: No such file or directory
WARNING: Ignoring APKINDEX.ee115b70.tar.gz: No such file or directory
(1/1) Purging .pmbootstrap (20191007.194956)
OK: 185 MiB in 55 packages
(002157) [19:50:02] (native) % chown root:abuild /var/cache/distfiles
(002157) [19:50:02] (native) % chmod g+w /var/cache/distfiles
(002157) [19:50:02] (native) generate abuild keys
(002157) [19:50:02] (native) % busybox su pmos -c HOME=/home/pmos abuild-keygen -n -q -a
Generating RSA private key, 2048 bit long modulus (2 primes)
..............................................................+++++
..........+++++
e is 65537 (0x010001)
writing RSA key
(002157) [19:50:02] (native) % cp /mnt/pmbootstrap-abuild-config/pmos-5d9b96ea.rsa.pub /etc/apk/keys/
(002157) [19:50:02] (native) % cp /tmp/gzip_wrapper.sh /usr/local/bin/gzip
(002157) [19:50:02] (native) % chmod +x /usr/local/bin/gzip
(002157) [19:50:02] (native) % adduser pmos abuild
(002157) [19:50:02] (native) % sed -i -e s/^CLEANUP=.*/CLEANUP=''/ /etc/abuild.conf
(002157) [19:50:02] (native) % sed -i -e s/^ERROR_CLEANUP=.*/ERROR_CLEANUP=''/ /etc/abuild.conf
(002157) [19:50:02] (native) % touch /var/local/pmbootstrap_chroot_build_init_done
(002157) [19:50:02] (native) % sed -i -e s/^export JOBS=.*/export JOBS=3/ /etc/abuild.conf
(002157) [19:50:02] (native) % busybox su pmos -c HOME=/home/pmos ccache --max-size 5G
Set cache size limit to 5.0 GB
(002157) [19:50:02] (native) build x86_64/dbus-test-runner-15.04.0_git20180109-r0.apk
(002157) [19:50:02] % sudo cp -rL /home/build/pmaports/main/dbus-test-runner/ /home/build/.local/var/pmbootstrap/chroot_native/home/pmos/build
(002157) [19:50:02] (native) % chown -R pmos:pmos /home/pmos/build
(002157) [19:50:02] (native) % cd /home/pmos/build; busybox su pmos -c CARCH=x86_64 SUDO_APK='abuild-apk --no-progress' HOME=/home/pmos abuild -D postmarketOS -r
]0;abuild: dbus-test-runner>>> dbus-test-runner: Building pmos/dbus-test-runner 15.04.0_git20180109-r0 (using abuild 3.4.0-r1) started Mon, 07 Oct 2019 19:50:03 +0000
>>> dbus-test-runner: Checking sanity of /home/pmos/build/APKBUILD...
>>> dbus-test-runner: Analyzing dependencies...
>>> dbus-test-runner: Installing for build: build-base dbus gnome-common automake autoconf intltool libtool dbus-glib-dev
WARNING: Ignoring /home/pmos/packages//pmos/x86_64/APKINDEX.tar.gz: No such file or directory
WARNING: Ignoring /mnt/pmbootstrap-packages/x86_64/APKINDEX.tar.gz: No such file or directory
fetch http://postmarketos.brixit.nl/postmarketos/master/x86_64/x86_64/APKINDEX.tar.gz
ERROR: http://postmarketos.brixit.nl/postmarketos/master/x86_64: No such file or directory
WARNING: Ignoring APKINDEX.ee115b70.tar.gz: No such file or directory
(1/79) Installing dbus-elogind-libs (1.12.16-r0)
(2/79) Installing expat (2.2.9-r0)
(3/79) Installing dbus (1.12.16-r1)
Executing dbus-1.12.16-r1.pre-install
Executing dbus-1.12.16-r1.post-install
(4/79) Installing gnome-common (3.18.0-r1)
(5/79) Installing libbz2 (1.0.8-r1)
(6/79) Installing perl (5.30.0-r0)
(7/79) Installing automake (1.16.1-r0)
(8/79) Installing m4 (1.4.18-r1)
(9/79) Installing autoconf (2.69-r2)
(10/79) Installing perl-http-date (6.02-r1)
(11/79) Installing perl-lwp-mediatypes (6.04-r0)
(12/79) Installing perl-encode-locale (1.05-r1)
(13/79) Installing perl-uri (1.76-r0)
(14/79) Installing perl-io-html (1.001-r2)
(15/79) Installing perl-http-message (6.18-r0)
(16/79) Installing perl-http-cookies (6.04-r0)
(17/79) Installing perl-net-http (6.19-r0)
(18/79) Installing perl-http-daemon (6.06-r0)
(19/79) Installing perl-html-tagset (3.20-r1)
(20/79) Installing perl-html-parser (3.72-r4)
(21/79) Installing perl-file-listing (6.04-r1)
(22/79) Installing perl-www-robotrules (6.02-r1)
(23/79) Installing perl-http-negotiate (6.01-r1)
(24/79) Installing perl-capture-tiny (0.48-r0)
(25/79) Installing perl-devel-symdump (2.18-r0)
(26/79) Installing perl-test-pod (1.52-r0)
(27/79) Installing perl-pod-coverage (0.23-r0)
(28/79) Installing perl-try-tiny (0.30-r1)
(29/79) Installing perl-libwww (6.39-r1)
(30/79) Installing perl-xml-parser (2.46-r0)
(31/79) Installing xz-libs (5.2.4-r0)
(32/79) Installing xz (5.2.4-r0)
(33/79) Installing libintl (0.20.1-r1)
(34/79) Installing ncurses-terminfo-base (6.1_p20191005-r0)
(35/79) Installing ncurses-terminfo (6.1_p20191005-r0)
(36/79) Installing ncurses-libs (6.1_p20191005-r0)
(37/79) Installing libunistring (0.9.10-r0)
(38/79) Installing gettext-libs (0.20.1-r1)
(39/79) Installing libxml2 (2.9.9-r2)
(40/79) Installing gettext (0.20.1-r1)
(41/79) Installing intltool (0.51.0-r4)
(42/79) Installing readline (8.0.1-r0)
(43/79) Installing bash (5.0.11-r0)
Executing bash-5.0.11-r0.post-install
(44/79) Installing libltdl (2.4.6-r6)
(45/79) Installing libtool (2.4.6-r6)
(46/79) Installing libffi (3.2.1-r6)
(47/79) Installing libblkid (2.34-r0)
(48/79) Installing libmount (2.34-r0)
(49/79) Installing pcre (8.43-r0)
(50/79) Installing glib (2.62.0-r0)
(51/79) Installing dbus-glib (0.110-r0)
(52/79) Installing libuuid (2.34-r0)
(53/79) Installing libfdisk (2.34-r0)
(54/79) Installing libsmartcols (2.34-r0)
(55/79) Installing util-linux-dev (2.34-r0)
(56/79) Installing dbus-elogind-dev (1.12.16-r0)
(57/79) Installing gdbm (1.13-r1)
(58/79) Installing sqlite-libs (3.29.0-r0)
(59/79) Installing python3 (3.7.4-r0)
(60/79) Installing gettext-asprintf (0.20.1-r1)
(61/79) Installing gettext-dev (0.20.1-r1)
(62/79) Installing bzip2-dev (1.0.8-r1)
(63/79) Installing libxml2-utils (2.9.9-r2)
(64/79) Installing libgpg-error (1.36-r2)
(65/79) Installing libgcrypt (1.8.5-r0)
(66/79) Installing libxslt (1.1.33-r1)
(67/79) Installing docbook-xml (4.5-r6)
Executing docbook-xml-4.5-r6.post-install
(68/79) Installing docbook-xsl (1.79.1-r1)
Executing docbook-xsl-1.79.1-r1.post-install
(69/79) Installing linux-headers (4.19.36-r0)
(70/79) Installing libffi-dev (3.2.1-r6)
(71/79) Installing libpcre16 (8.43-r0)
(72/79) Installing libpcre32 (8.43-r0)
(73/79) Installing libpcrecpp (8.43-r0)
(74/79) Installing pcre-dev (8.43-r0)
(75/79) Installing zlib-dev (1.2.11-r3)
(76/79) Installing glib-dev (2.62.0-r0)
(77/79) Installing dbus-glib-dev (0.110-r0)
(78/79) Installing .makedepends-dbus-test-runner (20191007.195003)
(79/79) Installing dbus-openrc (1.12.16-r1)
Executing busybox-1.31.0-r1.trigger
Executing glib-2.62.0-r0.trigger
No schema files found: doing nothing.
OK: 343 MiB in 134 packages
]0;>>> dbus-test-runner: Cleaning up srcdir
]0;>>> dbus-test-runner: Cleaning up pkgdir
>>> dbus-test-runner: Fetching dbus-test-runner-86d63d119566974bd841cacd3202599b3b1a845d.tar.gz::https://github.com/ubports/dbus-test-runner/archive/86d63d119566974bd841cacd3202599b3b1a845d.tar.gz
  % Total    % Received % Xferd  Average Speed   Time    Time     Time  Current
                                 Dload  Upload   Total   Spent    Left  Speed

  0     0    0     0    0     0      0      0 --:--:-- --:--:-- --:--:--     0
100   166    0   166    0     0   1248      0 --:--:-- --:--:-- --:--:--  1257

100 45535    0 45535    0     0   162k      0 --:--:-- --:--:-- --:--:--  162k
>>> dbus-test-runner: Fetching dbus-test-runner-86d63d119566974bd841cacd3202599b3b1a845d.tar.gz::https://github.com/ubports/dbus-test-runner/archive/86d63d119566974bd841cacd3202599b3b1a845d.tar.gz
>>> dbus-test-runner: Checking sha512sums...
dbus-test-runner-86d63d119566974bd841cacd3202599b3b1a845d.tar.gz: OK
>>> dbus-test-runner: Unpacking /var/cache/distfiles/dbus-test-runner-86d63d119566974bd841cacd3202599b3b1a845d.tar.gz...
/usr/bin/gnome-autogen.sh
***Warning*** USE_GNOME2_MACROS is deprecated, you may remove it from autogen.sh
***Warning*** PKG_NAME is deprecated, you may remove it from autogen.sh
***Warning*** $srcdir is not defined, out of dir autogen is broken!
checking for automake >= 1.11.2...
  testing automake... found 1.16.1
checking for autoreconf >= 2.53...
  testing autoreconf... found 2.69
checking for glib-gettext >= 2.2.0...
  testing glib-gettextize... found 2.62.0
checking for intltool >= 0.25...
  testing intltoolize... found 0.51.0
checking for pkg-config >= 0.14.0...
  testing pkg-config... found 1.6.3
Checking for required M4 macros...
Processing ./configure.ac
Running glib-gettextize... Ignore non-fatal messages.
Copying file po/Makefile.in.in

Please add the files
  codeset.m4 gettext.m4 glibc21.m4 iconv.m4 isc-posix.m4 lcmessage.m4
  progtest.m4
from the /usr/share/aclocal directory to your autoconf macro directory
or directly to your aclocal.m4 file.
You will also need config.guess and config.sub, which you can get from
ftp://ftp.gnu.org/pub/gnu/config/.

Running intltoolize...
Running autoreconf...
autoreconf: Entering directory `.'
autoreconf: configure.ac: not using Gettext
autoreconf: running: aclocal --force --warnings=no-portability 
autoreconf: configure.ac: tracing
autoreconf: running: libtoolize --copy --force
libtoolize: putting auxiliary files in '.'.
libtoolize: copying file './ltmain.sh'
libtoolize: putting macros in AC_CONFIG_MACRO_DIRS, 'm4'.
libtoolize: copying file 'm4/libtool.m4'
libtoolize: copying file 'm4/ltoptions.m4'
libtoolize: copying file 'm4/ltsugar.m4'
libtoolize: copying file 'm4/ltversion.m4'
libtoolize: copying file 'm4/lt~obsolete.m4'
libtoolize: Consider adding '-I m4' to ACLOCAL_AMFLAGS in Makefile.am.
autoreconf: running: /usr/bin/autoconf --force --warnings=no-portability
autoreconf: running: /usr/bin/autoheader --force --warnings=no-portability
autoreconf: running: automake --add-missing --copy --force-missing --warnings=no-portability
configure.ac:8: warning: AM_INIT_AUTOMAKE: two- and three-arguments forms are deprecated.  For more info, see:
configure.ac:8: https://www.gnu.org/software/automake/manual/automake.html#Modernize-AM_005fINIT_005fAUTOMAKE-invocation
configure.ac:13: installing './compile'
configure.ac:17: installing './config.guess'
configure.ac:17: installing './config.sub'
configure.ac:8: installing './install-sh'
configure.ac:8: installing './missing'
Makefile.am: installing './INSTALL'
Makefile.am: installing './COPYING' using GNU General Public License v3 file
Makefile.am:     Consider adding the COPYING file to the version control system
Makefile.am:     for your code, to avoid questions about which license your project uses
libdbustest/Makefile.am: installing './depcomp'
parallel-tests: installing './test-driver'
autoreconf: Leaving directory `.'
Running ./configure --enable-maintainer-mode --build=x86_64-alpine-linux-musl --host=x86_64-alpine-linux-musl --prefix=/usr --libexecdir=/usr/lib ...
checking for a BSD-compatible install... /usr/bin/install -c
checking whether build environment is sane... yes
checking for a thread-safe mkdir -p... ./install-sh -c -d
checking for gawk... no
checking for mawk... no
checking for nawk... no
checking for awk... awk
checking whether make sets $(MAKE)... yes
checking whether make supports nested variables... yes
checking whether to enable maintainer-specific portions of Makefiles... yes
checking whether NLS is requested... yes
checking for intltool >= 0.35.0... 0.51.0 found
checking for intltool-update... /usr/bin/intltool-update
checking for intltool-merge... /usr/bin/intltool-merge
checking for intltool-extract... /usr/bin/intltool-extract
checking for xgettext... /usr/bin/xgettext
checking for msgmerge... /usr/bin/msgmerge
checking for msgfmt... /usr/bin/msgfmt
checking for gmsgfmt... /usr/bin/msgfmt
checking for perl... /usr/bin/perl
checking for perl >= 5.8.1... 5.30.0
checking for XML::Parser... ok
checking whether make supports the include directive... yes (GNU style)
checking for x86_64-alpine-linux-musl-gcc... gcc
checking whether the C compiler works... yes
checking for C compiler default output file name... a.out
checking for suffix of executables... 
checking whether we are cross compiling... no
checking for suffix of object files... o
checking whether we are using the GNU C compiler... yes
checking whether gcc accepts -g... yes
checking for gcc option to accept ISO C89... none needed
checking whether gcc understands -c and -o together... yes
checking dependency style of gcc... gcc3
checking for library containing strerror... none required
checking for x86_64-alpine-linux-musl-gcc... (cached) gcc
checking whether we are using the GNU C compiler... (cached) yes
checking whether gcc accepts -g... (cached) yes
checking for gcc option to accept ISO C89... (cached) none needed
checking whether gcc understands -c and -o together... (cached) yes
checking dependency style of gcc... (cached) gcc3
checking how to run the C preprocessor... gcc -E
checking for grep that handles long lines and -e... /bin/grep
checking for egrep... /bin/grep -E
checking for ANSI C header files... yes
checking build system type... x86_64-alpine-linux-musl
checking host system type... x86_64-alpine-linux-musl
checking how to print strings... printf
checking for a sed that does not truncate output... /bin/sed
checking for fgrep... /bin/grep -F
checking for ld used by gcc... /usr/x86_64-alpine-linux-musl/bin/ld
checking if the linker (/usr/x86_64-alpine-linux-musl/bin/ld) is GNU ld... yes
checking for BSD- or MS-compatible name lister (nm)... /usr/bin/nm -B
checking the name lister (/usr/bin/nm -B) interface... BSD nm
checking whether ln -s works... yes
checking the maximum length of command line arguments... 98304
checking how to convert x86_64-alpine-linux-musl file names to x86_64-alpine-linux-musl format... func_convert_file_noop
checking how to convert x86_64-alpine-linux-musl file names to toolchain format... func_convert_file_noop
checking for /usr/x86_64-alpine-linux-musl/bin/ld option to reload object files... -r
checking for x86_64-alpine-linux-musl-objdump... no
checking for objdump... objdump
checking how to recognize dependent libraries... pass_all
checking for x86_64-alpine-linux-musl-dlltool... no
checking for dlltool... no
checking how to associate runtime and link libraries... printf %s\n
checking for x86_64-alpine-linux-musl-ar... no
checking for ar... ar
checking for archiver @FILE support... @
checking for x86_64-alpine-linux-musl-strip... no
checking for strip... strip
checking for x86_64-alpine-linux-musl-ranlib... no
checking for ranlib... ranlib
checking command to parse /usr/bin/nm -B output from gcc object... ok
checking for sysroot... no
checking for a working dd... /bin/dd
checking how to truncate binary pipes... /bin/dd bs=4096 count=1
checking for x86_64-alpine-linux-musl-mt... no
checking for mt... no
checking if : is a manifest tool... no
checking for sys/types.h... yes
checking for sys/stat.h... yes
checking for stdlib.h... yes
checking for string.h... yes
checking for memory.h... yes
checking for strings.h... yes
checking for inttypes.h... yes
checking for stdint.h... yes
checking for unistd.h... yes
checking for dlfcn.h... yes
checking for objdir... .libs
checking if gcc supports -fno-rtti -fno-exceptions... no
checking for gcc option to produce PIC... -fPIC -DPIC
checking if gcc PIC flag -fPIC -DPIC works... yes
checking if gcc static flag -static works... yes
checking if gcc supports -c -o file.o... yes
checking if gcc supports -c -o file.o... (cached) yes
checking whether the gcc linker (/usr/x86_64-alpine-linux-musl/bin/ld -m elf_x86_64) supports shared libraries... yes
checking whether -lc should be explicitly linked in... no
checking dynamic linker characteristics... GNU/Linux ld.so
checking how to hardcode library paths into programs... immediate
checking whether stripping libraries is possible... yes
checking if libtool supports shared libraries... yes
checking whether to build shared libraries... yes
checking whether to build static libraries... yes
checking whether make supports nested variables... (cached) yes
checking for x86_64-alpine-linux-musl-pkg-config... no
checking for pkg-config... /usr/bin/pkg-config
checking pkg-config is at least version 0.9.0... yes
checking for DBUS_TEST_RUNNER... yes
checking locale.h usability... yes
checking locale.h presence... yes
checking for locale.h... yes
checking for LC_MESSAGES... yes
checking for CFPreferencesCopyAppValue... no
checking for CFLocaleCopyCurrent... no
checking libintl.h usability... yes
checking libintl.h presence... yes
checking for libintl.h... yes
checking for ngettext in libc... no
checking for bindtextdomain in -lintl... yes
checking for ngettext in -lintl... yes
checking for dgettext in -lintl... yes
checking for bind_textdomain_codeset... yes
checking for msgfmt... (cached) /usr/bin/msgfmt
checking for dcgettext... yes
checking if msgfmt accepts -c... yes
checking for gmsgfmt... (cached) /usr/bin/msgfmt
checking for xgettext... (cached) /usr/bin/xgettext
checking for bustle... no
checking that generated files are newer than configure... done
configure: creating ./config.status
config.status: creating Makefile
config.status: creating po/Makefile.in
config.status: creating libdbustest/Makefile
config.status: creating src/Makefile
config.status: creating data/Makefile
config.status: creating tests/Makefile
config.status: creating config.h
config.status: executing depfiles commands
config.status: executing libtool commands
config.status: executing default-1 commands
config.status: executing po/stamp-it commands
configure:

dbus-test-runner Configuration:

	Prefix:                 /usr

	Coverage reporting:     no

Now type `make' to compile dbus-test-runner
make  all-recursive
make[1]: Entering directory '/home/pmos/build/src/dbus-test-runner-86d63d119566974bd841cacd3202599b3b1a845d'
Making all in data
make[2]: Entering directory '/home/pmos/build/src/dbus-test-runner-86d63d119566974bd841cacd3202599b3b1a845d/data'
make[2]: Nothing to be done for 'all'.
make[2]: Leaving directory '/home/pmos/build/src/dbus-test-runner-86d63d119566974bd841cacd3202599b3b1a845d/data'
Making all in libdbustest
make[2]: Entering directory '/home/pmos/build/src/dbus-test-runner-86d63d119566974bd841cacd3202599b3b1a845d/libdbustest'
  CC       libdbustest_la-bustle.lo
  CC       dbus_test_watchdog-leash.o
  GEN      dbus-mock-iface.c
  CC       libdbustest_la-process.lo
  CC       libdbustest_la-service.lo
bustle.c: In function 'dbus_test_bustle_class_init':
bustle.c:61:2: warning: 'g_type_class_add_private' is deprecated [-Wdeprecated-declarations]
   61 |  g_type_class_add_private (klass, sizeof (DbusTestBustlePrivate));
      |  ^~~~~~~~~~~~~~~~~~~~~~~~
In file included from /usr/include/glib-2.0/gobject/gobject.h:24,
                 from /usr/include/glib-2.0/gobject/gbinding.h:29,
                 from /usr/include/glib-2.0/glib-object.h:23,
                 from ../libdbustest/task.h:28,
                 from dbus-test.h:29,
                 from bustle.c:26:
/usr/include/glib-2.0/gobject/gtype.h:1308:10: note: declared here
 1308 | void     g_type_class_add_private       (gpointer                    g_class,
      |          ^~~~~~~~~~~~~~~~~~~~~~~~
bustle.c: In function 'dbus_test_bustle_init':
bustle.c:80:13: error: G_ADD_PRIVATE [-Werror]
   80 |  self->priv = DBUS_TEST_BUSTLE_GET_PRIVATE(self);
      |             ^~~~~~~~~~~~~~~
cc1: all warnings being treated as errors
make[2]: *** [Makefile:719: libdbustest_la-bustle.lo] Error 1
make[2]: *** Waiting for unfinished jobs....
process.c: In function 'dbus_test_process_class_init':
process.c:74:2: warning: 'g_type_class_add_private' is deprecated [-Wdeprecated-declarations]
   74 |  g_type_class_add_private (klass, sizeof (DbusTestProcessPrivate));
      |  ^~~~~~~~~~~~~~~~~~~~~~~~
In file included from /usr/include/glib-2.0/gobject/gobject.h:24,
                 from /usr/include/glib-2.0/gobject/gbinding.h:29,
                 from /usr/include/glib-2.0/glib-object.h:23,
                 from ../libdbustest/task.h:28,
                 from dbus-test.h:29,
                 from process.c:24:
/usr/include/glib-2.0/gobject/gtype.h:1308:10: note: declared here
 1308 | void     g_type_class_add_private       (gpointer                    g_class,
      |          ^~~~~~~~~~~~~~~~~~~~~~~~
process.c: In function 'dbus_test_process_init':
process.c:115:13: error: G_ADD_PRIVATE [-Werror]
  115 |  self->priv = DBUS_TEST_PROCESS_GET_PRIVATE(self);
      |             ^~~~~~~~~~~~~~~
cc1: all warnings being treated as errors
make[2]: *** [Makefile:733: libdbustest_la-process.lo] Error 1
service.c: In function 'dbus_test_service_class_init':
service.c:90:2: warning: 'g_type_class_add_private' is deprecated [-Wdeprecated-declarations]
   90 |  g_type_class_add_private (klass, sizeof (DbusTestServicePrivate));
      |  ^~~~~~~~~~~~~~~~~~~~~~~~
In file included from /usr/include/glib-2.0/gobject/gobject.h:24,
                 from /usr/include/glib-2.0/gobject/gbinding.h:29,
                 from /usr/include/glib-2.0/glib-object.h:23,
                 from /usr/include/glib-2.0/gio/gioenums.h:28,
                 from /usr/include/glib-2.0/gio/giotypes.h:28,
                 from /usr/include/glib-2.0/gio/gio.h:26,
                 from service.c:28:
/usr/include/glib-2.0/gobject/gtype.h:1308:10: note: declared here
 1308 | void     g_type_class_add_private       (gpointer                    g_class,
      |          ^~~~~~~~~~~~~~~~~~~~~~~~
service.c: In function 'dbus_test_service_init':
service.c:101:13: error: G_ADD_PRIVATE [-Werror]
  101 |  self->priv = DBUS_TEST_SERVICE_GET_PRIVATE(self);
      |             ^~~~~~~~~~~~~~~
cc1: all warnings being treated as errors
make[2]: *** [Makefile:740: libdbustest_la-service.lo] Error 1
make[2]: Leaving directory '/home/pmos/build/src/dbus-test-runner-86d63d119566974bd841cacd3202599b3b1a845d/libdbustest'
make[1]: *** [Makefile:449: all-recursive] Error 1
make[1]: Leaving directory '/home/pmos/build/src/dbus-test-runner-86d63d119566974bd841cacd3202599b3b1a845d'
make: *** [Makefile:380: all] Error 2
>>> ERROR: dbus-test-runner: build failed
]0;(002157) [19:50:25] ^^^^^^^^^^^^^^^^^^^^^^^^^^^^^^^^^^^^^^^^^^^^^^^^^^^^^^^^^^^^^^^^^^^^^^
(002157) [19:50:25] NOTE: The failed command's output is above the ^^^ line in the log file: /home/build/.local/var/pmbootstrap/log.txt
(002157) [19:50:25] ERROR: Command failed: (native) % cd /home/pmos/build; busybox su pmos -c CARCH=x86_64 SUDO_APK='abuild-apk --no-progress' HOME=/home/pmos abuild -D postmarketOS -r
(002157) [19:50:25] See also: <https://postmarketos.org/troubleshooting>
(002157) [19:50:25] Traceback (most recent call last):
  File "/home/build/pmbootstrap/pmb/__init__.py", line 63, in main
    getattr(frontend, args.action)(args)
  File "/home/build/pmbootstrap/pmb/helpers/frontend.py", line 109, in build
    args.strict, src=src):
  File "/home/build/pmbootstrap/pmb/build/_package.py", line 486, in package
    suffix, src)
  File "/home/build/pmbootstrap/pmb/build/_package.py", line 421, in run_abuild
    pmb.chroot.user(args, cmd, suffix, "/home/pmos/build", env=env)
  File "/home/build/pmbootstrap/pmb/chroot/user.py", line 43, in user
    output_return, check, {}, auto_init)
  File "/home/build/pmbootstrap/pmb/chroot/root.py", line 91, in root
    output_return, check, kill_as_root)
  File "/home/build/pmbootstrap/pmb/helpers/run_core.py", line 301, in core
    raise RuntimeError("Command failed: " + log_message)
RuntimeError: Command failed: (native) % cd /home/pmos/build; busybox su pmos -c CARCH=x86_64 SUDO_APK='abuild-apk --no-progress' HOME=/home/pmos abuild -D postmarketOS -r

Run 'pmbootstrap log' for details.
Build complete: failed 13 days ago (took 53 seconds)