#586130 failed

f365dabнаб

Add pathchk

Owner
~nabijaczleweli
Created
a month ago
Updated
a month ago
Build manifest
view manifest »

Tasks

view log »
build view log »
go to bottom »
go to top »
setup
1
2
3
4
5
6
7
8
9
10
11
12
13
14
15
16
17
18
19
20
21
22
23
24
[#586130] 2021/09/12 00:06:41 Booting image openbsd/latest (default) on port 22005
[#586130] 2021/09/12 00:06:42 Waiting for guest to settle
[#586130] 2021/09/12 00:07:01 Sending tasks
[#586130] 2021/09/12 00:07:02 Sending build environment
[#586130] 2021/09/12 00:07:02 Installing packages
Warning: Permanently added '[localhost]:22005' (ED25519) to the list of known hosts.
quirks-3.633 signed on 2021-09-11T15:10:44Z
[#586130] 2021/09/12 00:07:06 Cloning repositories
Cloning into 'voreutils'...
Updating files: 100% (26697/26697), done.
+ cd voreutils
+ git checkout -q f365dabb5a5232053fc5306ab15ca180b33da7ec
+ cd voreutils
+ git submodule update --init
[#586130] 2021/09/12 00:07:13 Running task build
[#586130] 2021/09/12 00:07:25 Build failed.
[#586130] 2021/09/12 00:07:25 The build environment will be kept alive for 10 minutes.
[#586130] 2021/09/12 00:07:25 To log in with SSH and examine it, use the following command:
[#586130] 2021/09/12 00:07:25 
[#586130] 2021/09/12 00:07:25 	ssh -t builds@yui.runners.sr.ht connect 586130
[#586130] 2021/09/12 00:07:25 
[#586130] 2021/09/12 00:07:25 After logging in, the deadline is increased to your remaining build time.
[#586130] 2021/09/12 00:17:25 Deadline elapsed. Terminating build environment.
[#586130] 2021/09/12 00:17:25 Error: Running task on guest: exit status 2
build
1
2
3
4
5
6
7
8
9
10
11
12
13
14
15
16
17
18
19
20
21
22
23
24
25
26
27
28
29
30
31
32
33
34
35
36
37
38
39
40
41
42
43
44
45
46
47
48
49
50
51
52
53
54
55
56
57
58
59
60
61
62
63
64
65
66
67
68
69
70
71
72
73
74
75
76
77
+ cd voreutils
+ gmake CXX=c++
c++ -g -O3 -pipe -Wall -Wextra -fPIC -fno-math-errno -Wpedantic -Wno-c++20-designator -Wno-c99-extensions -Wno-unknown-warning-option -Wno-gnu-conditional-omitted-operand    -I/usr/local/include -Iinclude/ -DVOREUTILS_VERSION='"f365dab"' -DVOREUTILS_DATE='"September 11, 2021"' -DVOREUTILS_SO='".so"' -DVOREUTILS_LIB_PREFIX='"/usr/lib/voreutils/"' -include vore-id.h  -std=c++17 -fno-exceptions -c -o out/obj/cmd/base64.o cmd/base64.cpp
c++ -g -O3 -pipe -Wall -Wextra -fPIC -fno-math-errno -Wpedantic -Wno-c++20-designator -Wno-c99-extensions -Wno-unknown-warning-option -Wno-gnu-conditional-omitted-operand    -I/usr/local/include -fno-exceptions -o out/cmd/base64 out/obj/cmd/base64.o -Wl,--as-needed -Lout/                         -flto=full     -L/usr/local/lib -lb2  -lcrypto
c++ -g -O3 -pipe -Wall -Wextra -fPIC -fno-math-errno -Wpedantic -Wno-c++20-designator -Wno-c99-extensions -Wno-unknown-warning-option -Wno-gnu-conditional-omitted-operand    -I/usr/local/include -Iinclude/ -DVOREUTILS_VERSION='"f365dab"' -DVOREUTILS_DATE='"September 11, 2021"' -DVOREUTILS_SO='".so"' -DVOREUTILS_LIB_PREFIX='"/usr/lib/voreutils/"' -include vore-id.h  -std=c++17 -fno-exceptions -c -o out/obj/cmd/basename.o cmd/basename.cpp
c++ -g -O3 -pipe -Wall -Wextra -fPIC -fno-math-errno -Wpedantic -Wno-c++20-designator -Wno-c99-extensions -Wno-unknown-warning-option -Wno-gnu-conditional-omitted-operand    -I/usr/local/include -fno-exceptions -o out/cmd/basename out/obj/cmd/basename.o -Wl,--as-needed -Lout/                         -flto=full     -L/usr/local/lib -lb2  -lcrypto
c++ -g -O3 -pipe -Wall -Wextra -fPIC -fno-math-errno -Wpedantic -Wno-c++20-designator -Wno-c99-extensions -Wno-unknown-warning-option -Wno-gnu-conditional-omitted-operand    -I/usr/local/include -Iinclude/ -DVOREUTILS_VERSION='"f365dab"' -DVOREUTILS_DATE='"September 11, 2021"' -DVOREUTILS_SO='".so"' -DVOREUTILS_LIB_PREFIX='"/usr/lib/voreutils/"' -include vore-id.h  -std=c++17 -fno-exceptions -c -o out/obj/cmd/cat.o cmd/cat.cpp
c++ -g -O3 -pipe -Wall -Wextra -fPIC -fno-math-errno -Wpedantic -Wno-c++20-designator -Wno-c99-extensions -Wno-unknown-warning-option -Wno-gnu-conditional-omitted-operand    -I/usr/local/include -fno-exceptions -o out/cmd/cat out/obj/cmd/cat.o -Wl,--as-needed -Lout/                         -flto=full     -L/usr/local/lib -lb2  -lcrypto
c++ -g -O3 -pipe -Wall -Wextra -fPIC -fno-math-errno -Wpedantic -Wno-c++20-designator -Wno-c99-extensions -Wno-unknown-warning-option -Wno-gnu-conditional-omitted-operand    -I/usr/local/include -Iinclude/ -DVOREUTILS_VERSION='"f365dab"' -DVOREUTILS_DATE='"September 11, 2021"' -DVOREUTILS_SO='".so"' -DVOREUTILS_LIB_PREFIX='"/usr/lib/voreutils/"' -include vore-id.h  -std=c++17 -fno-exceptions -c -o out/obj/cmd/chroot.o cmd/chroot.cpp
c++ -g -O3 -pipe -Wall -Wextra -fPIC -fno-math-errno -Wpedantic -Wno-c++20-designator -Wno-c99-extensions -Wno-unknown-warning-option -Wno-gnu-conditional-omitted-operand    -I/usr/local/include -fno-exceptions -o out/cmd/chroot out/obj/cmd/chroot.o -Wl,--as-needed -Lout/                         -flto=full     -L/usr/local/lib -lb2  -lcrypto
c++ -g -O3 -pipe -Wall -Wextra -fPIC -fno-math-errno -Wpedantic -Wno-c++20-designator -Wno-c99-extensions -Wno-unknown-warning-option -Wno-gnu-conditional-omitted-operand    -I/usr/local/include -Iinclude/ -DVOREUTILS_VERSION='"f365dab"' -DVOREUTILS_DATE='"September 11, 2021"' -DVOREUTILS_SO='".so"' -DVOREUTILS_LIB_PREFIX='"/usr/lib/voreutils/"' -include vore-id.h  -std=c++17 -fno-exceptions -c -o out/obj/cmd/cksum.o cmd/cksum.cpp
c++ -g -O3 -pipe -Wall -Wextra -fPIC -fno-math-errno -Wpedantic -Wno-c++20-designator -Wno-c99-extensions -Wno-unknown-warning-option -Wno-gnu-conditional-omitted-operand    -I/usr/local/include -fno-exceptions -o out/cmd/cksum out/obj/cmd/cksum.o -Wl,--as-needed -Lout/                         -flto=full     -L/usr/local/lib -lb2  -lcrypto
c++ -g -O3 -pipe -Wall -Wextra -fPIC -fno-math-errno -Wpedantic -Wno-c++20-designator -Wno-c99-extensions -Wno-unknown-warning-option -Wno-gnu-conditional-omitted-operand    -I/usr/local/include -Iinclude/ -DVOREUTILS_VERSION='"f365dab"' -DVOREUTILS_DATE='"September 11, 2021"' -DVOREUTILS_SO='".so"' -DVOREUTILS_LIB_PREFIX='"/usr/lib/voreutils/"' -include vore-id.h  -std=c++17 -fno-exceptions -c -o out/obj/cmd/cut.o cmd/cut.cpp
c++ -g -O3 -pipe -Wall -Wextra -fPIC -fno-math-errno -Wpedantic -Wno-c++20-designator -Wno-c99-extensions -Wno-unknown-warning-option -Wno-gnu-conditional-omitted-operand    -I/usr/local/include -fno-exceptions -o out/cmd/cut out/obj/cmd/cut.o -Wl,--as-needed -Lout/                         -flto=full     -L/usr/local/lib -lb2  -lcrypto
c++ -g -O3 -pipe -Wall -Wextra -fPIC -fno-math-errno -Wpedantic -Wno-c++20-designator -Wno-c99-extensions -Wno-unknown-warning-option -Wno-gnu-conditional-omitted-operand    -I/usr/local/include -Iinclude/ -DVOREUTILS_VERSION='"f365dab"' -DVOREUTILS_DATE='"September 11, 2021"' -DVOREUTILS_SO='".so"' -DVOREUTILS_LIB_PREFIX='"/usr/lib/voreutils/"' -include vore-id.h  -std=c++17 -fno-exceptions -c -o out/obj/cmd/dd.o cmd/dd.cpp
cmd/dd.cpp:527:32: error: no matching function for call to 'min'
                        const auto ichunk         = std::min(obs - static_cast<std::size_t>(buffer_out_cur - buffer_out), static_cast<std::size_t>(end - beg));
                                                    ^~~~~~~~
/usr/include/c++/v1/algorithm:2560:1: note: candidate template ignored: deduced conflicting types for parameter '_Tp' ('unsigned long long' vs. 'unsigned long')
min(const _Tp& __a, const _Tp& __b)
^
/usr/include/c++/v1/algorithm:2571:1: note: candidate template ignored: could not match 'initializer_list<type-parameter-0-0>' against 'unsigned long long'
min(initializer_list<_Tp> __t, _Compare __comp)
^
/usr/include/c++/v1/algorithm:2580:1: note: candidate function template not viable: requires single argument '__t', but 2 arguments were provided
min(initializer_list<_Tp> __t)
^
/usr/include/c++/v1/algorithm:2551:1: note: candidate function template not viable: requires 3 arguments, but 2 were provided
min(const _Tp& __a, const _Tp& __b, _Compare __comp)
^
cmd/dd.cpp:529:45: error: no matching function for call to 'begin'
                        ret                       = commit_write(std::begin(iovs), std::end(iovs));
                                                                 ^~~~~~~~~~
/usr/include/c++/v1/initializer_list:99:1: note: candidate template ignored: could not match 'initializer_list<type-parameter-0-0>' against 'const iovec *'
begin(initializer_list<_Ep> __il) _NOEXCEPT
^
/usr/include/c++/v1/iterator:1753:1: note: candidate template ignored: could not match '_Tp [_Np]' against 'const struct iovec []'
begin(_Tp (&__array)[_Np])
^
/usr/include/c++/v1/iterator:1771:1: note: candidate template ignored: substitution failure [with _Cp = iovec const[]]: member reference base type 'iovec const[]' is not a structure or union
begin(_Cp& __c) -> decltype(__c.begin())
^                              ~
/usr/include/c++/v1/iterator:1779:1: note: candidate template ignored: substitution failure [with _Cp = iovec []]: member reference base type 'iovec const[]' is not a structure or union
begin(const _Cp& __c) -> decltype(__c.begin())
^                                    ~
cmd/dd.cpp:529:63: error: no matching function for call to 'end'
                        ret                       = commit_write(std::begin(iovs), std::end(iovs));
                                                                                   ^~~~~~~~
/usr/include/c++/v1/initializer_list:108:1: note: candidate template ignored: could not match 'initializer_list<type-parameter-0-0>' against 'const iovec *'
end(initializer_list<_Ep> __il) _NOEXCEPT
^
/usr/include/c++/v1/iterator:1761:1: note: candidate template ignored: could not match '_Tp [_Np]' against 'const struct iovec []'
end(_Tp (&__array)[_Np])
^
/usr/include/c++/v1/iterator:1787:1: note: candidate template ignored: substitution failure [with _Cp = iovec const[]]: member reference base type 'iovec const[]' is not a structure or union
end(_Cp& __c) -> decltype(__c.end())
^                            ~
/usr/include/c++/v1/iterator:1795:1: note: candidate template ignored: substitution failure [with _Cp = iovec []]: member reference base type 'iovec const[]' is not a structure or union
end(const _Cp& __c) -> decltype(__c.end())
^                                  ~
cmd/dd.cpp:558:21: error: no matching function for call to object of type '(lambda at cmd/dd.cpp:524:25)'
                auto ret        = append_writebuf(buffer_conv, buffer_conv_cur);
                                  ^~~~~~~~~~~~~~~
cmd/dd.cpp:524:25: note: candidate template ignored: substitution failure [with beg:auto = unsigned char *, end:auto = unsigned char *]
        auto append_writebuf = [&](auto beg, auto end) {
                               ^
cmd/dd.cpp:678:8: error: invalid argument type 'void' to unary expression
                                if(!conv_unblock_commit())
                                   ^~~~~~~~~~~~~~~~~~~~~~
cmd/dd.cpp:684:8: error: no matching function for call to object of type '(lambda at cmd/dd.cpp:524:25)'
                        if(!append_writebuf(buffer_in, buffer_in + rd))
                            ^~~~~~~~~~~~~~~
cmd/dd.cpp:524:25: note: candidate template ignored: substitution failure [with beg:auto = unsigned char *, end:auto = unsigned char *]
        auto append_writebuf = [&](auto beg, auto end) {
                               ^
6 errors generated.
gmake: *** [Makefile:167: out/obj/cmd/dd.o] Error 1
Build complete: failed a month ago (took 43 seconds)