#605735 failed

fe01dd0Elisei Roca

Replace py-bcrypt with bcrypt.

Owner
~mediagoblin
Created
15 days ago
Updated
15 days ago
Build manifest
view manifest »

Tasks

view log »
core view log »
go to bottom »
go to top »
setup
1
2
3
4
5
6
7
8
9
10
11
12
13
14
15
16
17
18
19
20
21
22
23
24
25
26
27
28
29
30
31
32
33
34
35
36
37
38
39
40
41
42
43
44
45
46
47
48
49
50
51
52
53
54
55
56
57
58
59
60
61
62
63
64
65
66
67
68
69
70
71
72
73
74
75
76
77
78
79
80
81
82
83
84
85
86
87
88
89
90
91
92
93
94
95
96
97
98
99
100
101
102
103
104
105
106
107
108
109
110
111
112
113
114
115
116
117
118
119
120
121
122
123
124
125
126
127
128
129
130
131
132
133
134
135
136
137
138
139
140
141
142
143
144
145
146
147
148
149
150
151
152
153
154
155
156
157
158
159
160
161
162
163
164
165
166
167
168
169
170
171
172
173
174
175
176
177
178
179
180
181
182
183
184
185
186
187
188
189
190
191
192
193
194
195
196
197
198
199
200
201
202
203
204
205
206
207
208
209
210
211
212
213
214
215
216
217
218
219
220
221
222
223
224
225
226
227
228
229
230
231
232
233
234
235
236
237
238
239
240
241
242
243
244
245
246
247
248
249
250
251
252
253
254
255
256
257
258
259
260
261
262
263
264
265
266
267
268
269
270
271
272
273
274
275
276
277
278
279
280
281
282
283
284
285
286
287
288
289
290
291
292
293
294
295
296
297
298
299
300
301
302
303
304
305
306
307
308
309
310
311
312
313
314
315
316
317
318
319
320
321
322
323
324
325
326
327
328
329
330
331
332
333
334
335
336
337
338
339
340
341
342
343
344
345
346
347
348
349
350
351
352
353
354
355
356
357
358
359
360
361
362
363
364
365
366
367
368
369
370
371
372
373
374
375
376
377
378
379
380
381
382
383
384
385
386
387
388
389
390
391
392
393
394
395
396
397
398
399
400
401
402
403
404
405
406
407
408
409
410
411
412
413
414
415
416
417
418
419
420
421
422
423
424
425
426
427
428
429
430
431
432
433
434
435
436
437
438
439
440
441
442
443
444
445
446
447
448
449
450
451
452
453
454
455
456
457
458
459
460
461
462
463
464
465
466
467
468
469
470
471
472
473
474
475
476
477
478
479
480
481
482
483
484
485
486
487
488
489
490
491
492
493
494
495
496
497
498
499
500
501
502
503
504
505
506
507
508
509
510
511
512
513
514
515
516
517
518
519
520
521
522
523
524
525
526
527
528
529
530
531
532
533
534
535
536
537
538
539
540
541
542
543
544
545
546
547
548
549
550
551
552
553
554
555
556
557
558
559
560
561
562
563
564
565
566
567
568
569
570
571
572
573
574
575
576
577
578
579
580
581
582
583
584
585
586
587
588
589
590
591
592
593
594
595
596
597
598
599
600
601
602
603
604
605
606
607
608
609
610
611
612
613
614
615
616
617
618
619
620
621
622
623
624
625
626
627
628
629
630
631
632
633
634
635
636
637
638
639
640
641
642
643
644
645
646
647
648
649
650
651
652
653
654
655
656
657
658
659
660
661
662
663
664
665
666
667
668
669
670
671
672
673
674
675
676
677
678
679
680
681
682
683
684
685
686
687
688
689
690
691
692
693
694
695
696
697
698
699
700
701
702
703
704
705
706
707
708
709
710
711
712
713
714
715
716
717
718
719
720
721
722
723
724
725
726
727
728
729
730
731
732
733
734
735
736
737
738
739
740
741
742
743
744
745
746
747
748
749
750
751
752
753
754
755
756
757
758
759
760
761
762
763
764
765
766
767
768
769
770
771
772
773
774
775
776
777
778
779
780
781
782
783
784
785
786
787
788
789
790
791
792
793
794
795
796
797
798
799
800
801
802
803
804
805
806
807
808
809
810
811
812
813
814
815
816
817
818
819
820
821
822
823
824
825
826
827
828
829
830
831
832
833
834
835
836
837
838
839
840
841
842
843
844
845
846
847
848
849
850
851
852
853
854
855
856
857
858
859
860
861
862
863
864
865
866
867
868
869
870
871
872
873
874
875
876
877
878
879
880
881
882
883
884
885
886
887
888
889
890
891
892
893
894
895
896
897
898
899
900
901
902
903
904
905
906
907
908
909
910
911
912
913
914
915
916
917
918
919
920
921
922
923
924
925
926
927
928
929
930
931
932
933
934
935
936
937
938
939
940
941
942
943
944
945
946
947
948
949
950
951
952
953
954
955
956
957
958
959
960
961
962
963
964
965
966
967
968
969
970
971
972
973
974
975
976
977
978
979
980
981
982
983
984
985
986
987
988
989
990
991
992
993
994
995
996
997
998
999
1000
[#605735] 2021/10/11 10:58:20 Booting image fedora/33 (default) on port 22103
[#605735] 2021/10/11 10:58:24 Waiting for guest to settle
[#605735] 2021/10/11 10:58:44 Sending tasks
[#605735] 2021/10/11 10:58:44 Sending build environment
[#605735] 2021/10/11 10:58:44 Installing packages
Warning: Permanently added '[localhost]:22103' (ED25519) to the list of known hosts.
Fedora 33 - x86_64                               69 kB/s |  13 kB     00:00    
Fedora 33 openh264 (From Cisco) - x86_64        797  B/s | 990  B     00:01    
Fedora 33 - x86_64 - Updates                     72 kB/s |  11 kB     00:00    
Fedora 33 - x86_64 - Updates                    359 kB/s | 3.7 MB     00:10    
Dependencies resolved.
========================================================================================================
 Package                                 Arch    Version                    Repository              Size
========================================================================================================
Installing:
 automake                                noarch  1.16.2-4.fc33              updates                662 k
 gstreamer1-plugin-openh264              x86_64  1.16.2-2.fc33              fedora-cisco-openh264   24 k
 gstreamer1-plugins-bad-free             x86_64  1.18.2-3.fc33              updates                2.6 M
 gstreamer1-plugins-base                 x86_64  1.18.2-1.fc33              updates                2.1 M
 gstreamer1-plugins-good                 x86_64  1.18.2-1.fc33              updates                2.1 M
 gstreamer1-plugins-ugly-free            x86_64  1.18.2-1.fc33              updates                103 k
 libffi-devel                            x86_64  3.1-26.fc33                fedora                  23 k
 nodejs                                  x86_64  1:14.18.0-1.fc33           updates                 97 k
 npm                                     x86_64  1:6.14.15-1.14.18.0.1.fc33 updates                3.3 M
 python3-devel                           x86_64  3.9.7-1.fc33               updates                206 k
 python3-gobject                         x86_64  3.38.0-2.fc33              fedora                  17 k
 python3-gstreamer1                      x86_64  1.18.2-1.fc33              updates                132 k
 python3-ldap                            x86_64  3.3.1-2.fc33               updates                219 k
 python3-lxml                            x86_64  4.5.1-4.fc33               updates                1.2 M
 python3-numpy                           x86_64  1:1.19.4-1.fc33            updates                4.4 M
 python3-openid                          noarch  3.1.0-10.fc33              fedora                 201 k
 python3-pillow                          x86_64  7.2.0-8.fc33               updates                670 k
 python3-pytest                          noarch  6.0.2-1.fc33               fedora                 1.5 M
 python3-pytest-xdist                    noarch  1.34.0-1.fc33              fedora                  70 k
 python3-snowballstemmer                 noarch  1.9.0-7.fc33               fedora                 149 k
 python3-sphinx                          noarch  1:3.2.1-1.fc33             fedora                 2.0 M
 python3-virtualenv                      noarch  20.0.30-1.fc33             fedora                 221 k
 python3-webtest                         noarch  3.0.0-1.fc33               updates                 80 k
Installing dependencies:
 ImageMagick-libs                        x86_64  1:6.9.11.27-1.fc33         fedora                 2.3 M
 LibRaw                                  x86_64  0.20.2-1.fc33              updates                381 k
 OpenEXR-libs                            x86_64  2.3.0-6.fc33               fedora                 807 k
 alsa-lib                                x86_64  1.2.4-5.fc33               updates                475 k
 autoconf                                noarch  2.69-34.fc33               fedora                 666 k
 cdparanoia-libs                         x86_64  10.2-37.fc33               updates                 54 k
 fdk-aac-free                            x86_64  2.0.0-5.fc33               fedora                 329 k
 fftw-libs-double                        x86_64  3.3.8-9.fc33               updates                940 k
 flac-libs                               x86_64  1.3.3-4.fc33               updates                223 k
 flexiblas                               x86_64  3.0.4-1.fc33               updates                 31 k
 flexiblas-netlib                        x86_64  3.0.4-1.fc33               updates                3.0 M
 flexiblas-openblas-openmp               x86_64  3.0.4-1.fc33               updates                 17 k
 glib-networking                         x86_64  2.66.0-1.fc33              fedora                 161 k
 gobject-introspection                   x86_64  1.66.1-1.fc33              fedora                 233 k
 graphene                                x86_64  1.10.6-1.fc33              updates                 65 k
 gsettings-desktop-schemas               x86_64  3.38.0-1.fc33              fedora                 681 k
 gsm                                     x86_64  1.0.19-3.fc33              fedora                  33 k
 gssdp                                   x86_64  1.2.3-2.fc33               fedora                  57 k
 gstreamer1                              x86_64  1.18.2-1.fc33              updates                1.4 M
 gupnp                                   x86_64  1.2.3-2.fc33               fedora                 104 k
 gupnp-igd                               x86_64  1.2.0-1.fc33               fedora                  34 k
 ilmbase                                 x86_64  2.3.0-5.fc33               fedora                 134 k
 iso-codes                               noarch  4.5.0-2.fc33               fedora                 3.4 M
 jasper-libs                             x86_64  2.0.33-1.fc33              updates                151 k
 ladspa                                  x86_64  1.13-25.fc33               fedora                  48 k
 lame-libs                               x86_64  3.100-9.fc33               fedora                 335 k
 libX11-xcb                              x86_64  1.7.2-3.fc33               updates                 11 k
 libXtst                                 x86_64  1.2.3-12.fc33              fedora                  20 k
 libXv                                   x86_64  1.0.11-12.fc33             fedora                  18 k
 libXxf86vm                              x86_64  1.1.4-14.fc33              fedora                  17 k
 liba52                                  x86_64  0.7.4-39.fc33              fedora                  37 k
 libaom                                  x86_64  2.0.1-3.fc33               updates                1.6 M
 libasyncns                              x86_64  0.8-19.fc33                fedora                  30 k
 libavc1394                              x86_64  0.5.4-14.fc33              fedora                  56 k
 libcdio                                 x86_64  2.1.0-3.fc33               fedora                 245 k
 libdrm                                  x86_64  2.4.102-2.fc33             fedora                 160 k
 libdv                                   x86_64  1.0.0-32.fc33              fedora                  82 k
 libdvdnav                               x86_64  6.0.1-4.fc33               fedora                  54 k
 libdvdread                              x86_64  6.0.2-4.fc33               fedora                  70 k
 libgfortran                             x86_64  10.3.1-1.fc33              updates                831 k
 libglvnd                                x86_64  1:1.3.3-1.fc33             updates                140 k
 libglvnd-egl                            x86_64  1:1.3.3-1.fc33             updates                 37 k
 libglvnd-glx                            x86_64  1:1.3.3-1.fc33             updates                154 k
 libgudev                                x86_64  234-1.fc33                 fedora                  35 k
 libicu                                  x86_64  67.1-4.fc33                fedora                 9.7 M
 libiec61883                             x86_64  1.2.0-24.fc33              fedora                  40 k
 liblqr-1                                x86_64  0.4.2-15.fc33              fedora                  49 k
 liblrdf                                 x86_64  0.5.0-20.fc33              fedora                  29 k
 libmicrodns                             x86_64  0.1.2-2.fc33               fedora                  31 k
 libmodman                               x86_64  2.0.1-23.fc33              fedora                  33 k
 libmpeg2                                x86_64  0.5.1-21.fc33              fedora                  75 k
 libnice                                 x86_64  0.1.17-3.fc33              fedora                 196 k
 libogg                                  x86_64  2:1.3.4-3.fc33             fedora                  33 k
 libopenmpt                              x86_64  0.4.23-1.fc33              updates                548 k
 libpciaccess                            x86_64  0.16-3.fc33                fedora                  26 k
 libproxy                                x86_64  0.4.15-25.fc33             fedora                  65 k
 libquadmath                             x86_64  10.3.1-1.fc33              updates                211 k
 libraw1394                              x86_64  2.1.2-12.fc33              fedora                  65 k
 libshout                                x86_64  2.4.3-2.fc33               fedora                  68 k
 libsndfile                              x86_64  1.0.31-5.fc33.fc33         updates                208 k
 libsoup                                 x86_64  2.72.0-3.fc33              fedora                 398 k
 libsrtp                                 x86_64  2.3.0-3.fc33               fedora                  58 k
 libtheora                               x86_64  1:1.1.1-28.fc33            fedora                 162 k
 libunwind                               x86_64  1.4.0-4.fc33               fedora                  65 k
 libuv                                   x86_64  1:1.42.0-2.fc33            updates                148 k
 libv4l                                  x86_64  1.20.0-1.fc33              fedora                 199 k
 libvisual                               x86_64  1:0.4.0-29.fc33            fedora                 147 k
 libvmaf                                 x86_64  1.5.1-5.fc33               fedora                 350 k
 libvorbis                               x86_64  1:1.3.7-2.fc33             fedora                 199 k
 libvpx                                  x86_64  1.9.0-1.fc33               fedora                 1.1 M
 libwayland-client                       x86_64  1.18.0-2.fc33              fedora                  32 k
 libwayland-cursor                       x86_64  1.18.0-2.fc33              fedora                  19 k
 libwayland-egl                          x86_64  1.18.0-2.fc33              fedora                  12 k
 libwayland-server                       x86_64  1.18.0-2.fc33              fedora                  41 k
 libwmf-lite                             x86_64  0.2.12-4.fc33              fedora                  73 k
 libxshmfence                            x86_64  1.3-7.fc33                 fedora                  11 k
 libxslt                                 x86_64  1.1.34-4.fc33              fedora                 243 k
 lilv                                    x86_64  0.24.10-1.fc33             fedora                  81 k
 lv2                                     x86_64  1.18.0-1.fc33              fedora                  94 k
 m4                                      x86_64  1.4.18-15.fc33             fedora                 211 k
 mesa-libEGL                             x86_64  20.3.5-2.fc33              updates                121 k
 mesa-libGL                              x86_64  20.3.5-2.fc33              updates                181 k
 mesa-libgbm                             x86_64  20.3.5-2.fc33              updates                 41 k
 mesa-libglapi                           x86_64  20.3.5-2.fc33              updates                 58 k
 mesa-vulkan-drivers                     x86_64  20.3.5-2.fc33              updates                4.2 M
 mpg123-libs                             x86_64  1.26.2-2.fc33              fedora                 313 k
 nodejs-libs                             x86_64  1:14.18.0-1.fc33           updates                 13 M
 openblas                                x86_64  0.3.17-1.fc33              updates                 33 k
 openblas-openmp                         x86_64  0.3.17-1.fc33              updates                4.5 M
 openh264                                x86_64  2.1.1-1.fc33               fedora-cisco-openh264  428 k
 openssl                                 x86_64  1:1.1.1l-2.fc33            updates                657 k
 opus                                    x86_64  1.3.1-6.fc33               fedora                 216 k
 orc                                     x86_64  0.4.31-3.fc33              fedora                 185 k
 perl-File-Compare                       noarch  1.100.600-471.fc33         updates                 23 k
 perl-File-Copy                          noarch  2.34-471.fc33              updates                 30 k
 perl-Thread-Queue                       noarch  3.14-457.fc33              fedora                  21 k
 perl-threads                            x86_64  1:2.25-457.fc33            fedora                  58 k
 perl-threads-shared                     x86_64  1.61-457.fc33              fedora                  44 k
 pugixml                                 x86_64  1.11.4-1.fc33              updates                101 k
 pulseaudio-libs                         x86_64  14.0-2.fc33                updates                691 k
 python-wheel-wheel                      noarch  1:0.34.2-1.fc33            fedora                  33 k
 python3-apipkg                          noarch  1.5-11.fc33                fedora                  19 k
 python3-appdirs                         noarch  1.4.4-1.fc33               updates                 22 k
 python3-attrs                           noarch  19.3.0-5.fc33              fedora                  66 k
 python3-babel                           noarch  2.8.1-2.fc33               updates                5.7 M
 python3-beautifulsoup4                  noarch  4.9.3-1.fc33               updates                203 k
 python3-cairo                           x86_64  1.18.2-6.fc33              fedora                  95 k
 python3-chardet                         noarch  3.0.4-18.fc33              fedora                 194 k
 python3-defusedxml                      noarch  0.7.0~rc2-1.fc33           updates                 51 k
 python3-distlib                         noarch  0.3.1-2.fc33               fedora                 187 k
 python3-docutils                        noarch  0.16-3.fc33                fedora                 1.5 M
 python3-execnet                         noarch  1.7.1-4.fc33               fedora                 335 k
 python3-filelock                        noarch  3.0.12-8.fc33              fedora                  22 k
 python3-gobject-base                    x86_64  3.38.0-2.fc33              fedora                 319 k
 python3-idna                            noarch  2.10-2.fc33                fedora                  99 k
 python3-imagesize                       noarch  1.2.0-2.fc33               fedora                  17 k
 python3-iniconfig                       noarch  1.0.0-2.fc33               fedora                  15 k
 python3-jinja2                          noarch  2.11.3-1.fc33              updates                492 k
 python3-markupsafe                      x86_64  1.1.1-7.fc33               fedora                  32 k
 python3-more-itertools                  noarch  8.4.0-1.fc33               fedora                  62 k
 python3-olefile                         noarch  0.46-12.fc33               fedora                  56 k
 python3-packaging                       noarch  20.4-2.fc33                fedora                  67 k
 python3-pluggy                          noarch  0.13.1-2.fc33              fedora                  38 k
 python3-py                              noarch  1.10.0-1.fc33              updates                434 k
 python3-pyasn1                          noarch  0.4.8-3.fc33               fedora                 133 k
 python3-pyasn1-modules                  noarch  0.4.8-3.fc33               fedora                 211 k
 python3-pygments                        noarch  2.6.1-6.fc33               updates                1.8 M
 python3-pyparsing                       noarch  2.4.7-4.fc33               fedora                 149 k
 python3-pysocks                         noarch  1.7.1-7.fc33               fedora                  35 k
 python3-pytest-forked                   noarch  1.3.0-1.fc33               fedora                  17 k
 python3-pytz                            noarch  2020.5-1.fc33              updates                 49 k
 python3-requests                        noarch  2.24.0-3.fc33              fedora                 113 k
 python3-setuptools                      noarch  49.1.3-2.fc33              updates                842 k
 python3-six                             noarch  1.15.0-2.fc33              fedora                  36 k
 python3-soupsieve                       noarch  2.0.1-2.fc33               fedora                  64 k
 python3-sphinx-theme-alabaster          noarch  0.7.12-10.fc33             fedora                  24 k
 python3-sphinxcontrib-applehelp         noarch  1.0.2-2.fc33               fedora                  34 k
 python3-sphinxcontrib-devhelp           noarch  1.0.2-2.fc33               fedora                  29 k
 python3-sphinxcontrib-htmlhelp          noarch  1.0.3-2.fc33               fedora                  37 k
 python3-sphinxcontrib-jsmath            noarch  1.0.1-9.fc33               fedora                  16 k
 python3-sphinxcontrib-qthelp            noarch  1.0.3-2.fc33               fedora                  33 k
 python3-sphinxcontrib-serializinghtml   noarch  1.1.4-2.fc33               fedora                  32 k
 python3-toml                            noarch  0.10.2-1.fc33              updates                 39 k
 python3-urllib3                         noarch  1.25.8-5.fc33              updates                171 k
 python3-waitress                        noarch  1.4.3-3.fc33               fedora                 243 k
 python3-webob                           noarch  1.8.6-3.fc33               fedora                 230 k
 raptor2                                 x86_64  2.0.15-27.fc33             updates                214 k
 serd                                    x86_64  0.30.6-1.fc33              fedora                  61 k
 sord                                    x86_64  0.16.6-1.fc33              fedora                  44 k
 soundtouch                              x86_64  2.1.2-1.fc33               updates                 74 k
 speex                                   x86_64  1.2.0-6.fc33               fedora                  68 k
 sratom                                  x86_64  0.6.6-1.fc33               fedora                  25 k
 srt-libs                                x86_64  1.4.1-5.fc33               fedora                 248 k
 taglib                                  x86_64  1.12-4.fc33                updates                356 k
 twolame-libs                            x86_64  0.3.13-16.fc33             fedora                  59 k
 vulkan-loader                           x86_64  1.2.148.1-1.fc33           updates                124 k
 wavpack                                 x86_64  5.4.0-1.fc33               updates                215 k
 webrtc-audio-processing                 x86_64  0.3.1-5.fc33               fedora                 313 k
 yajl                                    x86_64  2.1.0-15.fc33              fedora                  37 k
Installing weak dependencies:
 ImageMagick                             x86_64  1:6.9.11.27-1.fc33         fedora                 162 k
 abattis-cantarell-fonts                 noarch  0.301-1.fc33               updates                369 k
 adobe-source-code-pro-fonts             noarch  2.030.1.050-9.fc33         fedora                 834 k
 nodejs-docs                             noarch  1:14.18.0-1.fc33           updates                6.2 M
 nodejs-full-i18n                        x86_64  1:14.18.0-1.fc33           updates                7.8 M

Transaction Summary
========================================================================================================
Install  187 Packages

Total download size: 112 M
Installed size: 488 M
Downloading Packages:
(1/187): OpenEXR-libs-2.3.0-6.fc33.x86_64.rpm   428 kB/s | 807 kB     00:01    
(2/187): ImageMagick-6.9.11.27-1.fc33.x86_64.rp  84 kB/s | 162 kB     00:01    
(3/187): adobe-source-code-pro-fonts-2.030.1.05 1.8 MB/s | 834 kB     00:00    
(4/187): autoconf-2.69-34.fc33.noarch.rpm       1.4 MB/s | 666 kB     00:00    
(5/187): glib-networking-2.66.0-1.fc33.x86_64.r 1.2 MB/s | 161 kB     00:00    
(6/187): fdk-aac-free-2.0.0-5.fc33.x86_64.rpm   1.1 MB/s | 329 kB     00:00    
(7/187): gobject-introspection-1.66.1-1.fc33.x8 1.4 MB/s | 233 kB     00:00    
(8/187): gsm-1.0.19-3.fc33.x86_64.rpm           1.1 MB/s |  33 kB     00:00    
(9/187): gssdp-1.2.3-2.fc33.x86_64.rpm          1.3 MB/s |  57 kB     00:00    
(10/187): gupnp-1.2.3-2.fc33.x86_64.rpm         1.5 MB/s | 104 kB     00:00    
(11/187): gupnp-igd-1.2.0-1.fc33.x86_64.rpm     1.0 MB/s |  34 kB     00:00    
(12/187): ilmbase-2.3.0-5.fc33.x86_64.rpm       1.6 MB/s | 134 kB     00:00    
(13/187): gsettings-desktop-schemas-3.38.0-1.fc 1.2 MB/s | 681 kB     00:00    
(14/187): ladspa-1.13-25.fc33.x86_64.rpm        857 kB/s |  48 kB     00:00    
(15/187): lame-libs-3.100-9.fc33.x86_64.rpm     1.2 MB/s | 335 kB     00:00    
(16/187): libXtst-1.2.3-12.fc33.x86_64.rpm      751 kB/s |  20 kB     00:00    
(17/187): libXv-1.0.11-12.fc33.x86_64.rpm       607 kB/s |  18 kB     00:00    
(18/187): ImageMagick-libs-6.9.11.27-1.fc33.x86 650 kB/s | 2.3 MB     00:03    
(19/187): libXxf86vm-1.1.4-14.fc33.x86_64.rpm   455 kB/s |  17 kB     00:00    
(20/187): libasyncns-0.8-19.fc33.x86_64.rpm     910 kB/s |  30 kB     00:00    
(21/187): liba52-0.7.4-39.fc33.x86_64.rpm       796 kB/s |  37 kB     00:00    
(22/187): libavc1394-0.5.4-14.fc33.x86_64.rpm   1.3 MB/s |  56 kB     00:00    
(23/187): libcdio-2.1.0-3.fc33.x86_64.rpm       1.4 MB/s | 245 kB     00:00    
(24/187): libdrm-2.4.102-2.fc33.x86_64.rpm      1.0 MB/s | 160 kB     00:00    
(25/187): libdv-1.0.0-32.fc33.x86_64.rpm        1.5 MB/s |  82 kB     00:00    
(26/187): libdvdnav-6.0.1-4.fc33.x86_64.rpm     754 kB/s |  54 kB     00:00    
(27/187): libdvdread-6.0.2-4.fc33.x86_64.rpm    1.2 MB/s |  70 kB     00:00    
(28/187): libffi-devel-3.1-26.fc33.x86_64.rpm   770 kB/s |  23 kB     00:00    
(29/187): libgudev-234-1.fc33.x86_64.rpm        1.1 MB/s |  35 kB     00:00    
(30/187): libiec61883-1.2.0-24.fc33.x86_64.rpm  1.2 MB/s |  40 kB     00:00    
(31/187): liblqr-1-0.4.2-15.fc33.x86_64.rpm     1.3 MB/s |  49 kB     00:00    
(32/187): liblrdf-0.5.0-20.fc33.x86_64.rpm      371 kB/s |  29 kB     00:00    
(33/187): libmicrodns-0.1.2-2.fc33.x86_64.rpm   635 kB/s |  31 kB     00:00    
(34/187): libmodman-2.0.1-23.fc33.x86_64.rpm    541 kB/s |  33 kB     00:00    
(35/187): libmpeg2-0.5.1-21.fc33.x86_64.rpm     260 kB/s |  75 kB     00:00    
(36/187): libnice-0.1.17-3.fc33.x86_64.rpm      320 kB/s | 196 kB     00:00    
(37/187): libogg-1.3.4-3.fc33.x86_64.rpm        564 kB/s |  33 kB     00:00    
(38/187): libpciaccess-0.16-3.fc33.x86_64.rpm   588 kB/s |  26 kB     00:00    
(39/187): libproxy-0.4.15-25.fc33.x86_64.rpm    490 kB/s |  65 kB     00:00    
(40/187): libraw1394-2.1.2-12.fc33.x86_64.rpm   531 kB/s |  65 kB     00:00    
(41/187): libshout-2.4.3-2.fc33.x86_64.rpm      808 kB/s |  68 kB     00:00    
(42/187): iso-codes-4.5.0-2.fc33.noarch.rpm     1.1 MB/s | 3.4 MB     00:02    
(43/187): libsoup-2.72.0-3.fc33.x86_64.rpm      1.2 MB/s | 398 kB     00:00    
(44/187): libsrtp-2.3.0-3.fc33.x86_64.rpm       1.2 MB/s |  58 kB     00:00    
(45/187): libunwind-1.4.0-4.fc33.x86_64.rpm     1.0 MB/s |  65 kB     00:00    
(46/187): libtheora-1.1.1-28.fc33.x86_64.rpm    1.1 MB/s | 162 kB     00:00    
(47/187): libv4l-1.20.0-1.fc33.x86_64.rpm       1.5 MB/s | 199 kB     00:00    
(48/187): libvisual-0.4.0-29.fc33.x86_64.rpm    640 kB/s | 147 kB     00:00    
(49/187): libvmaf-1.5.1-5.fc33.x86_64.rpm       1.4 MB/s | 350 kB     00:00    
(50/187): libvorbis-1.3.7-2.fc33.x86_64.rpm     466 kB/s | 199 kB     00:00    
(51/187): libwayland-client-1.18.0-2.fc33.x86_6 366 kB/s |  32 kB     00:00    
(52/187): libwayland-cursor-1.18.0-2.fc33.x86_6 283 kB/s |  19 kB     00:00    
(53/187): libwayland-egl-1.18.0-2.fc33.x86_64.r 398 kB/s |  12 kB     00:00    
(54/187): libwayland-server-1.18.0-2.fc33.x86_6 494 kB/s |  41 kB     00:00    
(55/187): libwmf-lite-0.2.12-4.fc33.x86_64.rpm  709 kB/s |  73 kB     00:00    
(56/187): libxshmfence-1.3-7.fc33.x86_64.rpm    696 kB/s |  11 kB     00:00    
(57/187): libxslt-1.1.34-4.fc33.x86_64.rpm      924 kB/s | 243 kB     00:00    
(58/187): lilv-0.24.10-1.fc33.x86_64.rpm        1.9 MB/s |  81 kB     00:00    
(59/187): lv2-1.18.0-1.fc33.x86_64.rpm          1.2 MB/s |  94 kB     00:00    
(60/187): libvpx-1.9.0-1.fc33.x86_64.rpm        977 kB/s | 1.1 MB     00:01    
(61/187): m4-1.4.18-15.fc33.x86_64.rpm          690 kB/s | 211 kB     00:00    
(62/187): mpg123-libs-1.26.2-2.fc33.x86_64.rpm  799 kB/s | 313 kB     00:00    
(63/187): orc-0.4.31-3.fc33.x86_64.rpm          748 kB/s | 185 kB     00:00    
(64/187): opus-1.3.1-6.fc33.x86_64.rpm          595 kB/s | 216 kB     00:00    
(65/187): perl-Thread-Queue-3.14-457.fc33.noarc 643 kB/s |  21 kB     00:00    
(66/187): perl-threads-shared-1.61-457.fc33.x86 755 kB/s |  44 kB     00:00    
(67/187): perl-threads-2.25-457.fc33.x86_64.rpm 721 kB/s |  58 kB     00:00    
(68/187): python-wheel-wheel-0.34.2-1.fc33.noar 1.0 MB/s |  33 kB     00:00    
(69/187): python3-apipkg-1.5-11.fc33.noarch.rpm 581 kB/s |  19 kB     00:00    
(70/187): python3-attrs-19.3.0-5.fc33.noarch.rp 515 kB/s |  66 kB     00:00    
(71/187): python3-cairo-1.18.2-6.fc33.x86_64.rp 451 kB/s |  95 kB     00:00    
(72/187): python3-chardet-3.0.4-18.fc33.noarch. 906 kB/s | 194 kB     00:00    
(73/187): python3-distlib-0.3.1-2.fc33.noarch.r 453 kB/s | 187 kB     00:00    
(74/187): python3-execnet-1.7.1-4.fc33.noarch.r 454 kB/s | 335 kB     00:00    
(75/187): python3-filelock-3.0.12-8.fc33.noarch 519 kB/s |  22 kB     00:00    
(76/187): python3-gobject-3.38.0-2.fc33.x86_64. 539 kB/s |  17 kB     00:00    
(77/187): python3-gobject-base-3.38.0-2.fc33.x8 350 kB/s | 319 kB     00:00    
(78/187): python3-idna-2.10-2.fc33.noarch.rpm   141 kB/s |  99 kB     00:00    
(79/187): python3-imagesize-1.2.0-2.fc33.noarch 239 kB/s |  17 kB     00:00    
(80/187): python3-iniconfig-1.0.0-2.fc33.noarch 292 kB/s |  15 kB     00:00    
(81/187): python3-markupsafe-1.1.1-7.fc33.x86_6 569 kB/s |  32 kB     00:00    
(82/187): python3-more-itertools-8.4.0-1.fc33.n 407 kB/s |  62 kB     00:00    
(83/187): python3-olefile-0.46-12.fc33.noarch.r 211 kB/s |  56 kB     00:00    
(84/187): python3-docutils-0.16-3.fc33.noarch.r 423 kB/s | 1.5 MB     00:03    
(85/187): python3-openid-3.1.0-10.fc33.noarch.r 718 kB/s | 201 kB     00:00    
(86/187): python3-packaging-20.4-2.fc33.noarch. 1.1 MB/s |  67 kB     00:00    
(87/187): python3-pluggy-0.13.1-2.fc33.noarch.r 530 kB/s |  38 kB     00:00    
(88/187): python3-pyasn1-modules-0.4.8-3.fc33.n 1.0 MB/s | 211 kB     00:00    
(89/187): python3-pyparsing-2.4.7-4.fc33.noarch 1.1 MB/s | 149 kB     00:00    
(90/187): python3-pyasn1-0.4.8-3.fc33.noarch.rp 334 kB/s | 133 kB     00:00    
(91/187): python3-pysocks-1.7.1-7.fc33.noarch.r 792 kB/s |  35 kB     00:00    
(92/187): python3-pytest-forked-1.3.0-1.fc33.no 554 kB/s |  17 kB     00:00    
(93/187): python3-pytest-xdist-1.34.0-1.fc33.no 840 kB/s |  70 kB     00:00    
(94/187): python3-requests-2.24.0-3.fc33.noarch 687 kB/s | 113 kB     00:00    
(95/187): python3-six-1.15.0-2.fc33.noarch.rpm  746 kB/s |  36 kB     00:00    
(96/187): python3-snowballstemmer-1.9.0-7.fc33. 1.1 MB/s | 149 kB     00:00    
(97/187): python3-soupsieve-2.0.1-2.fc33.noarch 997 kB/s |  64 kB     00:00    
(98/187): python3-pytest-6.0.2-1.fc33.noarch.rp 1.4 MB/s | 1.5 MB     00:01    
(99/187): python3-sphinx-theme-alabaster-0.7.12 635 kB/s |  24 kB     00:00    
(100/187): python3-sphinxcontrib-applehelp-1.0. 852 kB/s |  34 kB     00:00    
(101/187): python3-sphinxcontrib-devhelp-1.0.2- 111 kB/s |  29 kB     00:00    
(102/187): python3-sphinxcontrib-htmlhelp-1.0.3 1.0 MB/s |  37 kB     00:00    
(103/187): python3-sphinxcontrib-jsmath-1.0.1-9 847 kB/s |  16 kB     00:00    
(104/187): python3-sphinxcontrib-qthelp-1.0.3-2 703 kB/s |  33 kB     00:00    
(105/187): python3-sphinxcontrib-serializinghtm 736 kB/s |  32 kB     00:00    
(106/187): python3-virtualenv-20.0.30-1.fc33.no 1.2 MB/s | 221 kB     00:00    
(107/187): python3-sphinx-3.2.1-1.fc33.noarch.r 1.5 MB/s | 2.0 MB     00:01    
(108/187): python3-waitress-1.4.3-3.fc33.noarch 1.3 MB/s | 243 kB     00:00    
(109/187): serd-0.30.6-1.fc33.x86_64.rpm        1.3 MB/s |  61 kB     00:00    
(110/187): sord-0.16.6-1.fc33.x86_64.rpm        1.2 MB/s |  44 kB     00:00    
(111/187): speex-1.2.0-6.fc33.x86_64.rpm        1.5 MB/s |  68 kB     00:00    
(112/187): sratom-0.6.6-1.fc33.x86_64.rpm       1.2 MB/s |  25 kB     00:00    
(113/187): python3-webob-1.8.6-3.fc33.noarch.rp 1.0 MB/s | 230 kB     00:00    
(114/187): twolame-libs-0.3.13-16.fc33.x86_64.r 905 kB/s |  59 kB     00:00    
(115/187): libicu-67.1-4.fc33.x86_64.rpm        908 kB/s | 9.7 MB     00:10    
(116/187): srt-libs-1.4.1-5.fc33.x86_64.rpm     1.4 MB/s | 248 kB     00:00    
(117/187): yajl-2.1.0-15.fc33.x86_64.rpm        812 kB/s |  37 kB     00:00    
(118/187): webrtc-audio-processing-0.3.1-5.fc33 1.0 MB/s | 313 kB     00:00    
(119/187): openh264-2.1.1-1.fc33.x86_64.rpm     1.3 MB/s | 428 kB     00:00    
(120/187): gstreamer1-plugin-openh264-1.16.2-2.  50 kB/s |  24 kB     00:00    
(121/187): abattis-cantarell-fonts-0.301-1.fc33 368 kB/s | 369 kB     00:01    
(122/187): alsa-lib-1.2.4-5.fc33.x86_64.rpm     356 kB/s | 475 kB     00:01    
(123/187): LibRaw-0.20.2-1.fc33.x86_64.rpm      216 kB/s | 381 kB     00:01    
(124/187): cdparanoia-libs-10.2-37.fc33.x86_64. 257 kB/s |  54 kB     00:00    
(125/187): automake-1.16.2-4.fc33.noarch.rpm    597 kB/s | 662 kB     00:01    
(126/187): flac-libs-1.3.3-4.fc33.x86_64.rpm    417 kB/s | 223 kB     00:00    
(127/187): flexiblas-3.0.4-1.fc33.x86_64.rpm    231 kB/s |  31 kB     00:00    
(128/187): flexiblas-openblas-openmp-3.0.4-1.fc 183 kB/s |  17 kB     00:00    
(129/187): graphene-1.10.6-1.fc33.x86_64.rpm    236 kB/s |  65 kB     00:00    
(130/187): fftw-libs-double-3.3.8-9.fc33.x86_64 201 kB/s | 940 kB     00:04    
(131/187): gstreamer1-1.18.2-1.fc33.x86_64.rpm  337 kB/s | 1.4 MB     00:04    
(132/187): gstreamer1-plugins-bad-free-1.18.2-3 241 kB/s | 2.6 MB     00:11    
(133/187): gstreamer1-plugins-base-1.18.2-1.fc3 173 kB/s | 2.1 MB     00:12    
(134/187): flexiblas-netlib-3.0.4-1.fc33.x86_64 174 kB/s | 3.0 MB     00:17    
(135/187): gstreamer1-plugins-ugly-free-1.18.2-  98 kB/s | 103 kB     00:01    
(136/187): libX11-xcb-1.7.2-3.fc33.x86_64.rpm    60 kB/s |  11 kB     00:00    
(137/187): jasper-libs-2.0.33-1.fc33.x86_64.rpm 157 kB/s | 151 kB     00:00    
(138/187): libgfortran-10.3.1-1.fc33.x86_64.rpm 144 kB/s | 831 kB     00:05    
(139/187): libglvnd-1.3.3-1.fc33.x86_64.rpm     275 kB/s | 140 kB     00:00    
(140/187): libglvnd-egl-1.3.3-1.fc33.x86_64.rpm 104 kB/s |  37 kB     00:00    
(141/187): libglvnd-glx-1.3.3-1.fc33.x86_64.rpm 276 kB/s | 154 kB     00:00    
(142/187): gstreamer1-plugins-good-1.18.2-1.fc3 182 kB/s | 2.1 MB     00:11    
(143/187): libaom-2.0.1-3.fc33.x86_64.rpm       166 kB/s | 1.6 MB     00:09    
(144/187): libquadmath-10.3.1-1.fc33.x86_64.rpm 152 kB/s | 211 kB     00:01    
(145/187): libopenmpt-0.4.23-1.fc33.x86_64.rpm  210 kB/s | 548 kB     00:02    
(146/187): libsndfile-1.0.31-5.fc33.fc33.x86_64 113 kB/s | 208 kB     00:01    
(147/187): mesa-libEGL-20.3.5-2.fc33.x86_64.rpm 101 kB/s | 121 kB     00:01    
(148/187): libuv-1.42.0-2.fc33.x86_64.rpm       100 kB/s | 148 kB     00:01    
(149/187): mesa-libgbm-20.3.5-2.fc33.x86_64.rpm 104 kB/s |  41 kB     00:00    
(150/187): mesa-libglapi-20.3.5-2.fc33.x86_64.r  63 kB/s |  58 kB     00:00    
(151/187): nodejs-14.18.0-1.fc33.x86_64.rpm      87 kB/s |  97 kB     00:01    
(152/187): mesa-libGL-20.3.5-2.fc33.x86_64.rpm   63 kB/s | 181 kB     00:02    
(153/187): mesa-vulkan-drivers-20.3.5-2.fc33.x8 161 kB/s | 4.2 MB     00:26    
(154/187): nodejs-docs-14.18.0-1.fc33.noarch.rp 160 kB/s | 6.2 MB     00:39    
(155/187): nodejs-full-i18n-14.18.0-1.fc33.x86_ 151 kB/s | 7.8 MB     00:52    
(156/187): openblas-0.3.17-1.fc33.x86_64.rpm     81 kB/s |  33 kB     00:00    
(157/187): npm-6.14.15-1.14.18.0.1.fc33.x86_64. 194 kB/s | 3.3 MB     00:17    
(158/187): openssl-1.1.1l-2.fc33.x86_64.rpm     141 kB/s | 657 kB     00:04    
(159/187): perl-File-Compare-1.100.600-471.fc33 129 kB/s |  23 kB     00:00    
(160/187): perl-File-Copy-2.34-471.fc33.noarch. 189 kB/s |  30 kB     00:00    
(161/187): pugixml-1.11.4-1.fc33.x86_64.rpm     230 kB/s | 101 kB     00:00    
(162/187): pulseaudio-libs-14.0-2.fc33.x86_64.r 141 kB/s | 691 kB     00:04    
(163/187): python3-appdirs-1.4.4-1.fc33.noarch.  90 kB/s |  22 kB     00:00    
(164/187): openblas-openmp-0.3.17-1.fc33.x86_64 168 kB/s | 4.5 MB     00:27    
(165/187): python3-beautifulsoup4-4.9.3-1.fc33. 160 kB/s | 203 kB     00:01    
(166/187): python3-defusedxml-0.7.0~rc2-1.fc33. 172 kB/s |  51 kB     00:00    
(167/187): python3-devel-3.9.7-1.fc33.x86_64.rp 291 kB/s | 206 kB     00:00    
(168/187): python3-gstreamer1-1.18.2-1.fc33.x86 237 kB/s | 132 kB     00:00    
(169/187): python3-jinja2-2.11.3-1.fc33.noarch. 251 kB/s | 492 kB     00:01    
(170/187): python3-ldap-3.3.1-2.fc33.x86_64.rpm 245 kB/s | 219 kB     00:00    
(171/187): python3-lxml-4.5.1-4.fc33.x86_64.rpm 200 kB/s | 1.2 MB     00:06    
(172/187): python3-babel-2.8.1-2.fc33.noarch.rp 182 kB/s | 5.7 MB     00:31    
(173/187): nodejs-libs-14.18.0-1.fc33.x86_64.rp 168 kB/s |  13 MB     01:16    
(174/187): python3-pillow-7.2.0-8.fc33.x86_64.r 171 kB/s | 670 kB     00:03    
(175/187): python3-py-1.10.0-1.fc33.noarch.rpm  129 kB/s | 434 kB     00:03    
(176/187): python3-pytz-2020.5-1.fc33.noarch.rp 172 kB/s |  49 kB     00:00    
(177/187): python3-setuptools-49.1.3-2.fc33.noa 181 kB/s | 842 kB     00:04    
(178/187): python3-toml-0.10.2-1.fc33.noarch.rp 144 kB/s |  39 kB     00:00    
(179/187): python3-urllib3-1.25.8-5.fc33.noarch 206 kB/s | 171 kB     00:00    
(180/187): python3-webtest-3.0.0-1.fc33.noarch. 241 kB/s |  80 kB     00:00    
(181/187): raptor2-2.0.15-27.fc33.x86_64.rpm    152 kB/s | 214 kB     00:01    
(182/187): soundtouch-2.1.2-1.fc33.x86_64.rpm   208 kB/s |  74 kB     00:00    
(183/187): python3-pygments-2.6.1-6.fc33.noarch 170 kB/s | 1.8 MB     00:10    
(184/187): vulkan-loader-1.2.148.1-1.fc33.x86_6 156 kB/s | 124 kB     00:00    
(185/187): taglib-1.12-4.fc33.x86_64.rpm        271 kB/s | 356 kB     00:01    
(186/187): wavpack-5.4.0-1.fc33.x86_64.rpm      158 kB/s | 215 kB     00:01    
(187/187): python3-numpy-1.19.4-1.fc33.x86_64.r 197 kB/s | 4.4 MB     00:22    
--------------------------------------------------------------------------------
Total                                           692 kB/s | 112 MB     02:45     
Running transaction check
Transaction check succeeded.
Running transaction test
Transaction test succeeded.
Running transaction
  Running scriptlet: npm-1:6.14.15-1.14.18.0.1.fc33.x86_64                  1/1 
  Preparing        :                                                        1/1 
  Installing       : python3-setuptools-49.1.3-2.fc33.noarch              1/187 
  Installing       : libogg-2:1.3.4-3.fc33.x86_64                         2/187 
  Installing       : libX11-xcb-1.7.2-3.fc33.x86_64                       3/187 
  Installing       : libwayland-client-1.18.0-2.fc33.x86_64               4/187 
  Installing       : libvorbis-1:1.3.7-2.fc33.x86_64                      5/187 
  Installing       : python3-six-1.15.0-2.fc33.noarch                     6/187 
  Installing       : orc-0.4.31-3.fc33.x86_64                             7/187 
  Installing       : python3-py-1.10.0-1.fc33.noarch                      8/187 
  Installing       : serd-0.30.6-1.fc33.x86_64                            9/187 
  Installing       : opus-1.3.1-6.fc33.x86_64                            10/187 
  Installing       : libxshmfence-1.3-7.fc33.x86_64                      11/187 
  Installing       : libraw1394-2.1.2-12.fc33.x86_64                     12/187 
  Installing       : libdvdread-6.0.2-4.fc33.x86_64                      13/187 
  Installing       : sord-0.16.6-1.fc33.x86_64                           14/187 
  Installing       : libtheora-1:1.1.1-28.fc33.x86_64                    15/187 
  Installing       : flac-libs-1.3.3-4.fc33.x86_64                       16/187 
  Installing       : perl-File-Copy-2.34-471.fc33.noarch                 17/187 
  Installing       : perl-File-Compare-1.100.600-471.fc33.noarch         18/187 
  Installing       : mesa-libglapi-20.3.5-2.fc33.x86_64                  19/187 
  Installing       : libuv-1:1.42.0-2.fc33.x86_64                        20/187 
  Installing       : libquadmath-10.3.1-1.fc33.x86_64                    21/187 
  Installing       : libgfortran-10.3.1-1.fc33.x86_64                    22/187 
  Installing       : libglvnd-1:1.3.3-1.fc33.x86_64                      23/187 
  Installing       : flexiblas-3.0.4-1.fc33.x86_64                       24/187 
  Installing       : speex-1.2.0-6.fc33.x86_64                           25/187 
  Installing       : python3-pyasn1-0.4.8-3.fc33.noarch                  26/187 
  Installing       : python3-idna-2.10-2.fc33.noarch                     27/187 
  Installing       : perl-threads-1:2.25-457.fc33.x86_64                 28/187 
  Installing       : mpg123-libs-1.26.2-2.fc33.x86_64                    29/187 
  Installing       : libxslt-1.1.34-4.fc33.x86_64                        30/187 
  Installing       : libwayland-server-1.18.0-2.fc33.x86_64              31/187 
  Installing       : libgudev-234-1.fc33.x86_64                          32/187 
  Installing       : ilmbase-2.3.0-5.fc33.x86_64                         33/187 
  Installing       : gsm-1.0.19-3.fc33.x86_64                            34/187 
  Installing       : libsndfile-1.0.31-5.fc33.fc33.x86_64                35/187 
  Installing       : OpenEXR-libs-2.3.0-6.fc33.x86_64                    36/187 
  Installing       : libopenmpt-0.4.23-1.fc33.x86_64                     37/187 
  Installing       : perl-threads-shared-1.61-457.fc33.x86_64            38/187 
  Installing       : perl-Thread-Queue-3.14-457.fc33.noarch              39/187 
  Installing       : python3-pyasn1-modules-0.4.8-3.fc33.noarch          40/187 
  Installing       : libshout-2.4.3-2.fc33.x86_64                        41/187 
  Installing       : nodejs-libs-1:14.18.0-1.fc33.x86_64                 42/187 
  Installing       : sratom-0.6.6-1.fc33.x86_64                          43/187 
  Installing       : libdvdnav-6.0.1-4.fc33.x86_64                       44/187 
  Installing       : libavc1394-0.5.4-14.fc33.x86_64                     45/187 
  Installing       : libiec61883-1.2.0-24.fc33.x86_64                    46/187 
  Installing       : libwayland-cursor-1.18.0-2.fc33.x86_64              47/187 
  Installing       : python3-chardet-3.0.4-18.fc33.noarch                48/187 
  Installing       : python3-waitress-1.4.3-3.fc33.noarch                49/187 
  Installing       : python3-pygments-2.6.1-6.fc33.noarch                50/187 
  Installing       : wavpack-5.4.0-1.fc33.x86_64                         51/187 
  Installing       : taglib-1.12-4.fc33.x86_64                           52/187 
  Installing       : soundtouch-2.1.2-1.fc33.x86_64                      53/187 
  Installing       : python3-toml-0.10.2-1.fc33.noarch                   54/187 
  Installing       : python3-pytz-2020.5-1.fc33.noarch                   55/187 
  Installing       : python3-babel-2.8.1-2.fc33.noarch                   56/187 
  Installing       : python3-defusedxml-0.7.0~rc2-1.fc33.noarch          57/187 
  Installing       : python3-appdirs-1.4.4-1.fc33.noarch                 58/187 
  Installing       : pugixml-1.11.4-1.fc33.x86_64                        59/187 
  Installing       : libvmaf-1.5.1-5.fc33.x86_64                         60/187 
  Installing       : libaom-2.0.1-3.fc33.x86_64                          61/187 
  Installing       : openssl-1:1.1.1l-2.fc33.x86_64                      62/187 
  Installing       : openblas-0.3.17-1.fc33.x86_64                       63/187 
  Installing       : openblas-openmp-0.3.17-1.fc33.x86_64                64/187 
  Installing       : flexiblas-openblas-openmp-3.0.4-1.fc33.x86_64       65/187 
  Installing       : flexiblas-netlib-3.0.4-1.fc33.x86_64                66/187 
  Installing       : nodejs-docs-1:14.18.0-1.fc33.noarch                 67/187 
  Installing       : nodejs-full-i18n-1:14.18.0-1.fc33.x86_64            68/187 
  Installing       : npm-1:6.14.15-1.14.18.0.1.fc33.x86_64               69/187 
  Installing       : nodejs-1:14.18.0-1.fc33.x86_64                      70/187 
  Installing       : jasper-libs-2.0.33-1.fc33.x86_64                    71/187 
  Installing       : LibRaw-0.20.2-1.fc33.x86_64                         72/187 
  Installing       : graphene-1.10.6-1.fc33.x86_64                       73/187 
  Installing       : fftw-libs-double-3.3.8-9.fc33.x86_64                74/187 
  Installing       : cdparanoia-libs-10.2-37.fc33.x86_64                 75/187 
  Installing       : alsa-lib-1.2.4-5.fc33.x86_64                        76/187 
  Installing       : abattis-cantarell-fonts-0.301-1.fc33.noarch         77/187 
  Installing       : openh264-2.1.1-1.fc33.x86_64                        78/187 
  Running scriptlet: openh264-2.1.1-1.fc33.x86_64                        78/187 
  Installing       : yajl-2.1.0-15.fc33.x86_64                           79/187 
  Installing       : webrtc-audio-processing-0.3.1-5.fc33.x86_64         80/187 
  Installing       : twolame-libs-0.3.13-16.fc33.x86_64                  81/187 
  Installing       : srt-libs-1.4.1-5.fc33.x86_64                        82/187 
  Installing       : python3-webob-1.8.6-3.fc33.noarch                   83/187 
  Installing       : python3-sphinxcontrib-serializinghtml-1.1.4-2.fc    84/187 
  Installing       : python3-sphinxcontrib-qthelp-1.0.3-2.fc33.noarch    85/187 
  Installing       : python3-sphinxcontrib-jsmath-1.0.1-9.fc33.noarch    86/187 
  Installing       : python3-sphinxcontrib-htmlhelp-1.0.3-2.fc33.noar    87/187 
  Installing       : python3-sphinxcontrib-devhelp-1.0.2-2.fc33.noarc    88/187 
  Installing       : python3-sphinxcontrib-applehelp-1.0.2-2.fc33.noa    89/187 
  Installing       : python3-sphinx-theme-alabaster-0.7.12-10.fc33.no    90/187 
  Installing       : python3-soupsieve-2.0.1-2.fc33.noarch               91/187 
  Installing       : python3-beautifulsoup4-4.9.3-1.fc33.noarch          92/187 
  Installing       : python3-lxml-4.5.1-4.fc33.x86_64                    93/187 
  Installing       : python3-snowballstemmer-1.9.0-7.fc33.noarch         94/187 
  Installing       : python3-pysocks-1.7.1-7.fc33.noarch                 95/187 
  Installing       : python3-urllib3-1.25.8-5.fc33.noarch                96/187 
  Installing       : python3-requests-2.24.0-3.fc33.noarch               97/187 
  Installing       : python3-pyparsing-2.4.7-4.fc33.noarch               98/187 
  Installing       : python3-packaging-20.4-2.fc33.noarch                99/187 
  Installing       : python3-pluggy-0.13.1-2.fc33.noarch                100/187 
  Installing       : python3-olefile-0.46-12.fc33.noarch                101/187 
  Installing       : python3-more-itertools-8.4.0-1.fc33.noarch         102/187 
  Installing       : python3-markupsafe-1.1.1-7.fc33.x86_64             103/187 
  Installing       : python3-jinja2-2.11.3-1.fc33.noarch                104/187 
  Installing       : python3-iniconfig-1.0.0-2.fc33.noarch              105/187 
  Installing       : python3-imagesize-1.2.0-2.fc33.noarch              106/187 
  Installing       : python3-filelock-3.0.12-8.fc33.noarch              107/187 
  Installing       : python3-docutils-0.16-3.fc33.noarch                108/187 
  Installing       : python3-distlib-0.3.1-2.fc33.noarch                109/187 
  Installing       : python3-cairo-1.18.2-6.fc33.x86_64                 110/187 
  Installing       : python3-attrs-19.3.0-5.fc33.noarch                 111/187 
  Installing       : python3-pytest-6.0.2-1.fc33.noarch                 112/187 
  Installing       : python3-pytest-forked-1.3.0-1.fc33.noarch          113/187 
  Installing       : python3-apipkg-1.5-11.fc33.noarch                  114/187 
  Installing       : python3-execnet-1.7.1-4.fc33.noarch                115/187 
  Installing       : python-wheel-wheel-1:0.34.2-1.fc33.noarch          116/187 
  Installing       : m4-1.4.18-15.fc33.x86_64                           117/187 
  Installing       : autoconf-2.69-34.fc33.noarch                       118/187 
  Installing       : lv2-1.18.0-1.fc33.x86_64                           119/187 
  Installing       : lilv-0.24.10-1.fc33.x86_64                         120/187 
  Installing       : libwmf-lite-0.2.12-4.fc33.x86_64                   121/187 
  Installing       : libwayland-egl-1.18.0-2.fc33.x86_64                122/187 
  Installing       : libvpx-1.9.0-1.fc33.x86_64                         123/187 
  Installing       : libvisual-1:0.4.0-29.fc33.x86_64                   124/187 
  Installing       : libv4l-1.20.0-1.fc33.x86_64                        125/187 
  Installing       : libunwind-1.4.0-4.fc33.x86_64                      126/187 
  Installing       : gstreamer1-1.18.2-1.fc33.x86_64                    127/187 
  Installing       : libsrtp-2.3.0-3.fc33.x86_64                        128/187 
  Installing       : libpciaccess-0.16-3.fc33.x86_64                    129/187 
  Installing       : libdrm-2.4.102-2.fc33.x86_64                       130/187 
  Installing       : mesa-libgbm-20.3.5-2.fc33.x86_64                   131/187 
  Installing       : libglvnd-egl-1:1.3.3-1.fc33.x86_64                 132/187 
  Installing       : mesa-libEGL-20.3.5-2.fc33.x86_64                   133/187 
  Installing       : vulkan-loader-1.2.148.1-1.fc33.x86_64              134/187 
  Installing       : mesa-vulkan-drivers-20.3.5-2.fc33.x86_64           135/187 
  Installing       : libmpeg2-0.5.1-21.fc33.x86_64                      136/187 
  Installing       : libmodman-2.0.1-23.fc33.x86_64                     137/187 
  Installing       : libproxy-0.4.15-25.fc33.x86_64                     138/187 
  Installing       : libmicrodns-0.1.2-2.fc33.x86_64                    139/187 
  Installing       : liblqr-1-0.4.2-15.fc33.x86_64                      140/187 
  Installing       : ImageMagick-libs-1:6.9.11.27-1.fc33.x86_64         141/187 
  Installing       : ImageMagick-1:6.9.11.27-1.fc33.x86_64              142/187 
  Installing       : libicu-67.1-4.fc33.x86_64                          143/187 
  Installing       : raptor2-2.0.15-27.fc33.x86_64                      144/187 
  Installing       : libdv-1.0.0-32.fc33.x86_64                         145/187 
  Installing       : libcdio-2.1.0-3.fc33.x86_64                        146/187 
  Installing       : libasyncns-0.8-19.fc33.x86_64                      147/187 
  Installing       : liba52-0.7.4-39.fc33.x86_64                        148/187 
  Installing       : libXxf86vm-1.1.4-14.fc33.x86_64                    149/187 
  Installing       : libglvnd-glx-1:1.3.3-1.fc33.x86_64                 150/187 
  Installing       : mesa-libGL-20.3.5-2.fc33.x86_64                    151/187 
  Installing       : libXv-1.0.11-12.fc33.x86_64                        152/187 
  Installing       : libXtst-1.2.3-12.fc33.x86_64                       153/187 
  Installing       : pulseaudio-libs-14.0-2.fc33.x86_64                 154/187 
  Installing       : lame-libs-3.100-9.fc33.x86_64                      155/187 
  Installing       : ladspa-1.13-25.fc33.x86_64                         156/187 
  Installing       : liblrdf-0.5.0-20.fc33.x86_64                       157/187 
  Installing       : iso-codes-4.5.0-2.fc33.noarch                      158/187 
  Installing       : gstreamer1-plugins-base-1.18.2-1.fc33.x86_64       159/187 
  Installing       : gobject-introspection-1.66.1-1.fc33.x86_64         160/187 
  Installing       : python3-gobject-base-3.38.0-2.fc33.x86_64          161/187 
  Installing       : python3-gobject-3.38.0-2.fc33.x86_64               162/187 
  Installing       : fdk-aac-free-2.0.0-5.fc33.x86_64                   163/187 
  Installing       : adobe-source-code-pro-fonts-2.030.1.050-9.fc33.n   164/187 
  Installing       : gsettings-desktop-schemas-3.38.0-1.fc33.x86_64     165/187 
  Installing       : glib-networking-2.66.0-1.fc33.x86_64               166/187 
  Installing       : libsoup-2.72.0-3.fc33.x86_64                       167/187 
  Installing       : gssdp-1.2.3-2.fc33.x86_64                          168/187 
  Installing       : gupnp-1.2.3-2.fc33.x86_64                          169/187 
  Installing       : gupnp-igd-1.2.0-1.fc33.x86_64                      170/187 
  Installing       : libnice-0.1.17-3.fc33.x86_64                       171/187 
  Installing       : gstreamer1-plugins-bad-free-1.18.2-3.fc33.x86_64   172/187 
  Installing       : gstreamer1-plugins-good-1.18.2-1.fc33.x86_64       173/187 
  Installing       : python3-gstreamer1-1.18.2-1.fc33.x86_64            174/187 
  Installing       : gstreamer1-plugin-openh264-1.16.2-2.fc33.x86_64    175/187 
  Installing       : gstreamer1-plugins-ugly-free-1.18.2-1.fc33.x86_6   176/187 
  Installing       : python3-sphinx-1:3.2.1-1.fc33.noarch               177/187 
  Installing       : automake-1.16.2-4.fc33.noarch                      178/187 
  Installing       : python3-virtualenv-20.0.30-1.fc33.noarch           179/187 
  Installing       : python3-pytest-xdist-1.34.0-1.fc33.noarch          180/187 
  Installing       : python3-pillow-7.2.0-8.fc33.x86_64                 181/187 
  Installing       : python3-webtest-3.0.0-1.fc33.noarch                182/187 
  Installing       : python3-numpy-1:1.19.4-1.fc33.x86_64               183/187 
  Installing       : python3-openid-3.1.0-10.fc33.noarch                184/187 
  Installing       : python3-ldap-3.3.1-2.fc33.x86_64                   185/187 
  Installing       : python3-devel-3.9.7-1.fc33.x86_64                  186/187 
  Installing       : libffi-devel-3.1-26.fc33.x86_64                    187/187 
  Running scriptlet: libffi-devel-3.1-26.fc33.x86_64                    187/187 
  Verifying        : ImageMagick-1:6.9.11.27-1.fc33.x86_64                1/187 
  Verifying        : ImageMagick-libs-1:6.9.11.27-1.fc33.x86_64           2/187 
  Verifying        : OpenEXR-libs-2.3.0-6.fc33.x86_64                     3/187 
  Verifying        : adobe-source-code-pro-fonts-2.030.1.050-9.fc33.n     4/187 
  Verifying        : autoconf-2.69-34.fc33.noarch                         5/187 
  Verifying        : fdk-aac-free-2.0.0-5.fc33.x86_64                     6/187 
  Verifying        : glib-networking-2.66.0-1.fc33.x86_64                 7/187 
  Verifying        : gobject-introspection-1.66.1-1.fc33.x86_64           8/187 
  Verifying        : gsettings-desktop-schemas-3.38.0-1.fc33.x86_64       9/187 
  Verifying        : gsm-1.0.19-3.fc33.x86_64                            10/187 
  Verifying        : gssdp-1.2.3-2.fc33.x86_64                           11/187 
  Verifying        : gupnp-1.2.3-2.fc33.x86_64                           12/187 
  Verifying        : gupnp-igd-1.2.0-1.fc33.x86_64                       13/187 
  Verifying        : ilmbase-2.3.0-5.fc33.x86_64                         14/187 
  Verifying        : iso-codes-4.5.0-2.fc33.noarch                       15/187 
  Verifying        : ladspa-1.13-25.fc33.x86_64                          16/187 
  Verifying        : lame-libs-3.100-9.fc33.x86_64                       17/187 
  Verifying        : libXtst-1.2.3-12.fc33.x86_64                        18/187 
  Verifying        : libXv-1.0.11-12.fc33.x86_64                         19/187 
  Verifying        : libXxf86vm-1.1.4-14.fc33.x86_64                     20/187 
  Verifying        : liba52-0.7.4-39.fc33.x86_64                         21/187 
  Verifying        : libasyncns-0.8-19.fc33.x86_64                       22/187 
  Verifying        : libavc1394-0.5.4-14.fc33.x86_64                     23/187 
  Verifying        : libcdio-2.1.0-3.fc33.x86_64                         24/187 
  Verifying        : libdrm-2.4.102-2.fc33.x86_64                        25/187 
  Verifying        : libdv-1.0.0-32.fc33.x86_64                          26/187 
  Verifying        : libdvdnav-6.0.1-4.fc33.x86_64                       27/187 
  Verifying        : libdvdread-6.0.2-4.fc33.x86_64                      28/187 
  Verifying        : libffi-devel-3.1-26.fc33.x86_64                     29/187 
  Verifying        : libgudev-234-1.fc33.x86_64                          30/187 
  Verifying        : libicu-67.1-4.fc33.x86_64                           31/187 
  Verifying        : libiec61883-1.2.0-24.fc33.x86_64                    32/187 
  Verifying        : liblqr-1-0.4.2-15.fc33.x86_64                       33/187 
  Verifying        : liblrdf-0.5.0-20.fc33.x86_64                        34/187 
  Verifying        : libmicrodns-0.1.2-2.fc33.x86_64                     35/187 
  Verifying        : libmodman-2.0.1-23.fc33.x86_64                      36/187 
  Verifying        : libmpeg2-0.5.1-21.fc33.x86_64                       37/187 
  Verifying        : libnice-0.1.17-3.fc33.x86_64                        38/187 
  Verifying        : libogg-2:1.3.4-3.fc33.x86_64                        39/187 
  Verifying        : libpciaccess-0.16-3.fc33.x86_64                     40/187 
  Verifying        : libproxy-0.4.15-25.fc33.x86_64                      41/187 
  Verifying        : libraw1394-2.1.2-12.fc33.x86_64                     42/187 
  Verifying        : libshout-2.4.3-2.fc33.x86_64                        43/187 
  Verifying        : libsoup-2.72.0-3.fc33.x86_64                        44/187 
  Verifying        : libsrtp-2.3.0-3.fc33.x86_64                         45/187 
  Verifying        : libtheora-1:1.1.1-28.fc33.x86_64                    46/187 
  Verifying        : libunwind-1.4.0-4.fc33.x86_64                       47/187 
  Verifying        : libv4l-1.20.0-1.fc33.x86_64                         48/187 
  Verifying        : libvisual-1:0.4.0-29.fc33.x86_64                    49/187 
  Verifying        : libvmaf-1.5.1-5.fc33.x86_64                         50/187 
  Verifying        : libvorbis-1:1.3.7-2.fc33.x86_64                     51/187 
  Verifying        : libvpx-1.9.0-1.fc33.x86_64                          52/187 
  Verifying        : libwayland-client-1.18.0-2.fc33.x86_64              53/187 
  Verifying        : libwayland-cursor-1.18.0-2.fc33.x86_64              54/187 
  Verifying        : libwayland-egl-1.18.0-2.fc33.x86_64                 55/187 
  Verifying        : libwayland-server-1.18.0-2.fc33.x86_64              56/187 
  Verifying        : libwmf-lite-0.2.12-4.fc33.x86_64                    57/187 
  Verifying        : libxshmfence-1.3-7.fc33.x86_64                      58/187 
  Verifying        : libxslt-1.1.34-4.fc33.x86_64                        59/187 
  Verifying        : lilv-0.24.10-1.fc33.x86_64                          60/187 
  Verifying        : lv2-1.18.0-1.fc33.x86_64                            61/187 
  Verifying        : m4-1.4.18-15.fc33.x86_64                            62/187 
  Verifying        : mpg123-libs-1.26.2-2.fc33.x86_64                    63/187 
  Verifying        : opus-1.3.1-6.fc33.x86_64                            64/187 
  Verifying        : orc-0.4.31-3.fc33.x86_64                            65/187 
  Verifying        : perl-Thread-Queue-3.14-457.fc33.noarch              66/187 
  Verifying        : perl-threads-1:2.25-457.fc33.x86_64                 67/187 
  Verifying        : perl-threads-shared-1.61-457.fc33.x86_64            68/187 
  Verifying        : python-wheel-wheel-1:0.34.2-1.fc33.noarch           69/187 
  Verifying        : python3-apipkg-1.5-11.fc33.noarch                   70/187 
  Verifying        : python3-attrs-19.3.0-5.fc33.noarch                  71/187 
  Verifying        : python3-cairo-1.18.2-6.fc33.x86_64                  72/187 
  Verifying        : python3-chardet-3.0.4-18.fc33.noarch                73/187 
  Verifying        : python3-distlib-0.3.1-2.fc33.noarch                 74/187 
  Verifying        : python3-docutils-0.16-3.fc33.noarch                 75/187 
  Verifying        : python3-execnet-1.7.1-4.fc33.noarch                 76/187 
  Verifying        : python3-filelock-3.0.12-8.fc33.noarch               77/187 
  Verifying        : python3-gobject-3.38.0-2.fc33.x86_64                78/187 
  Verifying        : python3-gobject-base-3.38.0-2.fc33.x86_64           79/187 
  Verifying        : python3-idna-2.10-2.fc33.noarch                     80/187 
  Verifying        : python3-imagesize-1.2.0-2.fc33.noarch               81/187 
  Verifying        : python3-iniconfig-1.0.0-2.fc33.noarch               82/187 
  Verifying        : python3-markupsafe-1.1.1-7.fc33.x86_64              83/187 
  Verifying        : python3-more-itertools-8.4.0-1.fc33.noarch          84/187 
  Verifying        : python3-olefile-0.46-12.fc33.noarch                 85/187 
  Verifying        : python3-openid-3.1.0-10.fc33.noarch                 86/187 
  Verifying        : python3-packaging-20.4-2.fc33.noarch                87/187 
  Verifying        : python3-pluggy-0.13.1-2.fc33.noarch                 88/187 
  Verifying        : python3-pyasn1-0.4.8-3.fc33.noarch                  89/187 
  Verifying        : python3-pyasn1-modules-0.4.8-3.fc33.noarch          90/187 
  Verifying        : python3-pyparsing-2.4.7-4.fc33.noarch               91/187 
  Verifying        : python3-pysocks-1.7.1-7.fc33.noarch                 92/187 
  Verifying        : python3-pytest-6.0.2-1.fc33.noarch                  93/187 
  Verifying        : python3-pytest-forked-1.3.0-1.fc33.noarch           94/187 
  Verifying        : python3-pytest-xdist-1.34.0-1.fc33.noarch           95/187 
  Verifying        : python3-requests-2.24.0-3.fc33.noarch               96/187 
  Verifying        : python3-six-1.15.0-2.fc33.noarch                    97/187 
  Verifying        : python3-snowballstemmer-1.9.0-7.fc33.noarch         98/187 
  Verifying        : python3-soupsieve-2.0.1-2.fc33.noarch               99/187 
  Verifying        : python3-sphinx-1:3.2.1-1.fc33.noarch               100/187 
  Verifying        : python3-sphinx-theme-alabaster-0.7.12-10.fc33.no   101/187 
  Verifying        : python3-sphinxcontrib-applehelp-1.0.2-2.fc33.noa   102/187 
  Verifying        : python3-sphinxcontrib-devhelp-1.0.2-2.fc33.noarc   103/187 
  Verifying        : python3-sphinxcontrib-htmlhelp-1.0.3-2.fc33.noar   104/187 
  Verifying        : python3-sphinxcontrib-jsmath-1.0.1-9.fc33.noarch   105/187 
  Verifying        : python3-sphinxcontrib-qthelp-1.0.3-2.fc33.noarch   106/187 
  Verifying        : python3-sphinxcontrib-serializinghtml-1.1.4-2.fc   107/187 
  Verifying        : python3-virtualenv-20.0.30-1.fc33.noarch           108/187 
  Verifying        : python3-waitress-1.4.3-3.fc33.noarch               109/187 
  Verifying        : python3-webob-1.8.6-3.fc33.noarch                  110/187 
  Verifying        : serd-0.30.6-1.fc33.x86_64                          111/187 
  Verifying        : sord-0.16.6-1.fc33.x86_64                          112/187 
  Verifying        : speex-1.2.0-6.fc33.x86_64                          113/187 
  Verifying        : sratom-0.6.6-1.fc33.x86_64                         114/187 
  Verifying        : srt-libs-1.4.1-5.fc33.x86_64                       115/187 
  Verifying        : twolame-libs-0.3.13-16.fc33.x86_64                 116/187 
  Verifying        : webrtc-audio-processing-0.3.1-5.fc33.x86_64        117/187 
  Verifying        : yajl-2.1.0-15.fc33.x86_64                          118/187 
  Verifying        : gstreamer1-plugin-openh264-1.16.2-2.fc33.x86_64    119/187 
  Verifying        : openh264-2.1.1-1.fc33.x86_64                       120/187 
  Verifying        : LibRaw-0.20.2-1.fc33.x86_64                        121/187 
  Verifying        : abattis-cantarell-fonts-0.301-1.fc33.noarch        122/187 
  Verifying        : alsa-lib-1.2.4-5.fc33.x86_64                       123/187 
  Verifying        : automake-1.16.2-4.fc33.noarch                      124/187 
  Verifying        : cdparanoia-libs-10.2-37.fc33.x86_64                125/187 
  Verifying        : fftw-libs-double-3.3.8-9.fc33.x86_64               126/187 
  Verifying        : flac-libs-1.3.3-4.fc33.x86_64                      127/187 
  Verifying        : flexiblas-3.0.4-1.fc33.x86_64                      128/187 
  Verifying        : flexiblas-netlib-3.0.4-1.fc33.x86_64               129/187 
  Verifying        : flexiblas-openblas-openmp-3.0.4-1.fc33.x86_64      130/187 
  Verifying        : graphene-1.10.6-1.fc33.x86_64                      131/187 
  Verifying        : gstreamer1-1.18.2-1.fc33.x86_64                    132/187 
  Verifying        : gstreamer1-plugins-bad-free-1.18.2-3.fc33.x86_64   133/187 
  Verifying        : gstreamer1-plugins-base-1.18.2-1.fc33.x86_64       134/187 
  Verifying        : gstreamer1-plugins-good-1.18.2-1.fc33.x86_64       135/187 
  Verifying        : gstreamer1-plugins-ugly-free-1.18.2-1.fc33.x86_6   136/187 
  Verifying        : jasper-libs-2.0.33-1.fc33.x86_64                   137/187 
  Verifying        : libX11-xcb-1.7.2-3.fc33.x86_64                     138/187 
  Verifying        : libaom-2.0.1-3.fc33.x86_64                         139/187 
  Verifying        : libgfortran-10.3.1-1.fc33.x86_64                   140/187 
  Verifying        : libglvnd-1:1.3.3-1.fc33.x86_64                     141/187 
  Verifying        : libglvnd-egl-1:1.3.3-1.fc33.x86_64                 142/187 
  Verifying        : libglvnd-glx-1:1.3.3-1.fc33.x86_64                 143/187 
  Verifying        : libopenmpt-0.4.23-1.fc33.x86_64                    144/187 
  Verifying        : libquadmath-10.3.1-1.fc33.x86_64                   145/187 
  Verifying        : libsndfile-1.0.31-5.fc33.fc33.x86_64               146/187 
  Verifying        : libuv-1:1.42.0-2.fc33.x86_64                       147/187 
  Verifying        : mesa-libEGL-20.3.5-2.fc33.x86_64                   148/187 
  Verifying        : mesa-libGL-20.3.5-2.fc33.x86_64                    149/187 
  Verifying        : mesa-libgbm-20.3.5-2.fc33.x86_64                   150/187 
  Verifying        : mesa-libglapi-20.3.5-2.fc33.x86_64                 151/187 
  Verifying        : mesa-vulkan-drivers-20.3.5-2.fc33.x86_64           152/187 
  Verifying        : nodejs-1:14.18.0-1.fc33.x86_64                     153/187 
  Verifying        : nodejs-docs-1:14.18.0-1.fc33.noarch                154/187 
  Verifying        : nodejs-full-i18n-1:14.18.0-1.fc33.x86_64           155/187 
  Verifying        : nodejs-libs-1:14.18.0-1.fc33.x86_64                156/187 
  Verifying        : npm-1:6.14.15-1.14.18.0.1.fc33.x86_64              157/187 
  Verifying        : openblas-0.3.17-1.fc33.x86_64                      158/187 
  Verifying        : openblas-openmp-0.3.17-1.fc33.x86_64               159/187 
  Verifying        : openssl-1:1.1.1l-2.fc33.x86_64                     160/187 
  Verifying        : perl-File-Compare-1.100.600-471.fc33.noarch        161/187 
  Verifying        : perl-File-Copy-2.34-471.fc33.noarch                162/187 
  Verifying        : pugixml-1.11.4-1.fc33.x86_64                       163/187 
  Verifying        : pulseaudio-libs-14.0-2.fc33.x86_64                 164/187 
  Verifying        : python3-appdirs-1.4.4-1.fc33.noarch                165/187 
  Verifying        : python3-babel-2.8.1-2.fc33.noarch                  166/187 
  Verifying        : python3-beautifulsoup4-4.9.3-1.fc33.noarch         167/187 
  Verifying        : python3-defusedxml-0.7.0~rc2-1.fc33.noarch         168/187 
  Verifying        : python3-devel-3.9.7-1.fc33.x86_64                  169/187 
  Verifying        : python3-gstreamer1-1.18.2-1.fc33.x86_64            170/187 
  Verifying        : python3-jinja2-2.11.3-1.fc33.noarch                171/187 
  Verifying        : python3-ldap-3.3.1-2.fc33.x86_64                   172/187 
  Verifying        : python3-lxml-4.5.1-4.fc33.x86_64                   173/187 
  Verifying        : python3-numpy-1:1.19.4-1.fc33.x86_64               174/187 
  Verifying        : python3-pillow-7.2.0-8.fc33.x86_64                 175/187 
  Verifying        : python3-py-1.10.0-1.fc33.noarch                    176/187 
  Verifying        : python3-pygments-2.6.1-6.fc33.noarch               177/187 
  Verifying        : python3-pytz-2020.5-1.fc33.noarch                  178/187 
  Verifying        : python3-setuptools-49.1.3-2.fc33.noarch            179/187 
  Verifying        : python3-toml-0.10.2-1.fc33.noarch                  180/187 
  Verifying        : python3-urllib3-1.25.8-5.fc33.noarch               181/187 
  Verifying        : python3-webtest-3.0.0-1.fc33.noarch                182/187 
  Verifying        : raptor2-2.0.15-27.fc33.x86_64                      183/187 
  Verifying        : soundtouch-2.1.2-1.fc33.x86_64                     184/187 
  Verifying        : taglib-1.12-4.fc33.x86_64                          185/187 
  Verifying        : vulkan-loader-1.2.148.1-1.fc33.x86_64              186/187 
  Verifying        : wavpack-5.4.0-1.fc33.x86_64                        187/187 

Installed:
  ImageMagick-1:6.9.11.27-1.fc33.x86_64                                         
  ImageMagick-libs-1:6.9.11.27-1.fc33.x86_64                                    
  LibRaw-0.20.2-1.fc33.x86_64                                                   
  OpenEXR-libs-2.3.0-6.fc33.x86_64                                              
  abattis-cantarell-fonts-0.301-1.fc33.noarch                                   
  adobe-source-code-pro-fonts-2.030.1.050-9.fc33.noarch                         
  alsa-lib-1.2.4-5.fc33.x86_64                                                  
  autoconf-2.69-34.fc33.noarch                                                  
  automake-1.16.2-4.fc33.noarch                                                 
  cdparanoia-libs-10.2-37.fc33.x86_64                                           
  fdk-aac-free-2.0.0-5.fc33.x86_64                                              
  fftw-libs-double-3.3.8-9.fc33.x86_64                                          
  flac-libs-1.3.3-4.fc33.x86_64                                                 
  flexiblas-3.0.4-1.fc33.x86_64                                                 
  flexiblas-netlib-3.0.4-1.fc33.x86_64                                          
  flexiblas-openblas-openmp-3.0.4-1.fc33.x86_64                                 
  glib-networking-2.66.0-1.fc33.x86_64                                          
  gobject-introspection-1.66.1-1.fc33.x86_64                                    
  graphene-1.10.6-1.fc33.x86_64                                                 
  gsettings-desktop-schemas-3.38.0-1.fc33.x86_64                                
  gsm-1.0.19-3.fc33.x86_64                                                      
  gssdp-1.2.3-2.fc33.x86_64                                                     
  gstreamer1-1.18.2-1.fc33.x86_64                                               
  gstreamer1-plugin-openh264-1.16.2-2.fc33.x86_64                               
  gstreamer1-plugins-bad-free-1.18.2-3.fc33.x86_64                              
  gstreamer1-plugins-base-1.18.2-1.fc33.x86_64                                  
  gstreamer1-plugins-good-1.18.2-1.fc33.x86_64                                  
  gstreamer1-plugins-ugly-free-1.18.2-1.fc33.x86_64                             
  gupnp-1.2.3-2.fc33.x86_64                                                     
  gupnp-igd-1.2.0-1.fc33.x86_64                                                 
  ilmbase-2.3.0-5.fc33.x86_64                                                   
  iso-codes-4.5.0-2.fc33.noarch                                                 
  jasper-libs-2.0.33-1.fc33.x86_64                                              
  ladspa-1.13-25.fc33.x86_64                                                    
  lame-libs-3.100-9.fc33.x86_64                                                 
  libX11-xcb-1.7.2-3.fc33.x86_64                                                
  libXtst-1.2.3-12.fc33.x86_64                                                  
  libXv-1.0.11-12.fc33.x86_64                                                   
  libXxf86vm-1.1.4-14.fc33.x86_64                                               
  liba52-0.7.4-39.fc33.x86_64                                                   
  libaom-2.0.1-3.fc33.x86_64                                                    
  libasyncns-0.8-19.fc33.x86_64                                                 
  libavc1394-0.5.4-14.fc33.x86_64                                               
  libcdio-2.1.0-3.fc33.x86_64                                                   
  libdrm-2.4.102-2.fc33.x86_64                                                  
  libdv-1.0.0-32.fc33.x86_64                                                    
  libdvdnav-6.0.1-4.fc33.x86_64                                                 
  libdvdread-6.0.2-4.fc33.x86_64                                                
  libffi-devel-3.1-26.fc33.x86_64                                               
  libgfortran-10.3.1-1.fc33.x86_64                                              
  libglvnd-1:1.3.3-1.fc33.x86_64                                                
  libglvnd-egl-1:1.3.3-1.fc33.x86_64                                            
  libglvnd-glx-1:1.3.3-1.fc33.x86_64                                            
  libgudev-234-1.fc33.x86_64                                                    
  libicu-67.1-4.fc33.x86_64                                                     
  libiec61883-1.2.0-24.fc33.x86_64                                              
  liblqr-1-0.4.2-15.fc33.x86_64                                                 
  liblrdf-0.5.0-20.fc33.x86_64                                                  
  libmicrodns-0.1.2-2.fc33.x86_64                                               
  libmodman-2.0.1-23.fc33.x86_64                                                
  libmpeg2-0.5.1-21.fc33.x86_64                                                 
  libnice-0.1.17-3.fc33.x86_64                                                  
  libogg-2:1.3.4-3.fc33.x86_64                                                  
  libopenmpt-0.4.23-1.fc33.x86_64                                               
  libpciaccess-0.16-3.fc33.x86_64                                               
  libproxy-0.4.15-25.fc33.x86_64                                                
  libquadmath-10.3.1-1.fc33.x86_64                                              
  libraw1394-2.1.2-12.fc33.x86_64                                               
  libshout-2.4.3-2.fc33.x86_64                                                  
  libsndfile-1.0.31-5.fc33.fc33.x86_64                                          
  libsoup-2.72.0-3.fc33.x86_64                                                  
  libsrtp-2.3.0-3.fc33.x86_64                                                   
  libtheora-1:1.1.1-28.fc33.x86_64                                              
  libunwind-1.4.0-4.fc33.x86_64                                                 
  libuv-1:1.42.0-2.fc33.x86_64                                                  
  libv4l-1.20.0-1.fc33.x86_64                                                   
  libvisual-1:0.4.0-29.fc33.x86_64                                              
  libvmaf-1.5.1-5.fc33.x86_64                                                   
  libvorbis-1:1.3.7-2.fc33.x86_64                                               
  libvpx-1.9.0-1.fc33.x86_64                                                    
  libwayland-client-1.18.0-2.fc33.x86_64                                        
  libwayland-cursor-1.18.0-2.fc33.x86_64                                        
  libwayland-egl-1.18.0-2.fc33.x86_64                                           
  libwayland-server-1.18.0-2.fc33.x86_64                                        
  libwmf-lite-0.2.12-4.fc33.x86_64                                              
  libxshmfence-1.3-7.fc33.x86_64                                                
  libxslt-1.1.34-4.fc33.x86_64                                                  
  lilv-0.24.10-1.fc33.x86_64                                                    
  lv2-1.18.0-1.fc33.x86_64                                                      
  m4-1.4.18-15.fc33.x86_64                                                      
  mesa-libEGL-20.3.5-2.fc33.x86_64                                              
  mesa-libGL-20.3.5-2.fc33.x86_64                                               
  mesa-libgbm-20.3.5-2.fc33.x86_64                                              
  mesa-libglapi-20.3.5-2.fc33.x86_64                                            
  mesa-vulkan-drivers-20.3.5-2.fc33.x86_64                                      
  mpg123-libs-1.26.2-2.fc33.x86_64                                              
  nodejs-1:14.18.0-1.fc33.x86_64                                                
  nodejs-docs-1:14.18.0-1.fc33.noarch                                           
  nodejs-full-i18n-1:14.18.0-1.fc33.x86_64                                      
  nodejs-libs-1:14.18.0-1.fc33.x86_64                                           
  npm-1:6.14.15-1.14.18.0.1.fc33.x86_64                                         
  openblas-0.3.17-1.fc33.x86_64                                                 
  openblas-openmp-0.3.17-1.fc33.x86_64                                          
  openh264-2.1.1-1.fc33.x86_64                                                  
  openssl-1:1.1.1l-2.fc33.x86_64                                                
  opus-1.3.1-6.fc33.x86_64                                                      
  orc-0.4.31-3.fc33.x86_64                                                      
  perl-File-Compare-1.100.600-471.fc33.noarch                                   
  perl-File-Copy-2.34-471.fc33.noarch                                           
  perl-Thread-Queue-3.14-457.fc33.noarch                                        
  perl-threads-1:2.25-457.fc33.x86_64                                           
  perl-threads-shared-1.61-457.fc33.x86_64                                      
  pugixml-1.11.4-1.fc33.x86_64                                                  
  pulseaudio-libs-14.0-2.fc33.x86_64                                            
  python-wheel-wheel-1:0.34.2-1.fc33.noarch                                     
  python3-apipkg-1.5-11.fc33.noarch                                             
  python3-appdirs-1.4.4-1.fc33.noarch                                           
  python3-attrs-19.3.0-5.fc33.noarch                                            
  python3-babel-2.8.1-2.fc33.noarch                                             
  python3-beautifulsoup4-4.9.3-1.fc33.noarch                                    
  python3-cairo-1.18.2-6.fc33.x86_64                                            
  python3-chardet-3.0.4-18.fc33.noarch                                          
  python3-defusedxml-0.7.0~rc2-1.fc33.noarch                                    
  python3-devel-3.9.7-1.fc33.x86_64                                             
  python3-distlib-0.3.1-2.fc33.noarch                                           
  python3-docutils-0.16-3.fc33.noarch                                           
  python3-execnet-1.7.1-4.fc33.noarch                                           
  python3-filelock-3.0.12-8.fc33.noarch                                         
  python3-gobject-3.38.0-2.fc33.x86_64                                          
  python3-gobject-base-3.38.0-2.fc33.x86_64                                     
  python3-gstreamer1-1.18.2-1.fc33.x86_64                                       
  python3-idna-2.10-2.fc33.noarch                                               
  python3-imagesize-1.2.0-2.fc33.noarch                                         
  python3-iniconfig-1.0.0-2.fc33.noarch                                         
  python3-jinja2-2.11.3-1.fc33.noarch                                           
  python3-ldap-3.3.1-2.fc33.x86_64                                              
  python3-lxml-4.5.1-4.fc33.x86_64                                              
  python3-markupsafe-1.1.1-7.fc33.x86_64                                        
  python3-more-itertools-8.4.0-1.fc33.noarch                                    
  python3-numpy-1:1.19.4-1.fc33.x86_64                                          
  python3-olefile-0.46-12.fc33.noarch                                           
  python3-openid-3.1.0-10.fc33.noarch                                           
  python3-packaging-20.4-2.fc33.noarch                                          
  python3-pillow-7.2.0-8.fc33.x86_64                                            
  python3-pluggy-0.13.1-2.fc33.noarch                                           
  python3-py-1.10.0-1.fc33.noarch                                               
  python3-pyasn1-0.4.8-3.fc33.noarch                                            
  python3-pyasn1-modules-0.4.8-3.fc33.noarch                                    
  python3-pygments-2.6.1-6.fc33.noarch                                          
  python3-pyparsing-2.4.7-4.fc33.noarch                                         
  python3-pysocks-1.7.1-7.fc33.noarch                                           
  python3-pytest-6.0.2-1.fc33.noarch                                            
  python3-pytest-forked-1.3.0-1.fc33.noarch                                     
  python3-pytest-xdist-1.34.0-1.fc33.noarch                                     
  python3-pytz-2020.5-1.fc33.noarch                                             
  python3-requests-2.24.0-3.fc33.noarch                                         
  python3-setuptools-49.1.3-2.fc33.noarch                                       
  python3-six-1.15.0-2.fc33.noarch                                              
  python3-snowballstemmer-1.9.0-7.fc33.noarch                                   
  python3-soupsieve-2.0.1-2.fc33.noarch                                         
  python3-sphinx-1:3.2.1-1.fc33.noarch                                          
  python3-sphinx-theme-alabaster-0.7.12-10.fc33.noarch                          
  python3-sphinxcontrib-applehelp-1.0.2-2.fc33.noarch                           
  python3-sphinxcontrib-devhelp-1.0.2-2.fc33.noarch                             
  python3-sphinxcontrib-htmlhelp-1.0.3-2.fc33.noarch                            
  python3-sphinxcontrib-jsmath-1.0.1-9.fc33.noarch                              
  python3-sphinxcontrib-qthelp-1.0.3-2.fc33.noarch                              
  python3-sphinxcontrib-serializinghtml-1.1.4-2.fc33.noarch                     
  python3-toml-0.10.2-1.fc33.noarch                                             
  python3-urllib3-1.25.8-5.fc33.noarch                                          
  python3-virtualenv-20.0.30-1.fc33.noarch                                      
  python3-waitress-1.4.3-3.fc33.noarch                                          
  python3-webob-1.8.6-3.fc33.noarch                                             
  python3-webtest-3.0.0-1.fc33.noarch                                           
  raptor2-2.0.15-27.fc33.x86_64                                                 
  serd-0.30.6-1.fc33.x86_64                                                     
  sord-0.16.6-1.fc33.x86_64                                                     
  soundtouch-2.1.2-1.fc33.x86_64                                                
  speex-1.2.0-6.fc33.x86_64                                                     
  sratom-0.6.6-1.fc33.x86_64                                                    
  srt-libs-1.4.1-5.fc33.x86_64                                                  
  taglib-1.12-4.fc33.x86_64                                                     
  twolame-libs-0.3.13-16.fc33.x86_64                                            
  vulkan-loader-1.2.148.1-1.fc33.x86_64                                         
  wavpack-5.4.0-1.fc33.x86_64                                                   
  webrtc-audio-processing-0.3.1-5.fc33.x86_64                                   
  yajl-2.1.0-15.fc33.x86_64                                                     

Complete!
[#605735] 2021/10/11 11:02:06 Cloning repositories
Cloning into 'mediagoblin'...
+ cd mediagoblin
+ git checkout -q fe01dd00fbebbf46f8cab552b89c402124541cab
+ cd mediagoblin
+ git submodule update --init
Submodule 'extlib/pdf.js' (https://github.com/mozilla/pdf.js.git) registered for path 'extlib/pdf.js'
Submodule 'extlib/sandyseventiesspeedboat' (https://github.com/jpope777/sandyseventiesspeedboat-mg.git) registered for path 'extlib/sandyseventiesspeedboat'
Submodule 'extlib/skeleton' (https://github.com/dhg/Skeleton.git) registered for path 'extlib/skeleton'
Cloning into '/home/build/mediagoblin/extlib/pdf.js'...
Cloning into '/home/build/mediagoblin/extlib/sandyseventiesspeedboat'...
Cloning into '/home/build/mediagoblin/extlib/skeleton'...
Submodule path 'extlib/pdf.js': checked out '369b81b63f560b5d729da26752ca541503d81510'
Submodule path 'extlib/sandyseventiesspeedboat': checked out '8873d9b559a4c5b3bb90997227d5455f8730fd48'
Submodule path 'extlib/skeleton': checked out '7ab682091d1032035cfcb668e6bd4b465bfa4679'
[#605735] 2021/10/11 11:07:25 Running task core
[#605735] 2021/10/11 11:11:38 Build failed.
[#605735] 2021/10/11 11:11:38 The build environment will be kept alive for 10 minutes.
[#605735] 2021/10/11 11:11:38 To log in with SSH and examine it, use the following command:
[#605735] 2021/10/11 11:11:38 
[#605735] 2021/10/11 11:11:38 	ssh -t builds@azusa.runners.sr.ht connect 605735
[#605735] 2021/10/11 11:11:38 
[#605735] 2021/10/11 11:11:38 After logging in, the deadline is increased to your remaining build time.
[#605735] 2021/10/11 11:21:38 Deadline elapsed. Terminating build environment.
[#605735] 2021/10/11 11:21:38 Error: Running task on guest: exit status 1
core


1
2
3
4
5
6
7
8
9
10
11
12
13
14
15
16
17
18
19
20
21
22
23
24
25
26
27
28
29
30
31
32
33
34
35
36
37
38
39
40
41
42
43
44
45
46
47
48
49
50
51
52
53
54
55
56
57
58
59
60
61
62
63
64
65
66
67
68
69
70
71
72
73
74
75
76
77
78
79
80
81
82
83
84
85
86
87
88
89
90
91
92
93
94
95
96
97
98
99
100
101
102
103
104
105
106
107
108
109
110
111
112
113
114
115
116
117
118
119
120
121
122
123
124
125
126
127
128
129
130
131
132
133
134
135
136
137
138
139
140
141
142
143
144
145
146
147
148
149
150
151
152
153
154
155
156
157
158
159
160
161
162
163
164
165
166
167
168
169
170
171
172
173
174
175
176
177
178
179
180
181
182
183
184
185
186
187
188
189
190
191
192
193
194
195
196
197
198
199
200
201
202
203
204
205
206
207
208
209
210
211
212
213
214
215
216
217
218
219
220
221
222
223
224
225
226
227
228
229
230
231
232
233
234
235
236
237
238
239
240
241
242
243
244
245
246
247
248
249
250
251
252
253
254
255
256
257
258
259
260
261
262
263
264
265
266
267
268
269
270
271
272
273
274
275
276
277
278
279
280
281
282
283
284
285
286
287
288
289
290
291
292
293
294
295
296
297
298
299
300
301
302
303
304
305
306
307
308
309
310
311
312
313
314
315
316
317
318
319
320
321
322
323
324
325
326
327
328
329
330
331
332
333
334
335
336
337
338
339
340
341
342
343
344
345
346
347
348
349
350
351
352
353
354
355
356
357
358
359
360
361
362
363
364
365
366
367
368
369
370
371
372
373
374
375
376
377
378
379
380
381
382
383
384
385
386
387
388
389
390
391
392
393
394
395
396
397
398
399
400
401
402
403
404
405
406
407
408
409
410
411
412
413
414
415
416
417
418
419
420
421
422
423
424
425
426
427
428
429
430
431
432
433
434
435
436
437
438
439
440
441
442
443
444
445
446
447
448
449
450
451
452
453
454
455
456
457
458
459
460
461
462
463
464
465
466
467
468
469
470
471
472
473
474
475
476
477
478
479
480
481
482
483
484
485
486
487
488
489
490
491
492
493
494
495
496
497
498
499
500
501
502
503
504
505
506
507
508
509
510
511
512
513
514
515
516
517
518
519
520
521
522
523
524
525
526
527
528
529
530
531
532
533
534
535
536
537
538
539
540
541
542
543
544
545
546
547
548
549
550
551
552
553
554
555
556
557
558
559
560
561
562
563
564
565
566
567
568
569
570
571
572
573
574
575
576
577
578
579
580
581
582
583
584
585
586
587
588
589
590
591
592
593
594
595
596
597
598
599
600
601
602
603
604
605
606
607
608
609
610
611
612
613
614
615
616
617
618
619
620
621
622
623
624
625
626
627
628
629
630
631
632
633
634
635
636
637
638
639
640
641
642
643
644
645
646
647
648
649
650
651
652
653
654
655
656
657
658
659
660
661
662
663
664
665
666
667
668
669
670
671
672
673
674
675
676
677
678
679
680
681
682
683
684
685
686
687
688
689
690
691
692
693
694
695
696
697
698
699
700
701
702
703
704
705
706
707
708
709
710
711
712
713
714
715
716
717
718
719
720
721
722
723
724
725
726
727
728
729
730
731
732
733
734
735
736
737
738
739
740
741
742
743
744
745
746
747
748
749
750
751
752
753
754
755
756
757
758
759
760
761
762
763
764
765
766
767
768
769
770
771
772
773
774
775
776
777
778
779
780
781
782
783
784
785
786
787
788
789
790
791
792
793
794
795
796
797
798
799
800
801
802
803
804
805
806
807
808
809
810
811
812
813
814
815
816
817
818
819
820
821
822
823
824
825
826
827
828
829
830
831
832
833
834
835
836
837
838
839
840
841
842
843
844
845
846
847
848
849
850
851
852
853
854
855
856
857
858
859
860
861
862
863
864
865
866
867
868
869
870
871
872
873
874
875
876
877
878
879
880
881
882
883
884
885
886
887
888
889
890
891
892
893
894
895
896
897
898
899
900
901
902
903
904
905
906
907
908
909
910
911
912
913
914
915
916
917
918
919
920
921
922
923
924
925
926
927
928
929
930
931
932
933
934
935
936
937
938
939
940
941
942
943
944
945
946
947
948
949
950
951
952
953
954
955
956
957
958
959
960
961
962
963
964
965
966
967
968
969
970
971
972
973
974
975
976
977
978
979
980
981
982
983
984
985
986
987
988
989
990
991
992
993
994
995
996
997
998
999
1000
1001
1002
1003
1004
1005
1006
1007
1008
1009
1010
1011
1012
1013
1014
1015
1016
1017
1018
1019
1020
1021
1022
1023
1024
1025
1026
1027
1028
1029
1030
1031
1032
1033
1034
1035
1036
1037
1038
1039
1040
1041
1042
1043
1044
1045
1046
1047
1048
1049
1050
1051
1052
1053
1054
1055
1056
1057
1058
1059
1060
1061
1062
1063
1064
1065
1066
1067
1068
1069
1070
1071
1072
1073
1074
1075
1076
1077
1078
1079
1080
1081
1082
1083
1084
1085
1086
1087
1088
1089
1090
1091
1092
1093
1094
1095
1096
1097
1098
1099
1100
1101
1102
1103
1104
1105
1106
1107
1108
1109
1110
1111
1112
1113
1114
1115
1116
1117
1118
1119
1120
1121
1122
1123
1124
1125
1126
1127
1128
1129
1130
1131
1132
1133
1134
1135
1136
1137
1138
1139
1140
1141
1142
1143
1144
1145
1146
1147
1148
1149
1150
1151
1152
1153
1154
1155
1156
1157
1158
1159
1160
1161
1162
1163
1164
1165
1166
1167
1168
1169
1170
1171
1172
1173
1174
1175
1176
1177
1178
1179
1180
1181
1182
1183
1184
1185
1186
1187
1188
1189
1190
1191
1192
1193
1194
1195
1196
1197
1198
1199
1200
1201
1202
1203
1204
1205
1206
1207
1208
1209
1210
1211
1212
1213
1214
1215
1216
1217
1218
1219
1220
1221
1222
1223
1224
1225
1226
1227
1228
1229
1230
1231
1232
1233
1234
1235
1236
1237
1238
1239
1240
1241
1242
1243
1244
1245
1246
1247
1248
1249
1250
1251
1252
1253
1254
1255
1256
1257
1258
1259
1260
1261
1262
1263
1264
1265
1266
1267
1268
1269
1270
1271
1272
1273
1274
1275
1276
1277
1278
1279
1280
1281
1282
1283
1284
1285
1286
1287
1288
1289
1290
1291
1292
1293
1294
1295
1296
1297
1298
1299
1300
1301
1302
1303
1304
1305
1306
1307
1308
1309
1310
1311
1312
1313
1314
1315
1316
1317
1318
1319
1320
1321
1322
1323
1324
1325
1326
1327
1328
1329
1330
1331
1332
1333
1334
1335
1336
1337
1338
1339
1340
1341
1342
1343
1344
1345
1346
1347
1348
1349
1350
1351
1352
1353
1354
1355
1356
1357
1358
1359
1360
1361
1362
1363
1364
1365
1366
1367
1368
1369
1370
1371
1372
1373
1374
1375
1376
1377
1378
1379
1380
1381
1382
1383
1384
1385
1386
1387
1388
1389
1390
1391
1392
1393
1394
1395
1396
1397
1398
1399
1400
1401
1402
1403
1404
1405
1406
1407
1408
1409
1410
1411
1412
1413
1414
1415
1416
1417
1418
1419
1420
1421
1422
1423
1424
1425
1426
1427
1428
1429
1430
1431
1432
1433
1434
1435
1436
1437
1438
1439
1440
1441
1442
1443
1444
1445
1446
1447
1448
1449
1450
1451
1452
1453
1454
1455
1456
1457
1458
1459
1460
1461
1462
1463
1464
1465
1466
1467
1468
1469
1470
1471
1472
1473
1474
1475
1476
1477
1478
1479
1480
1481
1482
1483
1484
1485
1486
1487
1488
1489
1490
1491
1492
1493
1494
1495
1496
1497
1498
1499
1500
1501
1502
1503
1504
1505
1506
1507
1508
1509
1510
1511
1512
1513
1514
1515
1516
1517
1518
1519
1520
1521
1522
1523
1524
1525
1526
1527
1528
1529
1530
1531
1532
1533
1534
1535
1536
1537
1538
1539
1540
1541
1542
1543
1544
1545
1546
This is a big file! Only the last 128KiB is shown. Click here to download the full log.

    return self.app(environ, start_response)
  File "/home/build/mediagoblin/mediagoblin/app.py", line 278, in call_backend
    return self._finish_call_backend(request, environ, start_response)
  File "/home/build/mediagoblin/mediagoblin/app.py", line 320, in _finish_call_backend
    response = controller(request)
  File "/home/build/mediagoblin/mediagoblin/decorators.py", line 366, in wrapper
    return controller(request, *args, **kwargs)
  File "/home/build/mediagoblin/mediagoblin/auth/views.py", line 93, in login
    user = check_login_simple(
  File "/home/build/mediagoblin/mediagoblin/auth/tools.py", line 172, in check_login_simple
    if not auth.check_password(password, user.pw_hash):
  File "/home/build/mediagoblin/mediagoblin/auth/__init__.py", line 42, in check_password
    return hook_handle("auth_check_password",
  File "/home/build/mediagoblin/mediagoblin/tools/pluginapi.py", line 306, in hook_handle
    result = callable(*args, **kwargs)
  File "/home/build/mediagoblin/mediagoblin/plugins/basic_auth/__init__.py", line 91, in check_password
    return auth_tools.bcrypt_check_password(raw_pass,
  File "/home/build/mediagoblin/mediagoblin/plugins/basic_auth/tools.py", line 51, in bcrypt_check_password
    randplus_stored_hash = bcrypt.hashpw(stored_hash, rand_salt)
  File "/home/build/mediagoblin/lib/python3.9/site-packages/bcrypt-3.2.0-py3.9-linux-x86_64.egg/bcrypt/__init__.py", line 80, in hashpw
    raise TypeError("Unicode-objects must be encoded before hashing")
TypeError: Unicode-objects must be encoded before hashing
---------------------------- Captured stdout setup -----------------------------
Laying foundations for __main__:
   + Laying foundations for Privilege table
Laying foundations for __main__:
   + Laying foundations for Privilege table
---------------------------- Captured stderr setup -----------------------------
INFO  [alembic.runtime.migration] Context impl SQLiteImpl.
INFO  [alembic.runtime.migration] Will assume non-transactional DDL.
INFO  [alembic.runtime.migration] Running upgrade  -> 52bf0ccbedc1, initial revision
INFO  [alembic.runtime.migration] Running upgrade 52bf0ccbedc1 -> e9212d3a12d3, Audio media type initial migration
INFO  [alembic.runtime.migration] Running upgrade 52bf0ccbedc1 -> 101510e3a713, #5382 Removes graveyard items from collections
INFO  [alembic.runtime.migration] Running upgrade 101510e3a713 -> 8429e33fdf7, Remove the Graveyard objects from CommentNotification objects
INFO  [alembic.runtime.migration] Running upgrade 8429e33fdf7 -> 4066b9f8b84a, use_comment_link_ids_notifications
INFO  [alembic.runtime.migration] Running upgrade 4066b9f8b84a -> 3145accb8fe3, remove tombstone comment wrappers
INFO  [alembic.runtime.migration] Running upgrade 3145accb8fe3 -> 228916769bd2, ensure Report.object_id is nullable
INFO  [alembic.runtime.migration] Running upgrade 228916769bd2 -> afd3d1da5e29, Subtitle plugin initial migration
INFO  [alembic.runtime.migration] Running upgrade 228916769bd2 -> cc3651803714, add main transcoding progress column to MediaEntry
INFO  [alembic.runtime.migration] Context impl SQLiteImpl.
INFO  [alembic.runtime.migration] Will assume non-transactional DDL.
INFO  [alembic.runtime.migration] Running upgrade  -> 52bf0ccbedc1, initial revision
INFO  [alembic.runtime.migration] Running upgrade 52bf0ccbedc1 -> e9212d3a12d3, Audio media type initial migration
INFO  [alembic.runtime.migration] Running upgrade 52bf0ccbedc1 -> 101510e3a713, #5382 Removes graveyard items from collections
INFO  [alembic.runtime.migration] Running upgrade 101510e3a713 -> 8429e33fdf7, Remove the Graveyard objects from CommentNotification objects
INFO  [alembic.runtime.migration] Running upgrade 8429e33fdf7 -> 4066b9f8b84a, use_comment_link_ids_notifications
INFO  [alembic.runtime.migration] Running upgrade 4066b9f8b84a -> 3145accb8fe3, remove tombstone comment wrappers
INFO  [alembic.runtime.migration] Running upgrade 3145accb8fe3 -> 228916769bd2, ensure Report.object_id is nullable
INFO  [alembic.runtime.migration] Running upgrade 228916769bd2 -> afd3d1da5e29, Subtitle plugin initial migration
INFO  [alembic.runtime.migration] Running upgrade 228916769bd2 -> cc3651803714, add main transcoding progress column to MediaEntry
_______ ERROR at setup of TestSubmissionAudioVideo.test_audio_and_video ________
Traceback (most recent call last):
  File "/home/build/mediagoblin/mediagoblin/tests/test_submission.py", line 749, in setup
    self.login()
  File "/home/build/mediagoblin/mediagoblin/tests/test_submission.py", line 137, in login
    self.test_app.post(
  File "/usr/lib/python3.9/site-packages/webtest/app.py", line 368, in post
    return self._gen_request('POST', url, params=params, headers=headers,
  File "/usr/lib/python3.9/site-packages/webtest/app.py", line 749, in _gen_request
    return self.do_request(req, status=status,
  File "/usr/lib/python3.9/site-packages/webtest/app.py", line 620, in do_request
    res = req.get_response(app, catch_exc_info=True)
  File "/usr/lib/python3.9/site-packages/webob/request.py", line 1309, in send
    status, headers, app_iter, exc_info = self.call_application(
  File "/usr/lib/python3.9/site-packages/webob/request.py", line 1278, in call_application
    app_iter = application(self.environ, start_response)
  File "/usr/lib/python3.9/site-packages/webtest/lint.py", line 196, in lint_app
    iterator = application(environ, start_response_wrapper)
  File "/home/build/mediagoblin/mediagoblin/app.py", line 344, in __call__
    return self.call_backend(environ, start_response)
  File "/home/build/mediagoblin/lib/python3.9/site-packages/Werkzeug-1.0.1-py3.9.egg/werkzeug/middleware/shared_data.py", line 260, in __call__
    return self.app(environ, start_response)
  File "/home/build/mediagoblin/mediagoblin/app.py", line 278, in call_backend
    return self._finish_call_backend(request, environ, start_response)
  File "/home/build/mediagoblin/mediagoblin/app.py", line 320, in _finish_call_backend
    response = controller(request)
  File "/home/build/mediagoblin/mediagoblin/decorators.py", line 366, in wrapper
    return controller(request, *args, **kwargs)
  File "/home/build/mediagoblin/mediagoblin/auth/views.py", line 93, in login
    user = check_login_simple(
  File "/home/build/mediagoblin/mediagoblin/auth/tools.py", line 172, in check_login_simple
    if not auth.check_password(password, user.pw_hash):
  File "/home/build/mediagoblin/mediagoblin/auth/__init__.py", line 42, in check_password
    return hook_handle("auth_check_password",
  File "/home/build/mediagoblin/mediagoblin/tools/pluginapi.py", line 306, in hook_handle
    result = callable(*args, **kwargs)
  File "/home/build/mediagoblin/mediagoblin/plugins/basic_auth/__init__.py", line 91, in check_password
    return auth_tools.bcrypt_check_password(raw_pass,
  File "/home/build/mediagoblin/mediagoblin/plugins/basic_auth/tools.py", line 51, in bcrypt_check_password
    randplus_stored_hash = bcrypt.hashpw(stored_hash, rand_salt)
  File "/home/build/mediagoblin/lib/python3.9/site-packages/bcrypt-3.2.0-py3.9-linux-x86_64.egg/bcrypt/__init__.py", line 80, in hashpw
    raise TypeError("Unicode-objects must be encoded before hashing")
TypeError: Unicode-objects must be encoded before hashing
---------------------------- Captured stdout setup -----------------------------
Laying foundations for __main__:
   + Laying foundations for Privilege table
Laying foundations for __main__:
   + Laying foundations for Privilege table
---------------------------- Captured stderr setup -----------------------------
INFO  [alembic.runtime.migration] Context impl SQLiteImpl.
INFO  [alembic.runtime.migration] Will assume non-transactional DDL.
INFO  [alembic.runtime.migration] Running upgrade  -> 52bf0ccbedc1, initial revision
INFO  [alembic.runtime.migration] Running upgrade 52bf0ccbedc1 -> 38feb829c545, Video media type initial migration
INFO  [alembic.runtime.migration] Running upgrade 52bf0ccbedc1 -> e9212d3a12d3, Audio media type initial migration
INFO  [alembic.runtime.migration] Running upgrade 52bf0ccbedc1 -> 101510e3a713, #5382 Removes graveyard items from collections
INFO  [alembic.runtime.migration] Running upgrade 101510e3a713 -> 8429e33fdf7, Remove the Graveyard objects from CommentNotification objects
INFO  [alembic.runtime.migration] Running upgrade 8429e33fdf7 -> 4066b9f8b84a, use_comment_link_ids_notifications
INFO  [alembic.runtime.migration] Running upgrade 4066b9f8b84a -> 3145accb8fe3, remove tombstone comment wrappers
INFO  [alembic.runtime.migration] Running upgrade 3145accb8fe3 -> 228916769bd2, ensure Report.object_id is nullable
INFO  [alembic.runtime.migration] Running upgrade 228916769bd2 -> afd3d1da5e29, Subtitle plugin initial migration
INFO  [alembic.runtime.migration] Running upgrade 228916769bd2 -> cc3651803714, add main transcoding progress column to MediaEntry
INFO  [alembic.runtime.migration] Context impl SQLiteImpl.
INFO  [alembic.runtime.migration] Will assume non-transactional DDL.
INFO  [alembic.runtime.migration] Running upgrade  -> 52bf0ccbedc1, initial revision
INFO  [alembic.runtime.migration] Running upgrade 52bf0ccbedc1 -> 38feb829c545, Video media type initial migration
INFO  [alembic.runtime.migration] Running upgrade 52bf0ccbedc1 -> e9212d3a12d3, Audio media type initial migration
INFO  [alembic.runtime.migration] Running upgrade 52bf0ccbedc1 -> 101510e3a713, #5382 Removes graveyard items from collections
INFO  [alembic.runtime.migration] Running upgrade 101510e3a713 -> 8429e33fdf7, Remove the Graveyard objects from CommentNotification objects
INFO  [alembic.runtime.migration] Running upgrade 8429e33fdf7 -> 4066b9f8b84a, use_comment_link_ids_notifications
INFO  [alembic.runtime.migration] Running upgrade 4066b9f8b84a -> 3145accb8fe3, remove tombstone comment wrappers
INFO  [alembic.runtime.migration] Running upgrade 3145accb8fe3 -> 228916769bd2, ensure Report.object_id is nullable
INFO  [alembic.runtime.migration] Running upgrade 228916769bd2 -> afd3d1da5e29, Subtitle plugin initial migration
INFO  [alembic.runtime.migration] Running upgrade 228916769bd2 -> cc3651803714, add main transcoding progress column to MediaEntry
=================================== FAILURES ===================================
_____________________________ test_register_views ______________________________
Traceback (most recent call last):
  File "/home/build/mediagoblin/mediagoblin/tests/test_auth.py", line 248, in test_register_views
    response = test_app.post(
  File "/usr/lib/python3.9/site-packages/webtest/app.py", line 368, in post
    return self._gen_request('POST', url, params=params, headers=headers,
  File "/usr/lib/python3.9/site-packages/webtest/app.py", line 749, in _gen_request
    return self.do_request(req, status=status,
  File "/usr/lib/python3.9/site-packages/webtest/app.py", line 620, in do_request
    res = req.get_response(app, catch_exc_info=True)
  File "/usr/lib/python3.9/site-packages/webob/request.py", line 1309, in send
    status, headers, app_iter, exc_info = self.call_application(
  File "/usr/lib/python3.9/site-packages/webob/request.py", line 1278, in call_application
    app_iter = application(self.environ, start_response)
  File "/usr/lib/python3.9/site-packages/webtest/lint.py", line 196, in lint_app
    iterator = application(environ, start_response_wrapper)
  File "/home/build/mediagoblin/mediagoblin/app.py", line 344, in __call__
    return self.call_backend(environ, start_response)
  File "/home/build/mediagoblin/lib/python3.9/site-packages/Werkzeug-1.0.1-py3.9.egg/werkzeug/middleware/shared_data.py", line 260, in __call__
    return self.app(environ, start_response)
  File "/home/build/mediagoblin/mediagoblin/app.py", line 278, in call_backend
    return self._finish_call_backend(request, environ, start_response)
  File "/home/build/mediagoblin/mediagoblin/app.py", line 320, in _finish_call_backend
    response = controller(request)
  File "/home/build/mediagoblin/mediagoblin/decorators.py", line 366, in wrapper
    return controller(request, *args, **kwargs)
  File "/home/build/mediagoblin/mediagoblin/auth/views.py", line 93, in login
    user = check_login_simple(
  File "/home/build/mediagoblin/mediagoblin/auth/tools.py", line 172, in check_login_simple
    if not auth.check_password(password, user.pw_hash):
  File "/home/build/mediagoblin/mediagoblin/auth/__init__.py", line 42, in check_password
    return hook_handle("auth_check_password",
  File "/home/build/mediagoblin/mediagoblin/tools/pluginapi.py", line 306, in hook_handle
    result = callable(*args, **kwargs)
  File "/home/build/mediagoblin/mediagoblin/plugins/basic_auth/__init__.py", line 91, in check_password
    return auth_tools.bcrypt_check_password(raw_pass,
  File "/home/build/mediagoblin/mediagoblin/plugins/basic_auth/tools.py", line 51, in bcrypt_check_password
    randplus_stored_hash = bcrypt.hashpw(stored_hash, rand_salt)
  File "/home/build/mediagoblin/lib/python3.9/site-packages/bcrypt-3.2.0-py3.9-linux-x86_64.egg/bcrypt/__init__.py", line 80, in hashpw
    raise TypeError("Unicode-objects must be encoded before hashing")
TypeError: Unicode-objects must be encoded before hashing
---------------------------- Captured stdout setup -----------------------------
Laying foundations for __main__:
   + Laying foundations for Privilege table
Laying foundations for __main__:
   + Laying foundations for Privilege table
---------------------------- Captured stderr setup -----------------------------
INFO  [alembic.runtime.migration] Context impl SQLiteImpl.
INFO  [alembic.runtime.migration] Will assume non-transactional DDL.
INFO  [alembic.runtime.migration] Running upgrade  -> 52bf0ccbedc1, initial revision
INFO  [alembic.runtime.migration] Running upgrade 52bf0ccbedc1 -> a98c1a320e88, Image media type initial migration
INFO  [alembic.runtime.migration] Running upgrade 52bf0ccbedc1 -> 071abb33d1da, OpenID plugin initial migration
INFO  [alembic.runtime.migration] Running upgrade 52bf0ccbedc1 -> 101510e3a713, #5382 Removes graveyard items from collections
INFO  [alembic.runtime.migration] Running upgrade 101510e3a713 -> 8429e33fdf7, Remove the Graveyard objects from CommentNotification objects
INFO  [alembic.runtime.migration] Running upgrade 8429e33fdf7 -> 4066b9f8b84a, use_comment_link_ids_notifications
INFO  [alembic.runtime.migration] Running upgrade 4066b9f8b84a -> 3145accb8fe3, remove tombstone comment wrappers
INFO  [alembic.runtime.migration] Running upgrade 3145accb8fe3 -> 228916769bd2, ensure Report.object_id is nullable
INFO  [alembic.runtime.migration] Running upgrade 228916769bd2 -> afd3d1da5e29, Subtitle plugin initial migration
INFO  [alembic.runtime.migration] Running upgrade 228916769bd2 -> cc3651803714, add main transcoding progress column to MediaEntry
INFO  [alembic.runtime.migration] Context impl SQLiteImpl.
INFO  [alembic.runtime.migration] Will assume non-transactional DDL.
INFO  [alembic.runtime.migration] Running upgrade  -> 52bf0ccbedc1, initial revision
INFO  [alembic.runtime.migration] Running upgrade 52bf0ccbedc1 -> a98c1a320e88, Image media type initial migration
INFO  [alembic.runtime.migration] Running upgrade 52bf0ccbedc1 -> 071abb33d1da, OpenID plugin initial migration
INFO  [alembic.runtime.migration] Running upgrade 52bf0ccbedc1 -> 101510e3a713, #5382 Removes graveyard items from collections
INFO  [alembic.runtime.migration] Running upgrade 101510e3a713 -> 8429e33fdf7, Remove the Graveyard objects from CommentNotification objects
INFO  [alembic.runtime.migration] Running upgrade 8429e33fdf7 -> 4066b9f8b84a, use_comment_link_ids_notifications
INFO  [alembic.runtime.migration] Running upgrade 4066b9f8b84a -> 3145accb8fe3, remove tombstone comment wrappers
INFO  [alembic.runtime.migration] Running upgrade 3145accb8fe3 -> 228916769bd2, ensure Report.object_id is nullable
INFO  [alembic.runtime.migration] Running upgrade 228916769bd2 -> afd3d1da5e29, Subtitle plugin initial migration
INFO  [alembic.runtime.migration] Running upgrade 228916769bd2 -> cc3651803714, add main transcoding progress column to MediaEntry
__________________________ test_authentication_views ___________________________
Traceback (most recent call last):
  File "/home/build/mediagoblin/mediagoblin/tests/test_auth.py", line 292, in test_authentication_views
    response = test_app.post(
  File "/usr/lib/python3.9/site-packages/webtest/app.py", line 368, in post
    return self._gen_request('POST', url, params=params, headers=headers,
  File "/usr/lib/python3.9/site-packages/webtest/app.py", line 749, in _gen_request
    return self.do_request(req, status=status,
  File "/usr/lib/python3.9/site-packages/webtest/app.py", line 620, in do_request
    res = req.get_response(app, catch_exc_info=True)
  File "/usr/lib/python3.9/site-packages/webob/request.py", line 1309, in send
    status, headers, app_iter, exc_info = self.call_application(
  File "/usr/lib/python3.9/site-packages/webob/request.py", line 1278, in call_application
    app_iter = application(self.environ, start_response)
  File "/usr/lib/python3.9/site-packages/webtest/lint.py", line 196, in lint_app
    iterator = application(environ, start_response_wrapper)
  File "/home/build/mediagoblin/mediagoblin/app.py", line 344, in __call__
    return self.call_backend(environ, start_response)
  File "/home/build/mediagoblin/lib/python3.9/site-packages/Werkzeug-1.0.1-py3.9.egg/werkzeug/middleware/shared_data.py", line 260, in __call__
    return self.app(environ, start_response)
  File "/home/build/mediagoblin/mediagoblin/app.py", line 278, in call_backend
    return self._finish_call_backend(request, environ, start_response)
  File "/home/build/mediagoblin/mediagoblin/app.py", line 320, in _finish_call_backend
    response = controller(request)
  File "/home/build/mediagoblin/mediagoblin/decorators.py", line 366, in wrapper
    return controller(request, *args, **kwargs)
  File "/home/build/mediagoblin/mediagoblin/auth/views.py", line 93, in login
    user = check_login_simple(
  File "/home/build/mediagoblin/mediagoblin/auth/tools.py", line 172, in check_login_simple
    if not auth.check_password(password, user.pw_hash):
  File "/home/build/mediagoblin/mediagoblin/auth/__init__.py", line 42, in check_password
    return hook_handle("auth_check_password",
  File "/home/build/mediagoblin/mediagoblin/tools/pluginapi.py", line 306, in hook_handle
    result = callable(*args, **kwargs)
  File "/home/build/mediagoblin/mediagoblin/plugins/basic_auth/__init__.py", line 91, in check_password
    return auth_tools.bcrypt_check_password(raw_pass,
  File "/home/build/mediagoblin/mediagoblin/plugins/basic_auth/tools.py", line 51, in bcrypt_check_password
    randplus_stored_hash = bcrypt.hashpw(stored_hash, rand_salt)
  File "/home/build/mediagoblin/lib/python3.9/site-packages/bcrypt-3.2.0-py3.9-linux-x86_64.egg/bcrypt/__init__.py", line 80, in hashpw
    raise TypeError("Unicode-objects must be encoded before hashing")
TypeError: Unicode-objects must be encoded before hashing
---------------------------- Captured stdout setup -----------------------------
Laying foundations for __main__:
   + Laying foundations for Privilege table
Laying foundations for __main__:
   + Laying foundations for Privilege table
---------------------------- Captured stderr setup -----------------------------
INFO  [alembic.runtime.migration] Context impl SQLiteImpl.
INFO  [alembic.runtime.migration] Will assume non-transactional DDL.
INFO  [alembic.runtime.migration] Running upgrade  -> 52bf0ccbedc1, initial revision
INFO  [alembic.runtime.migration] Running upgrade 52bf0ccbedc1 -> a98c1a320e88, Image media type initial migration
INFO  [alembic.runtime.migration] Running upgrade 52bf0ccbedc1 -> 071abb33d1da, OpenID plugin initial migration
INFO  [alembic.runtime.migration] Running upgrade 52bf0ccbedc1 -> 101510e3a713, #5382 Removes graveyard items from collections
INFO  [alembic.runtime.migration] Running upgrade 101510e3a713 -> 8429e33fdf7, Remove the Graveyard objects from CommentNotification objects
INFO  [alembic.runtime.migration] Running upgrade 8429e33fdf7 -> 4066b9f8b84a, use_comment_link_ids_notifications
INFO  [alembic.runtime.migration] Running upgrade 4066b9f8b84a -> 3145accb8fe3, remove tombstone comment wrappers
INFO  [alembic.runtime.migration] Running upgrade 3145accb8fe3 -> 228916769bd2, ensure Report.object_id is nullable
INFO  [alembic.runtime.migration] Running upgrade 228916769bd2 -> afd3d1da5e29, Subtitle plugin initial migration
INFO  [alembic.runtime.migration] Running upgrade 228916769bd2 -> cc3651803714, add main transcoding progress column to MediaEntry
INFO  [alembic.runtime.migration] Context impl SQLiteImpl.
INFO  [alembic.runtime.migration] Will assume non-transactional DDL.
INFO  [alembic.runtime.migration] Running upgrade  -> 52bf0ccbedc1, initial revision
INFO  [alembic.runtime.migration] Running upgrade 52bf0ccbedc1 -> a98c1a320e88, Image media type initial migration
INFO  [alembic.runtime.migration] Running upgrade 52bf0ccbedc1 -> 071abb33d1da, OpenID plugin initial migration
INFO  [alembic.runtime.migration] Running upgrade 52bf0ccbedc1 -> 101510e3a713, #5382 Removes graveyard items from collections
INFO  [alembic.runtime.migration] Running upgrade 101510e3a713 -> 8429e33fdf7, Remove the Graveyard objects from CommentNotification objects
INFO  [alembic.runtime.migration] Running upgrade 8429e33fdf7 -> 4066b9f8b84a, use_comment_link_ids_notifications
INFO  [alembic.runtime.migration] Running upgrade 4066b9f8b84a -> 3145accb8fe3, remove tombstone comment wrappers
INFO  [alembic.runtime.migration] Running upgrade 3145accb8fe3 -> 228916769bd2, ensure Report.object_id is nullable
INFO  [alembic.runtime.migration] Running upgrade 228916769bd2 -> afd3d1da5e29, Subtitle plugin initial migration
INFO  [alembic.runtime.migration] Running upgrade 228916769bd2 -> cc3651803714, add main transcoding progress column to MediaEntry
__________________________ test_bcrypt_check_password __________________________
Traceback (most recent call last):
  File "/home/build/mediagoblin/mediagoblin/tests/test_basic_auth.py", line 35, in test_bcrypt_check_password
    assert auth_tools.bcrypt_check_password(
  File "/home/build/mediagoblin/mediagoblin/plugins/basic_auth/tools.py", line 51, in bcrypt_check_password
    randplus_stored_hash = bcrypt.hashpw(stored_hash, rand_salt)
  File "/home/build/mediagoblin/lib/python3.9/site-packages/bcrypt-3.2.0-py3.9-linux-x86_64.egg/bcrypt/__init__.py", line 80, in hashpw
    raise TypeError("Unicode-objects must be encoded before hashing")
TypeError: Unicode-objects must be encoded before hashing
________________________ test_bcrypt_gen_password_hash _________________________
Traceback (most recent call last):
  File "/home/build/mediagoblin/mediagoblin/tests/test_basic_auth.py", line 55, in test_bcrypt_gen_password_hash
    assert auth_tools.bcrypt_check_password(
  File "/home/build/mediagoblin/mediagoblin/plugins/basic_auth/tools.py", line 51, in bcrypt_check_password
    randplus_stored_hash = bcrypt.hashpw(stored_hash, rand_salt)
  File "/home/build/mediagoblin/lib/python3.9/site-packages/bcrypt-3.2.0-py3.9-linux-x86_64.egg/bcrypt/__init__.py", line 80, in hashpw
    raise TypeError("Unicode-objects must be encoded before hashing")
TypeError: Unicode-objects must be encoded before hashing
_____________________________ test_change_password _____________________________
Traceback (most recent call last):
  File "/home/build/mediagoblin/mediagoblin/tests/test_basic_auth.py", line 74, in test_change_password
    test_app.post(
  File "/usr/lib/python3.9/site-packages/webtest/app.py", line 368, in post
    return self._gen_request('POST', url, params=params, headers=headers,
  File "/usr/lib/python3.9/site-packages/webtest/app.py", line 749, in _gen_request
    return self.do_request(req, status=status,
  File "/usr/lib/python3.9/site-packages/webtest/app.py", line 620, in do_request
    res = req.get_response(app, catch_exc_info=True)
  File "/usr/lib/python3.9/site-packages/webob/request.py", line 1309, in send
    status, headers, app_iter, exc_info = self.call_application(
  File "/usr/lib/python3.9/site-packages/webob/request.py", line 1278, in call_application
    app_iter = application(self.environ, start_response)
  File "/usr/lib/python3.9/site-packages/webtest/lint.py", line 196, in lint_app
    iterator = application(environ, start_response_wrapper)
  File "/home/build/mediagoblin/mediagoblin/app.py", line 344, in __call__
    return self.call_backend(environ, start_response)
  File "/home/build/mediagoblin/lib/python3.9/site-packages/Werkzeug-1.0.1-py3.9.egg/werkzeug/middleware/shared_data.py", line 260, in __call__
    return self.app(environ, start_response)
  File "/home/build/mediagoblin/mediagoblin/app.py", line 278, in call_backend
    return self._finish_call_backend(request, environ, start_response)
  File "/home/build/mediagoblin/mediagoblin/app.py", line 320, in _finish_call_backend
    response = controller(request)
  File "/home/build/mediagoblin/mediagoblin/decorators.py", line 366, in wrapper
    return controller(request, *args, **kwargs)
  File "/home/build/mediagoblin/mediagoblin/auth/views.py", line 93, in login
    user = check_login_simple(
  File "/home/build/mediagoblin/mediagoblin/auth/tools.py", line 172, in check_login_simple
    if not auth.check_password(password, user.pw_hash):
  File "/home/build/mediagoblin/mediagoblin/auth/__init__.py", line 42, in check_password
    return hook_handle("auth_check_password",
  File "/home/build/mediagoblin/mediagoblin/tools/pluginapi.py", line 306, in hook_handle
    result = callable(*args, **kwargs)
  File "/home/build/mediagoblin/mediagoblin/plugins/basic_auth/__init__.py", line 91, in check_password
    return auth_tools.bcrypt_check_password(raw_pass,
  File "/home/build/mediagoblin/mediagoblin/plugins/basic_auth/tools.py", line 51, in bcrypt_check_password
    randplus_stored_hash = bcrypt.hashpw(stored_hash, rand_salt)
  File "/home/build/mediagoblin/lib/python3.9/site-packages/bcrypt-3.2.0-py3.9-linux-x86_64.egg/bcrypt/__init__.py", line 80, in hashpw
    raise TypeError("Unicode-objects must be encoded before hashing")
TypeError: Unicode-objects must be encoded before hashing
---------------------------- Captured stdout setup -----------------------------
Laying foundations for __main__:
   + Laying foundations for Privilege table
Laying foundations for __main__:
   + Laying foundations for Privilege table
---------------------------- Captured stderr setup -----------------------------
INFO  [alembic.runtime.migration] Context impl SQLiteImpl.
INFO  [alembic.runtime.migration] Will assume non-transactional DDL.
INFO  [alembic.runtime.migration] Running upgrade  -> 52bf0ccbedc1, initial revision
INFO  [alembic.runtime.migration] Running upgrade 52bf0ccbedc1 -> a98c1a320e88, Image media type initial migration
INFO  [alembic.runtime.migration] Running upgrade 52bf0ccbedc1 -> 071abb33d1da, OpenID plugin initial migration
INFO  [alembic.runtime.migration] Running upgrade 52bf0ccbedc1 -> 101510e3a713, #5382 Removes graveyard items from collections
INFO  [alembic.runtime.migration] Running upgrade 101510e3a713 -> 8429e33fdf7, Remove the Graveyard objects from CommentNotification objects
INFO  [alembic.runtime.migration] Running upgrade 8429e33fdf7 -> 4066b9f8b84a, use_comment_link_ids_notifications
INFO  [alembic.runtime.migration] Running upgrade 4066b9f8b84a -> 3145accb8fe3, remove tombstone comment wrappers
INFO  [alembic.runtime.migration] Running upgrade 3145accb8fe3 -> 228916769bd2, ensure Report.object_id is nullable
INFO  [alembic.runtime.migration] Running upgrade 228916769bd2 -> afd3d1da5e29, Subtitle plugin initial migration
INFO  [alembic.runtime.migration] Running upgrade 228916769bd2 -> cc3651803714, add main transcoding progress column to MediaEntry
INFO  [alembic.runtime.migration] Context impl SQLiteImpl.
INFO  [alembic.runtime.migration] Will assume non-transactional DDL.
INFO  [alembic.runtime.migration] Running upgrade  -> 52bf0ccbedc1, initial revision
INFO  [alembic.runtime.migration] Running upgrade 52bf0ccbedc1 -> a98c1a320e88, Image media type initial migration
INFO  [alembic.runtime.migration] Running upgrade 52bf0ccbedc1 -> 071abb33d1da, OpenID plugin initial migration
INFO  [alembic.runtime.migration] Running upgrade 52bf0ccbedc1 -> 101510e3a713, #5382 Removes graveyard items from collections
INFO  [alembic.runtime.migration] Running upgrade 101510e3a713 -> 8429e33fdf7, Remove the Graveyard objects from CommentNotification objects
INFO  [alembic.runtime.migration] Running upgrade 8429e33fdf7 -> 4066b9f8b84a, use_comment_link_ids_notifications
INFO  [alembic.runtime.migration] Running upgrade 4066b9f8b84a -> 3145accb8fe3, remove tombstone comment wrappers
INFO  [alembic.runtime.migration] Running upgrade 3145accb8fe3 -> 228916769bd2, ensure Report.object_id is nullable
INFO  [alembic.runtime.migration] Running upgrade 228916769bd2 -> afd3d1da5e29, Subtitle plugin initial migration
INFO  [alembic.runtime.migration] Running upgrade 228916769bd2 -> cc3651803714, add main transcoding progress column to MediaEntry
_______________________ TestUserEdit.test_user_deletion ________________________
Traceback (most recent call last):
  File "/home/build/mediagoblin/mediagoblin/tests/test_edit.py", line 43, in test_user_deletion
    self.login(test_app)
  File "/home/build/mediagoblin/mediagoblin/tests/test_edit.py", line 35, in login
    test_app.post(
  File "/usr/lib/python3.9/site-packages/webtest/app.py", line 368, in post
    return self._gen_request('POST', url, params=params, headers=headers,
  File "/usr/lib/python3.9/site-packages/webtest/app.py", line 749, in _gen_request
    return self.do_request(req, status=status,
  File "/usr/lib/python3.9/site-packages/webtest/app.py", line 620, in do_request
    res = req.get_response(app, catch_exc_info=True)
  File "/usr/lib/python3.9/site-packages/webob/request.py", line 1309, in send
    status, headers, app_iter, exc_info = self.call_application(
  File "/usr/lib/python3.9/site-packages/webob/request.py", line 1278, in call_application
    app_iter = application(self.environ, start_response)
  File "/usr/lib/python3.9/site-packages/webtest/lint.py", line 196, in lint_app
    iterator = application(environ, start_response_wrapper)
  File "/home/build/mediagoblin/mediagoblin/app.py", line 344, in __call__
    return self.call_backend(environ, start_response)
  File "/home/build/mediagoblin/lib/python3.9/site-packages/Werkzeug-1.0.1-py3.9.egg/werkzeug/middleware/shared_data.py", line 260, in __call__
    return self.app(environ, start_response)
  File "/home/build/mediagoblin/mediagoblin/app.py", line 278, in call_backend
    return self._finish_call_backend(request, environ, start_response)
  File "/home/build/mediagoblin/mediagoblin/app.py", line 320, in _finish_call_backend
    response = controller(request)
  File "/home/build/mediagoblin/mediagoblin/decorators.py", line 366, in wrapper
    return controller(request, *args, **kwargs)
  File "/home/build/mediagoblin/mediagoblin/auth/views.py", line 93, in login
    user = check_login_simple(
  File "/home/build/mediagoblin/mediagoblin/auth/tools.py", line 172, in check_login_simple
    if not auth.check_password(password, user.pw_hash):
  File "/home/build/mediagoblin/mediagoblin/auth/__init__.py", line 42, in check_password
    return hook_handle("auth_check_password",
  File "/home/build/mediagoblin/mediagoblin/tools/pluginapi.py", line 306, in hook_handle
    result = callable(*args, **kwargs)
  File "/home/build/mediagoblin/mediagoblin/plugins/basic_auth/__init__.py", line 91, in check_password
    return auth_tools.bcrypt_check_password(raw_pass,
  File "/home/build/mediagoblin/mediagoblin/plugins/basic_auth/tools.py", line 51, in bcrypt_check_password
    randplus_stored_hash = bcrypt.hashpw(stored_hash, rand_salt)
  File "/home/build/mediagoblin/lib/python3.9/site-packages/bcrypt-3.2.0-py3.9-linux-x86_64.egg/bcrypt/__init__.py", line 80, in hashpw
    raise TypeError("Unicode-objects must be encoded before hashing")
TypeError: Unicode-objects must be encoded before hashing
---------------------------- Captured stdout setup -----------------------------
Laying foundations for __main__:
   + Laying foundations for Privilege table
Laying foundations for __main__:
   + Laying foundations for Privilege table
---------------------------- Captured stderr setup -----------------------------
INFO  [alembic.runtime.migration] Context impl SQLiteImpl.
INFO  [alembic.runtime.migration] Will assume non-transactional DDL.
INFO  [alembic.runtime.migration] Running upgrade  -> 52bf0ccbedc1, initial revision
INFO  [alembic.runtime.migration] Running upgrade 52bf0ccbedc1 -> a98c1a320e88, Image media type initial migration
INFO  [alembic.runtime.migration] Running upgrade 52bf0ccbedc1 -> 071abb33d1da, OpenID plugin initial migration
INFO  [alembic.runtime.migration] Running upgrade 52bf0ccbedc1 -> 101510e3a713, #5382 Removes graveyard items from collections
INFO  [alembic.runtime.migration] Running upgrade 101510e3a713 -> 8429e33fdf7, Remove the Graveyard objects from CommentNotification objects
INFO  [alembic.runtime.migration] Running upgrade 8429e33fdf7 -> 4066b9f8b84a, use_comment_link_ids_notifications
INFO  [alembic.runtime.migration] Running upgrade 4066b9f8b84a -> 3145accb8fe3, remove tombstone comment wrappers
INFO  [alembic.runtime.migration] Running upgrade 3145accb8fe3 -> 228916769bd2, ensure Report.object_id is nullable
INFO  [alembic.runtime.migration] Running upgrade 228916769bd2 -> afd3d1da5e29, Subtitle plugin initial migration
INFO  [alembic.runtime.migration] Running upgrade 228916769bd2 -> cc3651803714, add main transcoding progress column to MediaEntry
INFO  [alembic.runtime.migration] Context impl SQLiteImpl.
INFO  [alembic.runtime.migration] Will assume non-transactional DDL.
INFO  [alembic.runtime.migration] Running upgrade  -> 52bf0ccbedc1, initial revision
INFO  [alembic.runtime.migration] Running upgrade 52bf0ccbedc1 -> a98c1a320e88, Image media type initial migration
INFO  [alembic.runtime.migration] Running upgrade 52bf0ccbedc1 -> 071abb33d1da, OpenID plugin initial migration
INFO  [alembic.runtime.migration] Running upgrade 52bf0ccbedc1 -> 101510e3a713, #5382 Removes graveyard items from collections
INFO  [alembic.runtime.migration] Running upgrade 101510e3a713 -> 8429e33fdf7, Remove the Graveyard objects from CommentNotification objects
INFO  [alembic.runtime.migration] Running upgrade 8429e33fdf7 -> 4066b9f8b84a, use_comment_link_ids_notifications
INFO  [alembic.runtime.migration] Running upgrade 4066b9f8b84a -> 3145accb8fe3, remove tombstone comment wrappers
INFO  [alembic.runtime.migration] Running upgrade 3145accb8fe3 -> 228916769bd2, ensure Report.object_id is nullable
INFO  [alembic.runtime.migration] Running upgrade 228916769bd2 -> afd3d1da5e29, Subtitle plugin initial migration
INFO  [alembic.runtime.migration] Running upgrade 228916769bd2 -> cc3651803714, add main transcoding progress column to MediaEntry
_______________________ TestUserEdit.test_change_bio_url _______________________
Traceback (most recent call last):
  File "/home/build/mediagoblin/mediagoblin/tests/test_edit.py", line 64, in test_change_bio_url
    self.login(test_app)
  File "/home/build/mediagoblin/mediagoblin/tests/test_edit.py", line 35, in login
    test_app.post(
  File "/usr/lib/python3.9/site-packages/webtest/app.py", line 368, in post
    return self._gen_request('POST', url, params=params, headers=headers,
  File "/usr/lib/python3.9/site-packages/webtest/app.py", line 749, in _gen_request
    return self.do_request(req, status=status,
  File "/usr/lib/python3.9/site-packages/webtest/app.py", line 620, in do_request
    res = req.get_response(app, catch_exc_info=True)
  File "/usr/lib/python3.9/site-packages/webob/request.py", line 1309, in send
    status, headers, app_iter, exc_info = self.call_application(
  File "/usr/lib/python3.9/site-packages/webob/request.py", line 1278, in call_application
    app_iter = application(self.environ, start_response)
  File "/usr/lib/python3.9/site-packages/webtest/lint.py", line 196, in lint_app
    iterator = application(environ, start_response_wrapper)
  File "/home/build/mediagoblin/mediagoblin/app.py", line 344, in __call__
    return self.call_backend(environ, start_response)
  File "/home/build/mediagoblin/lib/python3.9/site-packages/Werkzeug-1.0.1-py3.9.egg/werkzeug/middleware/shared_data.py", line 260, in __call__
    return self.app(environ, start_response)
  File "/home/build/mediagoblin/mediagoblin/app.py", line 278, in call_backend
    return self._finish_call_backend(request, environ, start_response)
  File "/home/build/mediagoblin/mediagoblin/app.py", line 320, in _finish_call_backend
    response = controller(request)
  File "/home/build/mediagoblin/mediagoblin/decorators.py", line 366, in wrapper
    return controller(request, *args, **kwargs)
  File "/home/build/mediagoblin/mediagoblin/auth/views.py", line 93, in login
    user = check_login_simple(
  File "/home/build/mediagoblin/mediagoblin/auth/tools.py", line 172, in check_login_simple
    if not auth.check_password(password, user.pw_hash):
  File "/home/build/mediagoblin/mediagoblin/auth/__init__.py", line 42, in check_password
    return hook_handle("auth_check_password",
  File "/home/build/mediagoblin/mediagoblin/tools/pluginapi.py", line 306, in hook_handle
    result = callable(*args, **kwargs)
  File "/home/build/mediagoblin/mediagoblin/plugins/basic_auth/__init__.py", line 91, in check_password
    return auth_tools.bcrypt_check_password(raw_pass,
  File "/home/build/mediagoblin/mediagoblin/plugins/basic_auth/tools.py", line 51, in bcrypt_check_password
    randplus_stored_hash = bcrypt.hashpw(stored_hash, rand_salt)
  File "/home/build/mediagoblin/lib/python3.9/site-packages/bcrypt-3.2.0-py3.9-linux-x86_64.egg/bcrypt/__init__.py", line 80, in hashpw
    raise TypeError("Unicode-objects must be encoded before hashing")
TypeError: Unicode-objects must be encoded before hashing
---------------------------- Captured stdout setup -----------------------------
Laying foundations for __main__:
   + Laying foundations for Privilege table
Laying foundations for __main__:
   + Laying foundations for Privilege table
---------------------------- Captured stderr setup -----------------------------
INFO  [alembic.runtime.migration] Context impl SQLiteImpl.
INFO  [alembic.runtime.migration] Will assume non-transactional DDL.
INFO  [alembic.runtime.migration] Running upgrade  -> 52bf0ccbedc1, initial revision
INFO  [alembic.runtime.migration] Running upgrade 52bf0ccbedc1 -> a98c1a320e88, Image media type initial migration
INFO  [alembic.runtime.migration] Running upgrade 52bf0ccbedc1 -> 071abb33d1da, OpenID plugin initial migration
INFO  [alembic.runtime.migration] Running upgrade 52bf0ccbedc1 -> 101510e3a713, #5382 Removes graveyard items from collections
INFO  [alembic.runtime.migration] Running upgrade 101510e3a713 -> 8429e33fdf7, Remove the Graveyard objects from CommentNotification objects
INFO  [alembic.runtime.migration] Running upgrade 8429e33fdf7 -> 4066b9f8b84a, use_comment_link_ids_notifications
INFO  [alembic.runtime.migration] Running upgrade 4066b9f8b84a -> 3145accb8fe3, remove tombstone comment wrappers
INFO  [alembic.runtime.migration] Running upgrade 3145accb8fe3 -> 228916769bd2, ensure Report.object_id is nullable
INFO  [alembic.runtime.migration] Running upgrade 228916769bd2 -> afd3d1da5e29, Subtitle plugin initial migration
INFO  [alembic.runtime.migration] Running upgrade 228916769bd2 -> cc3651803714, add main transcoding progress column to MediaEntry
INFO  [alembic.runtime.migration] Context impl SQLiteImpl.
INFO  [alembic.runtime.migration] Will assume non-transactional DDL.
INFO  [alembic.runtime.migration] Running upgrade  -> 52bf0ccbedc1, initial revision
INFO  [alembic.runtime.migration] Running upgrade 52bf0ccbedc1 -> a98c1a320e88, Image media type initial migration
INFO  [alembic.runtime.migration] Running upgrade 52bf0ccbedc1 -> 071abb33d1da, OpenID plugin initial migration
INFO  [alembic.runtime.migration] Running upgrade 52bf0ccbedc1 -> 101510e3a713, #5382 Removes graveyard items from collections
INFO  [alembic.runtime.migration] Running upgrade 101510e3a713 -> 8429e33fdf7, Remove the Graveyard objects from CommentNotification objects
INFO  [alembic.runtime.migration] Running upgrade 8429e33fdf7 -> 4066b9f8b84a, use_comment_link_ids_notifications
INFO  [alembic.runtime.migration] Running upgrade 4066b9f8b84a -> 3145accb8fe3, remove tombstone comment wrappers
INFO  [alembic.runtime.migration] Running upgrade 3145accb8fe3 -> 228916769bd2, ensure Report.object_id is nullable
INFO  [alembic.runtime.migration] Running upgrade 228916769bd2 -> afd3d1da5e29, Subtitle plugin initial migration
INFO  [alembic.runtime.migration] Running upgrade 228916769bd2 -> cc3651803714, add main transcoding progress column to MediaEntry
________________________ TestUserEdit.test_email_change ________________________
Traceback (most recent call last):
  File "/home/build/mediagoblin/mediagoblin/tests/test_edit.py", line 114, in test_email_change
    self.login(test_app)
  File "/home/build/mediagoblin/mediagoblin/tests/test_edit.py", line 35, in login
    test_app.post(
  File "/usr/lib/python3.9/site-packages/webtest/app.py", line 368, in post
    return self._gen_request('POST', url, params=params, headers=headers,
  File "/usr/lib/python3.9/site-packages/webtest/app.py", line 749, in _gen_request
    return self.do_request(req, status=status,
  File "/usr/lib/python3.9/site-packages/webtest/app.py", line 620, in do_request
    res = req.get_response(app, catch_exc_info=True)
  File "/usr/lib/python3.9/site-packages/webob/request.py", line 1309, in send
    status, headers, app_iter, exc_info = self.call_application(
  File "/usr/lib/python3.9/site-packages/webob/request.py", line 1278, in call_application
    app_iter = application(self.environ, start_response)
  File "/usr/lib/python3.9/site-packages/webtest/lint.py", line 196, in lint_app
    iterator = application(environ, start_response_wrapper)
  File "/home/build/mediagoblin/mediagoblin/app.py", line 344, in __call__
    return self.call_backend(environ, start_response)
  File "/home/build/mediagoblin/lib/python3.9/site-packages/Werkzeug-1.0.1-py3.9.egg/werkzeug/middleware/shared_data.py", line 260, in __call__
    return self.app(environ, start_response)
  File "/home/build/mediagoblin/mediagoblin/app.py", line 278, in call_backend
    return self._finish_call_backend(request, environ, start_response)
  File "/home/build/mediagoblin/mediagoblin/app.py", line 320, in _finish_call_backend
    response = controller(request)
  File "/home/build/mediagoblin/mediagoblin/decorators.py", line 366, in wrapper
    return controller(request, *args, **kwargs)
  File "/home/build/mediagoblin/mediagoblin/auth/views.py", line 93, in login
    user = check_login_simple(
  File "/home/build/mediagoblin/mediagoblin/auth/tools.py", line 172, in check_login_simple
    if not auth.check_password(password, user.pw_hash):
  File "/home/build/mediagoblin/mediagoblin/auth/__init__.py", line 42, in check_password
    return hook_handle("auth_check_password",
  File "/home/build/mediagoblin/mediagoblin/tools/pluginapi.py", line 306, in hook_handle
    result = callable(*args, **kwargs)
  File "/home/build/mediagoblin/mediagoblin/plugins/basic_auth/__init__.py", line 91, in check_password
    return auth_tools.bcrypt_check_password(raw_pass,
  File "/home/build/mediagoblin/mediagoblin/plugins/basic_auth/tools.py", line 51, in bcrypt_check_password
    randplus_stored_hash = bcrypt.hashpw(stored_hash, rand_salt)
  File "/home/build/mediagoblin/lib/python3.9/site-packages/bcrypt-3.2.0-py3.9-linux-x86_64.egg/bcrypt/__init__.py", line 80, in hashpw
    raise TypeError("Unicode-objects must be encoded before hashing")
TypeError: Unicode-objects must be encoded before hashing
---------------------------- Captured stdout setup -----------------------------
Laying foundations for __main__:
   + Laying foundations for Privilege table
Laying foundations for __main__:
   + Laying foundations for Privilege table
---------------------------- Captured stderr setup -----------------------------
INFO  [alembic.runtime.migration] Context impl SQLiteImpl.
INFO  [alembic.runtime.migration] Will assume non-transactional DDL.
INFO  [alembic.runtime.migration] Running upgrade  -> 52bf0ccbedc1, initial revision
INFO  [alembic.runtime.migration] Running upgrade 52bf0ccbedc1 -> a98c1a320e88, Image media type initial migration
INFO  [alembic.runtime.migration] Running upgrade 52bf0ccbedc1 -> 071abb33d1da, OpenID plugin initial migration
INFO  [alembic.runtime.migration] Running upgrade 52bf0ccbedc1 -> 101510e3a713, #5382 Removes graveyard items from collections
INFO  [alembic.runtime.migration] Running upgrade 101510e3a713 -> 8429e33fdf7, Remove the Graveyard objects from CommentNotification objects
INFO  [alembic.runtime.migration] Running upgrade 8429e33fdf7 -> 4066b9f8b84a, use_comment_link_ids_notifications
INFO  [alembic.runtime.migration] Running upgrade 4066b9f8b84a -> 3145accb8fe3, remove tombstone comment wrappers
INFO  [alembic.runtime.migration] Running upgrade 3145accb8fe3 -> 228916769bd2, ensure Report.object_id is nullable
INFO  [alembic.runtime.migration] Running upgrade 228916769bd2 -> afd3d1da5e29, Subtitle plugin initial migration
INFO  [alembic.runtime.migration] Running upgrade 228916769bd2 -> cc3651803714, add main transcoding progress column to MediaEntry
INFO  [alembic.runtime.migration] Context impl SQLiteImpl.
INFO  [alembic.runtime.migration] Will assume non-transactional DDL.
INFO  [alembic.runtime.migration] Running upgrade  -> 52bf0ccbedc1, initial revision
INFO  [alembic.runtime.migration] Running upgrade 52bf0ccbedc1 -> a98c1a320e88, Image media type initial migration
INFO  [alembic.runtime.migration] Running upgrade 52bf0ccbedc1 -> 071abb33d1da, OpenID plugin initial migration
INFO  [alembic.runtime.migration] Running upgrade 52bf0ccbedc1 -> 101510e3a713, #5382 Removes graveyard items from collections
INFO  [alembic.runtime.migration] Running upgrade 101510e3a713 -> 8429e33fdf7, Remove the Graveyard objects from CommentNotification objects
INFO  [alembic.runtime.migration] Running upgrade 8429e33fdf7 -> 4066b9f8b84a, use_comment_link_ids_notifications
INFO  [alembic.runtime.migration] Running upgrade 4066b9f8b84a -> 3145accb8fe3, remove tombstone comment wrappers
INFO  [alembic.runtime.migration] Running upgrade 3145accb8fe3 -> 228916769bd2, ensure Report.object_id is nullable
INFO  [alembic.runtime.migration] Running upgrade 228916769bd2 -> afd3d1da5e29, Subtitle plugin initial migration
INFO  [alembic.runtime.migration] Running upgrade 228916769bd2 -> cc3651803714, add main transcoding progress column to MediaEntry
_____________________ TestMetaDataEdit.test_edit_metadata ______________________
Traceback (most recent call last):
  File "/home/build/mediagoblin/mediagoblin/tests/test_edit.py", line 215, in test_edit_metadata
    self.login(test_app)
  File "/home/build/mediagoblin/mediagoblin/tests/test_edit.py", line 191, in login
    test_app.post(
  File "/usr/lib/python3.9/site-packages/webtest/app.py", line 368, in post
    return self._gen_request('POST', url, params=params, headers=headers,
  File "/usr/lib/python3.9/site-packages/webtest/app.py", line 749, in _gen_request
    return self.do_request(req, status=status,
  File "/usr/lib/python3.9/site-packages/webtest/app.py", line 620, in do_request
    res = req.get_response(app, catch_exc_info=True)
  File "/usr/lib/python3.9/site-packages/webob/request.py", line 1309, in send
    status, headers, app_iter, exc_info = self.call_application(
  File "/usr/lib/python3.9/site-packages/webob/request.py", line 1278, in call_application
    app_iter = application(self.environ, start_response)
  File "/usr/lib/python3.9/site-packages/webtest/lint.py", line 196, in lint_app
    iterator = application(environ, start_response_wrapper)
  File "/home/build/mediagoblin/mediagoblin/app.py", line 344, in __call__
    return self.call_backend(environ, start_response)
  File "/home/build/mediagoblin/lib/python3.9/site-packages/Werkzeug-1.0.1-py3.9.egg/werkzeug/middleware/shared_data.py", line 260, in __call__
    return self.app(environ, start_response)
  File "/home/build/mediagoblin/mediagoblin/app.py", line 278, in call_backend
    return self._finish_call_backend(request, environ, start_response)
  File "/home/build/mediagoblin/mediagoblin/app.py", line 320, in _finish_call_backend
    response = controller(request)
  File "/home/build/mediagoblin/mediagoblin/decorators.py", line 366, in wrapper
    return controller(request, *args, **kwargs)
  File "/home/build/mediagoblin/mediagoblin/auth/views.py", line 93, in login
    user = check_login_simple(
  File "/home/build/mediagoblin/mediagoblin/auth/tools.py", line 172, in check_login_simple
    if not auth.check_password(password, user.pw_hash):
  File "/home/build/mediagoblin/mediagoblin/auth/__init__.py", line 42, in check_password
    return hook_handle("auth_check_password",
  File "/home/build/mediagoblin/mediagoblin/tools/pluginapi.py", line 306, in hook_handle
    result = callable(*args, **kwargs)
  File "/home/build/mediagoblin/mediagoblin/plugins/basic_auth/__init__.py", line 91, in check_password
    return auth_tools.bcrypt_check_password(raw_pass,
  File "/home/build/mediagoblin/mediagoblin/plugins/basic_auth/tools.py", line 51, in bcrypt_check_password
    randplus_stored_hash = bcrypt.hashpw(stored_hash, rand_salt)
  File "/home/build/mediagoblin/lib/python3.9/site-packages/bcrypt-3.2.0-py3.9-linux-x86_64.egg/bcrypt/__init__.py", line 80, in hashpw
    raise TypeError("Unicode-objects must be encoded before hashing")
TypeError: Unicode-objects must be encoded before hashing
---------------------------- Captured stdout setup -----------------------------
Laying foundations for __main__:
   + Laying foundations for Privilege table
Laying foundations for __main__:
   + Laying foundations for Privilege table
---------------------------- Captured stderr setup -----------------------------
INFO  [alembic.runtime.migration] Context impl SQLiteImpl.
INFO  [alembic.runtime.migration] Will assume non-transactional DDL.
INFO  [alembic.runtime.migration] Running upgrade  -> 52bf0ccbedc1, initial revision
INFO  [alembic.runtime.migration] Running upgrade 52bf0ccbedc1 -> a98c1a320e88, Image media type initial migration
INFO  [alembic.runtime.migration] Running upgrade 52bf0ccbedc1 -> 071abb33d1da, OpenID plugin initial migration
INFO  [alembic.runtime.migration] Running upgrade 52bf0ccbedc1 -> 101510e3a713, #5382 Removes graveyard items from collections
INFO  [alembic.runtime.migration] Running upgrade 101510e3a713 -> 8429e33fdf7, Remove the Graveyard objects from CommentNotification objects
INFO  [alembic.runtime.migration] Running upgrade 8429e33fdf7 -> 4066b9f8b84a, use_comment_link_ids_notifications
INFO  [alembic.runtime.migration] Running upgrade 4066b9f8b84a -> 3145accb8fe3, remove tombstone comment wrappers
INFO  [alembic.runtime.migration] Running upgrade 3145accb8fe3 -> 228916769bd2, ensure Report.object_id is nullable
INFO  [alembic.runtime.migration] Running upgrade 228916769bd2 -> afd3d1da5e29, Subtitle plugin initial migration
INFO  [alembic.runtime.migration] Running upgrade 228916769bd2 -> cc3651803714, add main transcoding progress column to MediaEntry
INFO  [alembic.runtime.migration] Context impl SQLiteImpl.
INFO  [alembic.runtime.migration] Will assume non-transactional DDL.
INFO  [alembic.runtime.migration] Running upgrade  -> 52bf0ccbedc1, initial revision
INFO  [alembic.runtime.migration] Running upgrade 52bf0ccbedc1 -> a98c1a320e88, Image media type initial migration
INFO  [alembic.runtime.migration] Running upgrade 52bf0ccbedc1 -> 071abb33d1da, OpenID plugin initial migration
INFO  [alembic.runtime.migration] Running upgrade 52bf0ccbedc1 -> 101510e3a713, #5382 Removes graveyard items from collections
INFO  [alembic.runtime.migration] Running upgrade 101510e3a713 -> 8429e33fdf7, Remove the Graveyard objects from CommentNotification objects
INFO  [alembic.runtime.migration] Running upgrade 8429e33fdf7 -> 4066b9f8b84a, use_comment_link_ids_notifications
INFO  [alembic.runtime.migration] Running upgrade 4066b9f8b84a -> 3145accb8fe3, remove tombstone comment wrappers
INFO  [alembic.runtime.migration] Running upgrade 3145accb8fe3 -> 228916769bd2, ensure Report.object_id is nullable
INFO  [alembic.runtime.migration] Running upgrade 228916769bd2 -> afd3d1da5e29, Subtitle plugin initial migration
INFO  [alembic.runtime.migration] Running upgrade 228916769bd2 -> cc3651803714, add main transcoding progress column to MediaEntry
________________________ TestAPI.test_1_test_test_view _________________________
Traceback (most recent call last):
  File "/home/build/mediagoblin/mediagoblin/tests/test_legacy_api.py", line 75, in test_1_test_test_view
    self.login(test_app)
  File "/home/build/mediagoblin/mediagoblin/tests/test_legacy_api.py", line 43, in login
    test_app.post(
  File "/usr/lib/python3.9/site-packages/webtest/app.py", line 368, in post
    return self._gen_request('POST', url, params=params, headers=headers,
  File "/usr/lib/python3.9/site-packages/webtest/app.py", line 749, in _gen_request
    return self.do_request(req, status=status,
  File "/usr/lib/python3.9/site-packages/webtest/app.py", line 620, in do_request
    res = req.get_response(app, catch_exc_info=True)
  File "/usr/lib/python3.9/site-packages/webob/request.py", line 1309, in send
    status, headers, app_iter, exc_info = self.call_application(
  File "/usr/lib/python3.9/site-packages/webob/request.py", line 1278, in call_application
    app_iter = application(self.environ, start_response)
  File "/usr/lib/python3.9/site-packages/webtest/lint.py", line 196, in lint_app
    iterator = application(environ, start_response_wrapper)
  File "/home/build/mediagoblin/mediagoblin/app.py", line 344, in __call__
    return self.call_backend(environ, start_response)
  File "/home/build/mediagoblin/lib/python3.9/site-packages/Werkzeug-1.0.1-py3.9.egg/werkzeug/middleware/shared_data.py", line 260, in __call__
    return self.app(environ, start_response)
  File "/home/build/mediagoblin/mediagoblin/app.py", line 278, in call_backend
    return self._finish_call_backend(request, environ, start_response)
  File "/home/build/mediagoblin/mediagoblin/app.py", line 320, in _finish_call_backend
    response = controller(request)
  File "/home/build/mediagoblin/mediagoblin/decorators.py", line 366, in wrapper
    return controller(request, *args, **kwargs)
  File "/home/build/mediagoblin/mediagoblin/auth/views.py", line 93, in login
    user = check_login_simple(
  File "/home/build/mediagoblin/mediagoblin/auth/tools.py", line 172, in check_login_simple
    if not auth.check_password(password, user.pw_hash):
  File "/home/build/mediagoblin/mediagoblin/auth/__init__.py", line 42, in check_password
    return hook_handle("auth_check_password",
  File "/home/build/mediagoblin/mediagoblin/tools/pluginapi.py", line 306, in hook_handle
    result = callable(*args, **kwargs)
  File "/home/build/mediagoblin/mediagoblin/plugins/basic_auth/__init__.py", line 91, in check_password
    return auth_tools.bcrypt_check_password(raw_pass,
  File "/home/build/mediagoblin/mediagoblin/plugins/basic_auth/tools.py", line 51, in bcrypt_check_password
    randplus_stored_hash = bcrypt.hashpw(stored_hash, rand_salt)
  File "/home/build/mediagoblin/lib/python3.9/site-packages/bcrypt-3.2.0-py3.9-linux-x86_64.egg/bcrypt/__init__.py", line 80, in hashpw
    raise TypeError("Unicode-objects must be encoded before hashing")
TypeError: Unicode-objects must be encoded before hashing
---------------------------- Captured stdout setup -----------------------------
Laying foundations for __main__:
   + Laying foundations for Privilege table
Laying foundations for __main__:
   + Laying foundations for Privilege table
---------------------------- Captured stderr setup -----------------------------
INFO  [alembic.runtime.migration] Context impl SQLiteImpl.
INFO  [alembic.runtime.migration] Will assume non-transactional DDL.
INFO  [alembic.runtime.migration] Running upgrade  -> 52bf0ccbedc1, initial revision
INFO  [alembic.runtime.migration] Running upgrade 52bf0ccbedc1 -> a98c1a320e88, Image media type initial migration
INFO  [alembic.runtime.migration] Running upgrade 52bf0ccbedc1 -> 071abb33d1da, OpenID plugin initial migration
INFO  [alembic.runtime.migration] Running upgrade 52bf0ccbedc1 -> 101510e3a713, #5382 Removes graveyard items from collections
INFO  [alembic.runtime.migration] Running upgrade 101510e3a713 -> 8429e33fdf7, Remove the Graveyard objects from CommentNotification objects
INFO  [alembic.runtime.migration] Running upgrade 8429e33fdf7 -> 4066b9f8b84a, use_comment_link_ids_notifications
INFO  [alembic.runtime.migration] Running upgrade 4066b9f8b84a -> 3145accb8fe3, remove tombstone comment wrappers
INFO  [alembic.runtime.migration] Running upgrade 3145accb8fe3 -> 228916769bd2, ensure Report.object_id is nullable
INFO  [alembic.runtime.migration] Running upgrade 228916769bd2 -> afd3d1da5e29, Subtitle plugin initial migration
INFO  [alembic.runtime.migration] Running upgrade 228916769bd2 -> cc3651803714, add main transcoding progress column to MediaEntry
INFO  [alembic.runtime.migration] Context impl SQLiteImpl.
INFO  [alembic.runtime.migration] Will assume non-transactional DDL.
INFO  [alembic.runtime.migration] Running upgrade  -> 52bf0ccbedc1, initial revision
INFO  [alembic.runtime.migration] Running upgrade 52bf0ccbedc1 -> a98c1a320e88, Image media type initial migration
INFO  [alembic.runtime.migration] Running upgrade 52bf0ccbedc1 -> 071abb33d1da, OpenID plugin initial migration
INFO  [alembic.runtime.migration] Running upgrade 52bf0ccbedc1 -> 101510e3a713, #5382 Removes graveyard items from collections
INFO  [alembic.runtime.migration] Running upgrade 101510e3a713 -> 8429e33fdf7, Remove the Graveyard objects from CommentNotification objects
INFO  [alembic.runtime.migration] Running upgrade 8429e33fdf7 -> 4066b9f8b84a, use_comment_link_ids_notifications
INFO  [alembic.runtime.migration] Running upgrade 4066b9f8b84a -> 3145accb8fe3, remove tombstone comment wrappers
INFO  [alembic.runtime.migration] Running upgrade 3145accb8fe3 -> 228916769bd2, ensure Report.object_id is nullable
INFO  [alembic.runtime.migration] Running upgrade 228916769bd2 -> afd3d1da5e29, Subtitle plugin initial migration
INFO  [alembic.runtime.migration] Running upgrade 228916769bd2 -> cc3651803714, add main transcoding progress column to MediaEntry
________________________ TestAPI.test_2_test_submission ________________________
Traceback (most recent call last):
  File "/home/build/mediagoblin/mediagoblin/tests/test_legacy_api.py", line 85, in test_2_test_submission
    self.login(test_app)
  File "/home/build/mediagoblin/mediagoblin/tests/test_legacy_api.py", line 43, in login
    test_app.post(
  File "/usr/lib/python3.9/site-packages/webtest/app.py", line 368, in post
    return self._gen_request('POST', url, params=params, headers=headers,
  File "/usr/lib/python3.9/site-packages/webtest/app.py", line 749, in _gen_request
    return self.do_request(req, status=status,
  File "/usr/lib/python3.9/site-packages/webtest/app.py", line 620, in do_request
    res = req.get_response(app, catch_exc_info=True)
  File "/usr/lib/python3.9/site-packages/webob/request.py", line 1309, in send
    status, headers, app_iter, exc_info = self.call_application(
  File "/usr/lib/python3.9/site-packages/webob/request.py", line 1278, in call_application
    app_iter = application(self.environ, start_response)
  File "/usr/lib/python3.9/site-packages/webtest/lint.py", line 196, in lint_app
    iterator = application(environ, start_response_wrapper)
  File "/home/build/mediagoblin/mediagoblin/app.py", line 344, in __call__
    return self.call_backend(environ, start_response)
  File "/home/build/mediagoblin/lib/python3.9/site-packages/Werkzeug-1.0.1-py3.9.egg/werkzeug/middleware/shared_data.py", line 260, in __call__
    return self.app(environ, start_response)
  File "/home/build/mediagoblin/mediagoblin/app.py", line 278, in call_backend
    return self._finish_call_backend(request, environ, start_response)
  File "/home/build/mediagoblin/mediagoblin/app.py", line 320, in _finish_call_backend
    response = controller(request)
  File "/home/build/mediagoblin/mediagoblin/decorators.py", line 366, in wrapper
    return controller(request, *args, **kwargs)
  File "/home/build/mediagoblin/mediagoblin/auth/views.py", line 93, in login
    user = check_login_simple(
  File "/home/build/mediagoblin/mediagoblin/auth/tools.py", line 172, in check_login_simple
    if not auth.check_password(password, user.pw_hash):
  File "/home/build/mediagoblin/mediagoblin/auth/__init__.py", line 42, in check_password
    return hook_handle("auth_check_password",
  File "/home/build/mediagoblin/mediagoblin/tools/pluginapi.py", line 306, in hook_handle
    result = callable(*args, **kwargs)
  File "/home/build/mediagoblin/mediagoblin/plugins/basic_auth/__init__.py", line 91, in check_password
    return auth_tools.bcrypt_check_password(raw_pass,
  File "/home/build/mediagoblin/mediagoblin/plugins/basic_auth/tools.py", line 51, in bcrypt_check_password
    randplus_stored_hash = bcrypt.hashpw(stored_hash, rand_salt)
  File "/home/build/mediagoblin/lib/python3.9/site-packages/bcrypt-3.2.0-py3.9-linux-x86_64.egg/bcrypt/__init__.py", line 80, in hashpw
    raise TypeError("Unicode-objects must be encoded before hashing")
TypeError: Unicode-objects must be encoded before hashing
---------------------------- Captured stdout setup -----------------------------
Laying foundations for __main__:
   + Laying foundations for Privilege table
Laying foundations for __main__:
   + Laying foundations for Privilege table
---------------------------- Captured stderr setup -----------------------------
INFO  [alembic.runtime.migration] Context impl SQLiteImpl.
INFO  [alembic.runtime.migration] Will assume non-transactional DDL.
INFO  [alembic.runtime.migration] Running upgrade  -> 52bf0ccbedc1, initial revision
INFO  [alembic.runtime.migration] Running upgrade 52bf0ccbedc1 -> a98c1a320e88, Image media type initial migration
INFO  [alembic.runtime.migration] Running upgrade 52bf0ccbedc1 -> 071abb33d1da, OpenID plugin initial migration
INFO  [alembic.runtime.migration] Running upgrade 52bf0ccbedc1 -> 101510e3a713, #5382 Removes graveyard items from collections
INFO  [alembic.runtime.migration] Running upgrade 101510e3a713 -> 8429e33fdf7, Remove the Graveyard objects from CommentNotification objects
INFO  [alembic.runtime.migration] Running upgrade 8429e33fdf7 -> 4066b9f8b84a, use_comment_link_ids_notifications
INFO  [alembic.runtime.migration] Running upgrade 4066b9f8b84a -> 3145accb8fe3, remove tombstone comment wrappers
INFO  [alembic.runtime.migration] Running upgrade 3145accb8fe3 -> 228916769bd2, ensure Report.object_id is nullable
INFO  [alembic.runtime.migration] Running upgrade 228916769bd2 -> afd3d1da5e29, Subtitle plugin initial migration
INFO  [alembic.runtime.migration] Running upgrade 228916769bd2 -> cc3651803714, add main transcoding progress column to MediaEntry
INFO  [alembic.runtime.migration] Context impl SQLiteImpl.
INFO  [alembic.runtime.migration] Will assume non-transactional DDL.
INFO  [alembic.runtime.migration] Running upgrade  -> 52bf0ccbedc1, initial revision
INFO  [alembic.runtime.migration] Running upgrade 52bf0ccbedc1 -> a98c1a320e88, Image media type initial migration
INFO  [alembic.runtime.migration] Running upgrade 52bf0ccbedc1 -> 071abb33d1da, OpenID plugin initial migration
INFO  [alembic.runtime.migration] Running upgrade 52bf0ccbedc1 -> 101510e3a713, #5382 Removes graveyard items from collections
INFO  [alembic.runtime.migration] Running upgrade 101510e3a713 -> 8429e33fdf7, Remove the Graveyard objects from CommentNotification objects
INFO  [alembic.runtime.migration] Running upgrade 8429e33fdf7 -> 4066b9f8b84a, use_comment_link_ids_notifications
INFO  [alembic.runtime.migration] Running upgrade 4066b9f8b84a -> 3145accb8fe3, remove tombstone comment wrappers
INFO  [alembic.runtime.migration] Running upgrade 3145accb8fe3 -> 228916769bd2, ensure Report.object_id is nullable
INFO  [alembic.runtime.migration] Running upgrade 228916769bd2 -> afd3d1da5e29, Subtitle plugin initial migration
INFO  [alembic.runtime.migration] Running upgrade 228916769bd2 -> cc3651803714, add main transcoding progress column to MediaEntry
_______________ TestModerationViews.testGiveOrTakeAwayPrivileges _______________
Traceback (most recent call last):
  File "/home/build/mediagoblin/mediagoblin/tests/test_moderation.py", line 68, in testGiveOrTakeAwayPrivileges
    self.login('admin')
  File "/home/build/mediagoblin/mediagoblin/tests/test_moderation.py", line 40, in login
    self.test_app.post(
  File "/usr/lib/python3.9/site-packages/webtest/app.py", line 368, in post
    return self._gen_request('POST', url, params=params, headers=headers,
  File "/usr/lib/python3.9/site-packages/webtest/app.py", line 749, in _gen_request
    return self.do_request(req, status=status,
  File "/usr/lib/python3.9/site-packages/webtest/app.py", line 620, in do_request
    res = req.get_response(app, catch_exc_info=True)
  File "/usr/lib/python3.9/site-packages/webob/request.py", line 1309, in send
    status, headers, app_iter, exc_info = self.call_application(
  File "/usr/lib/python3.9/site-packages/webob/request.py", line 1278, in call_application
    app_iter = application(self.environ, start_response)
  File "/usr/lib/python3.9/site-packages/webtest/lint.py", line 196, in lint_app
    iterator = application(environ, start_response_wrapper)
  File "/home/build/mediagoblin/mediagoblin/app.py", line 344, in __call__
    return self.call_backend(environ, start_response)
  File "/home/build/mediagoblin/lib/python3.9/site-packages/Werkzeug-1.0.1-py3.9.egg/werkzeug/middleware/shared_data.py", line 260, in __call__
    return self.app(environ, start_response)
  File "/home/build/mediagoblin/mediagoblin/app.py", line 278, in call_backend
    return self._finish_call_backend(request, environ, start_response)
  File "/home/build/mediagoblin/mediagoblin/app.py", line 320, in _finish_call_backend
    response = controller(request)
  File "/home/build/mediagoblin/mediagoblin/decorators.py", line 366, in wrapper
    return controller(request, *args, **kwargs)
  File "/home/build/mediagoblin/mediagoblin/auth/views.py", line 93, in login
    user = check_login_simple(
  File "/home/build/mediagoblin/mediagoblin/auth/tools.py", line 172, in check_login_simple
    if not auth.check_password(password, user.pw_hash):
  File "/home/build/mediagoblin/mediagoblin/auth/__init__.py", line 42, in check_password
    return hook_handle("auth_check_password",
  File "/home/build/mediagoblin/mediagoblin/tools/pluginapi.py", line 306, in hook_handle
    result = callable(*args, **kwargs)
  File "/home/build/mediagoblin/mediagoblin/plugins/basic_auth/__init__.py", line 91, in check_password
    return auth_tools.bcrypt_check_password(raw_pass,
  File "/home/build/mediagoblin/mediagoblin/plugins/basic_auth/tools.py", line 51, in bcrypt_check_password
    randplus_stored_hash = bcrypt.hashpw(stored_hash, rand_salt)
  File "/home/build/mediagoblin/lib/python3.9/site-packages/bcrypt-3.2.0-py3.9-linux-x86_64.egg/bcrypt/__init__.py", line 80, in hashpw
    raise TypeError("Unicode-objects must be encoded before hashing")
TypeError: Unicode-objects must be encoded before hashing
---------------------------- Captured stdout setup -----------------------------
Laying foundations for __main__:
   + Laying foundations for Privilege table
Laying foundations for __main__:
   + Laying foundations for Privilege table
---------------------------- Captured stderr setup -----------------------------
INFO  [alembic.runtime.migration] Context impl SQLiteImpl.
INFO  [alembic.runtime.migration] Will assume non-transactional DDL.
INFO  [alembic.runtime.migration] Running upgrade  -> 52bf0ccbedc1, initial revision
INFO  [alembic.runtime.migration] Running upgrade 52bf0ccbedc1 -> a98c1a320e88, Image media type initial migration
INFO  [alembic.runtime.migration] Running upgrade 52bf0ccbedc1 -> 071abb33d1da, OpenID plugin initial migration
INFO  [alembic.runtime.migration] Running upgrade 52bf0ccbedc1 -> 101510e3a713, #5382 Removes graveyard items from collections
INFO  [alembic.runtime.migration] Running upgrade 101510e3a713 -> 8429e33fdf7, Remove the Graveyard objects from CommentNotification objects
INFO  [alembic.runtime.migration] Running upgrade 8429e33fdf7 -> 4066b9f8b84a, use_comment_link_ids_notifications
INFO  [alembic.runtime.migration] Running upgrade 4066b9f8b84a -> 3145accb8fe3, remove tombstone comment wrappers
INFO  [alembic.runtime.migration] Running upgrade 3145accb8fe3 -> 228916769bd2, ensure Report.object_id is nullable
INFO  [alembic.runtime.migration] Running upgrade 228916769bd2 -> afd3d1da5e29, Subtitle plugin initial migration
INFO  [alembic.runtime.migration] Running upgrade 228916769bd2 -> cc3651803714, add main transcoding progress column to MediaEntry
INFO  [alembic.runtime.migration] Context impl SQLiteImpl.
INFO  [alembic.runtime.migration] Will assume non-transactional DDL.
INFO  [alembic.runtime.migration] Running upgrade  -> 52bf0ccbedc1, initial revision
INFO  [alembic.runtime.migration] Running upgrade 52bf0ccbedc1 -> a98c1a320e88, Image media type initial migration
INFO  [alembic.runtime.migration] Running upgrade 52bf0ccbedc1 -> 071abb33d1da, OpenID plugin initial migration
INFO  [alembic.runtime.migration] Running upgrade 52bf0ccbedc1 -> 101510e3a713, #5382 Removes graveyard items from collections
INFO  [alembic.runtime.migration] Running upgrade 101510e3a713 -> 8429e33fdf7, Remove the Graveyard objects from CommentNotification objects
INFO  [alembic.runtime.migration] Running upgrade 8429e33fdf7 -> 4066b9f8b84a, use_comment_link_ids_notifications
INFO  [alembic.runtime.migration] Running upgrade 4066b9f8b84a -> 3145accb8fe3, remove tombstone comment wrappers
INFO  [alembic.runtime.migration] Running upgrade 3145accb8fe3 -> 228916769bd2, ensure Report.object_id is nullable
INFO  [alembic.runtime.migration] Running upgrade 228916769bd2 -> afd3d1da5e29, Subtitle plugin initial migration
INFO  [alembic.runtime.migration] Running upgrade 228916769bd2 -> cc3651803714, add main transcoding progress column to MediaEntry
___________________ TestModerationViews.testReportResolution ___________________
Traceback (most recent call last):
  File "/home/build/mediagoblin/mediagoblin/tests/test_moderation.py", line 100, in testReportResolution
    self.login('moderator')
  File "/home/build/mediagoblin/mediagoblin/tests/test_moderation.py", line 40, in login
    self.test_app.post(
  File "/usr/lib/python3.9/site-packages/webtest/app.py", line 368, in post
    return self._gen_request('POST', url, params=params, headers=headers,
  File "/usr/lib/python3.9/site-packages/webtest/app.py", line 749, in _gen_request
    return self.do_request(req, status=status,
  File "/usr/lib/python3.9/site-packages/webtest/app.py", line 620, in do_request
    res = req.get_response(app, catch_exc_info=True)
  File "/usr/lib/python3.9/site-packages/webob/request.py", line 1309, in send
    status, headers, app_iter, exc_info = self.call_application(
  File "/usr/lib/python3.9/site-packages/webob/request.py", line 1278, in call_application
    app_iter = application(self.environ, start_response)
  File "/usr/lib/python3.9/site-packages/webtest/lint.py", line 196, in lint_app
    iterator = application(environ, start_response_wrapper)
  File "/home/build/mediagoblin/mediagoblin/app.py", line 344, in __call__
    return self.call_backend(environ, start_response)
  File "/home/build/mediagoblin/lib/python3.9/site-packages/Werkzeug-1.0.1-py3.9.egg/werkzeug/middleware/shared_data.py", line 260, in __call__
    return self.app(environ, start_response)
  File "/home/build/mediagoblin/mediagoblin/app.py", line 278, in call_backend
    return self._finish_call_backend(request, environ, start_response)
  File "/home/build/mediagoblin/mediagoblin/app.py", line 320, in _finish_call_backend
    response = controller(request)
  File "/home/build/mediagoblin/mediagoblin/decorators.py", line 366, in wrapper
    return controller(request, *args, **kwargs)
  File "/home/build/mediagoblin/mediagoblin/auth/views.py", line 93, in login
    user = check_login_simple(
  File "/home/build/mediagoblin/mediagoblin/auth/tools.py", line 172, in check_login_simple
    if not auth.check_password(password, user.pw_hash):
  File "/home/build/mediagoblin/mediagoblin/auth/__init__.py", line 42, in check_password
    return hook_handle("auth_check_password",
  File "/home/build/mediagoblin/mediagoblin/tools/pluginapi.py", line 306, in hook_handle
    result = callable(*args, **kwargs)
  File "/home/build/mediagoblin/mediagoblin/plugins/basic_auth/__init__.py", line 91, in check_password
    return auth_tools.bcrypt_check_password(raw_pass,
  File "/home/build/mediagoblin/mediagoblin/plugins/basic_auth/tools.py", line 51, in bcrypt_check_password
    randplus_stored_hash = bcrypt.hashpw(stored_hash, rand_salt)
  File "/home/build/mediagoblin/lib/python3.9/site-packages/bcrypt-3.2.0-py3.9-linux-x86_64.egg/bcrypt/__init__.py", line 80, in hashpw
    raise TypeError("Unicode-objects must be encoded before hashing")
TypeError: Unicode-objects must be encoded before hashing
---------------------------- Captured stdout setup -----------------------------
Laying foundations for __main__:
   + Laying foundations for Privilege table
Laying foundations for __main__:
   + Laying foundations for Privilege table
---------------------------- Captured stderr setup -----------------------------
INFO  [alembic.runtime.migration] Context impl SQLiteImpl.
INFO  [alembic.runtime.migration] Will assume non-transactional DDL.
INFO  [alembic.runtime.migration] Running upgrade  -> 52bf0ccbedc1, initial revision
INFO  [alembic.runtime.migration] Running upgrade 52bf0ccbedc1 -> a98c1a320e88, Image media type initial migration
INFO  [alembic.runtime.migration] Running upgrade 52bf0ccbedc1 -> 071abb33d1da, OpenID plugin initial migration
INFO  [alembic.runtime.migration] Running upgrade 52bf0ccbedc1 -> 101510e3a713, #5382 Removes graveyard items from collections
INFO  [alembic.runtime.migration] Running upgrade 101510e3a713 -> 8429e33fdf7, Remove the Graveyard objects from CommentNotification objects
INFO  [alembic.runtime.migration] Running upgrade 8429e33fdf7 -> 4066b9f8b84a, use_comment_link_ids_notifications
INFO  [alembic.runtime.migration] Running upgrade 4066b9f8b84a -> 3145accb8fe3, remove tombstone comment wrappers
INFO  [alembic.runtime.migration] Running upgrade 3145accb8fe3 -> 228916769bd2, ensure Report.object_id is nullable
INFO  [alembic.runtime.migration] Running upgrade 228916769bd2 -> afd3d1da5e29, Subtitle plugin initial migration
INFO  [alembic.runtime.migration] Running upgrade 228916769bd2 -> cc3651803714, add main transcoding progress column to MediaEntry
INFO  [alembic.runtime.migration] Context impl SQLiteImpl.
INFO  [alembic.runtime.migration] Will assume non-transactional DDL.
INFO  [alembic.runtime.migration] Running upgrade  -> 52bf0ccbedc1, initial revision
INFO  [alembic.runtime.migration] Running upgrade 52bf0ccbedc1 -> a98c1a320e88, Image media type initial migration
INFO  [alembic.runtime.migration] Running upgrade 52bf0ccbedc1 -> 071abb33d1da, OpenID plugin initial migration
INFO  [alembic.runtime.migration] Running upgrade 52bf0ccbedc1 -> 101510e3a713, #5382 Removes graveyard items from collections
INFO  [alembic.runtime.migration] Running upgrade 101510e3a713 -> 8429e33fdf7, Remove the Graveyard objects from CommentNotification objects
INFO  [alembic.runtime.migration] Running upgrade 8429e33fdf7 -> 4066b9f8b84a, use_comment_link_ids_notifications
INFO  [alembic.runtime.migration] Running upgrade 4066b9f8b84a -> 3145accb8fe3, remove tombstone comment wrappers
INFO  [alembic.runtime.migration] Running upgrade 3145accb8fe3 -> 228916769bd2, ensure Report.object_id is nullable
INFO  [alembic.runtime.migration] Running upgrade 228916769bd2 -> afd3d1da5e29, Subtitle plugin initial migration
INFO  [alembic.runtime.migration] Running upgrade 228916769bd2 -> cc3651803714, add main transcoding progress column to MediaEntry
__________________ TestModerationViews.testAllModerationViews __________________
Traceback (most recent call last):
  File "/home/build/mediagoblin/mediagoblin/tests/test_moderation.py", line 206, in testAllModerationViews
    self.login('moderator')
  File "/home/build/mediagoblin/mediagoblin/tests/test_moderation.py", line 40, in login
    self.test_app.post(
  File "/usr/lib/python3.9/site-packages/webtest/app.py", line 368, in post
    return self._gen_request('POST', url, params=params, headers=headers,
  File "/usr/lib/python3.9/site-packages/webtest/app.py", line 749, in _gen_request
    return self.do_request(req, status=status,
  File "/usr/lib/python3.9/site-packages/webtest/app.py", line 620, in do_request
    res = req.get_response(app, catch_exc_info=True)
  File "/usr/lib/python3.9/site-packages/webob/request.py", line 1309, in send
    status, headers, app_iter, exc_info = self.call_application(
  File "/usr/lib/python3.9/site-packages/webob/request.py", line 1278, in call_application
    app_iter = application(self.environ, start_response)
  File "/usr/lib/python3.9/site-packages/webtest/lint.py", line 196, in lint_app
    iterator = application(environ, start_response_wrapper)
  File "/home/build/mediagoblin/mediagoblin/app.py", line 344, in __call__
    return self.call_backend(environ, start_response)
  File "/home/build/mediagoblin/lib/python3.9/site-packages/Werkzeug-1.0.1-py3.9.egg/werkzeug/middleware/shared_data.py", line 260, in __call__
    return self.app(environ, start_response)
  File "/home/build/mediagoblin/mediagoblin/app.py", line 278, in call_backend
    return self._finish_call_backend(request, environ, start_response)
  File "/home/build/mediagoblin/mediagoblin/app.py", line 320, in _finish_call_backend
    response = controller(request)
  File "/home/build/mediagoblin/mediagoblin/decorators.py", line 366, in wrapper
    return controller(request, *args, **kwargs)
  File "/home/build/mediagoblin/mediagoblin/auth/views.py", line 93, in login
    user = check_login_simple(
  File "/home/build/mediagoblin/mediagoblin/auth/tools.py", line 172, in check_login_simple
    if not auth.check_password(password, user.pw_hash):
  File "/home/build/mediagoblin/mediagoblin/auth/__init__.py", line 42, in check_password
    return hook_handle("auth_check_password",
  File "/home/build/mediagoblin/mediagoblin/tools/pluginapi.py", line 306, in hook_handle
    result = callable(*args, **kwargs)
  File "/home/build/mediagoblin/mediagoblin/plugins/basic_auth/__init__.py", line 91, in check_password
    return auth_tools.bcrypt_check_password(raw_pass,
  File "/home/build/mediagoblin/mediagoblin/plugins/basic_auth/tools.py", line 51, in bcrypt_check_password
    randplus_stored_hash = bcrypt.hashpw(stored_hash, rand_salt)
  File "/home/build/mediagoblin/lib/python3.9/site-packages/bcrypt-3.2.0-py3.9-linux-x86_64.egg/bcrypt/__init__.py", line 80, in hashpw
    raise TypeError("Unicode-objects must be encoded before hashing")
TypeError: Unicode-objects must be encoded before hashing
---------------------------- Captured stdout setup -----------------------------
Laying foundations for __main__:
   + Laying foundations for Privilege table
Laying foundations for __main__:
   + Laying foundations for Privilege table
---------------------------- Captured stderr setup -----------------------------
INFO  [alembic.runtime.migration] Context impl SQLiteImpl.
INFO  [alembic.runtime.migration] Will assume non-transactional DDL.
INFO  [alembic.runtime.migration] Running upgrade  -> 52bf0ccbedc1, initial revision
INFO  [alembic.runtime.migration] Running upgrade 52bf0ccbedc1 -> a98c1a320e88, Image media type initial migration
INFO  [alembic.runtime.migration] Running upgrade 52bf0ccbedc1 -> 071abb33d1da, OpenID plugin initial migration
INFO  [alembic.runtime.migration] Running upgrade 52bf0ccbedc1 -> 101510e3a713, #5382 Removes graveyard items from collections
INFO  [alembic.runtime.migration] Running upgrade 101510e3a713 -> 8429e33fdf7, Remove the Graveyard objects from CommentNotification objects
INFO  [alembic.runtime.migration] Running upgrade 8429e33fdf7 -> 4066b9f8b84a, use_comment_link_ids_notifications
INFO  [alembic.runtime.migration] Running upgrade 4066b9f8b84a -> 3145accb8fe3, remove tombstone comment wrappers
INFO  [alembic.runtime.migration] Running upgrade 3145accb8fe3 -> 228916769bd2, ensure Report.object_id is nullable
INFO  [alembic.runtime.migration] Running upgrade 228916769bd2 -> afd3d1da5e29, Subtitle plugin initial migration
INFO  [alembic.runtime.migration] Running upgrade 228916769bd2 -> cc3651803714, add main transcoding progress column to MediaEntry
INFO  [alembic.runtime.migration] Context impl SQLiteImpl.
INFO  [alembic.runtime.migration] Will assume non-transactional DDL.
INFO  [alembic.runtime.migration] Running upgrade  -> 52bf0ccbedc1, initial revision
INFO  [alembic.runtime.migration] Running upgrade 52bf0ccbedc1 -> a98c1a320e88, Image media type initial migration
INFO  [alembic.runtime.migration] Running upgrade 52bf0ccbedc1 -> 071abb33d1da, OpenID plugin initial migration
INFO  [alembic.runtime.migration] Running upgrade 52bf0ccbedc1 -> 101510e3a713, #5382 Removes graveyard items from collections
INFO  [alembic.runtime.migration] Running upgrade 101510e3a713 -> 8429e33fdf7, Remove the Graveyard objects from CommentNotification objects
INFO  [alembic.runtime.migration] Running upgrade 8429e33fdf7 -> 4066b9f8b84a, use_comment_link_ids_notifications
INFO  [alembic.runtime.migration] Running upgrade 4066b9f8b84a -> 3145accb8fe3, remove tombstone comment wrappers
INFO  [alembic.runtime.migration] Running upgrade 3145accb8fe3 -> 228916769bd2, ensure Report.object_id is nullable
INFO  [alembic.runtime.migration] Running upgrade 228916769bd2 -> afd3d1da5e29, Subtitle plugin initial migration
INFO  [alembic.runtime.migration] Running upgrade 228916769bd2 -> cc3651803714, add main transcoding progress column to MediaEntry
_____________________ TestModerationViews.testBanUnBanUser _____________________
Traceback (most recent call last):
  File "/home/build/mediagoblin/mediagoblin/tests/test_moderation.py", line 227, in testBanUnBanUser
    self.login('admin')
  File "/home/build/mediagoblin/mediagoblin/tests/test_moderation.py", line 40, in login
    self.test_app.post(
  File "/usr/lib/python3.9/site-packages/webtest/app.py", line 368, in post
    return self._gen_request('POST', url, params=params, headers=headers,
  File "/usr/lib/python3.9/site-packages/webtest/app.py", line 749, in _gen_request
    return self.do_request(req, status=status,
  File "/usr/lib/python3.9/site-packages/webtest/app.py", line 620, in do_request
    res = req.get_response(app, catch_exc_info=True)
  File "/usr/lib/python3.9/site-packages/webob/request.py", line 1309, in send
    status, headers, app_iter, exc_info = self.call_application(
  File "/usr/lib/python3.9/site-packages/webob/request.py", line 1278, in call_application
    app_iter = application(self.environ, start_response)
  File "/usr/lib/python3.9/site-packages/webtest/lint.py", line 196, in lint_app
    iterator = application(environ, start_response_wrapper)
  File "/home/build/mediagoblin/mediagoblin/app.py", line 344, in __call__
    return self.call_backend(environ, start_response)
  File "/home/build/mediagoblin/lib/python3.9/site-packages/Werkzeug-1.0.1-py3.9.egg/werkzeug/middleware/shared_data.py", line 260, in __call__
    return self.app(environ, start_response)
  File "/home/build/mediagoblin/mediagoblin/app.py", line 278, in call_backend
    return self._finish_call_backend(request, environ, start_response)
  File "/home/build/mediagoblin/mediagoblin/app.py", line 320, in _finish_call_backend
    response = controller(request)
  File "/home/build/mediagoblin/mediagoblin/decorators.py", line 366, in wrapper
    return controller(request, *args, **kwargs)
  File "/home/build/mediagoblin/mediagoblin/auth/views.py", line 93, in login
    user = check_login_simple(
  File "/home/build/mediagoblin/mediagoblin/auth/tools.py", line 172, in check_login_simple
    if not auth.check_password(password, user.pw_hash):
  File "/home/build/mediagoblin/mediagoblin/auth/__init__.py", line 42, in check_password
    return hook_handle("auth_check_password",
  File "/home/build/mediagoblin/mediagoblin/tools/pluginapi.py", line 306, in hook_handle
    result = callable(*args, **kwargs)
  File "/home/build/mediagoblin/mediagoblin/plugins/basic_auth/__init__.py", line 91, in check_password
    return auth_tools.bcrypt_check_password(raw_pass,
  File "/home/build/mediagoblin/mediagoblin/plugins/basic_auth/tools.py", line 51, in bcrypt_check_password
    randplus_stored_hash = bcrypt.hashpw(stored_hash, rand_salt)
  File "/home/build/mediagoblin/lib/python3.9/site-packages/bcrypt-3.2.0-py3.9-linux-x86_64.egg/bcrypt/__init__.py", line 80, in hashpw
    raise TypeError("Unicode-objects must be encoded before hashing")
TypeError: Unicode-objects must be encoded before hashing
---------------------------- Captured stdout setup -----------------------------
Laying foundations for __main__:
   + Laying foundations for Privilege table
Laying foundations for __main__:
   + Laying foundations for Privilege table
---------------------------- Captured stderr setup -----------------------------
INFO  [alembic.runtime.migration] Context impl SQLiteImpl.
INFO  [alembic.runtime.migration] Will assume non-transactional DDL.
INFO  [alembic.runtime.migration] Running upgrade  -> 52bf0ccbedc1, initial revision
INFO  [alembic.runtime.migration] Running upgrade 52bf0ccbedc1 -> a98c1a320e88, Image media type initial migration
INFO  [alembic.runtime.migration] Running upgrade 52bf0ccbedc1 -> 071abb33d1da, OpenID plugin initial migration
INFO  [alembic.runtime.migration] Running upgrade 52bf0ccbedc1 -> 101510e3a713, #5382 Removes graveyard items from collections
INFO  [alembic.runtime.migration] Running upgrade 101510e3a713 -> 8429e33fdf7, Remove the Graveyard objects from CommentNotification objects
INFO  [alembic.runtime.migration] Running upgrade 8429e33fdf7 -> 4066b9f8b84a, use_comment_link_ids_notifications
INFO  [alembic.runtime.migration] Running upgrade 4066b9f8b84a -> 3145accb8fe3, remove tombstone comment wrappers
INFO  [alembic.runtime.migration] Running upgrade 3145accb8fe3 -> 228916769bd2, ensure Report.object_id is nullable
INFO  [alembic.runtime.migration] Running upgrade 228916769bd2 -> afd3d1da5e29, Subtitle plugin initial migration
INFO  [alembic.runtime.migration] Running upgrade 228916769bd2 -> cc3651803714, add main transcoding progress column to MediaEntry
INFO  [alembic.runtime.migration] Context impl SQLiteImpl.
INFO  [alembic.runtime.migration] Will assume non-transactional DDL.
INFO  [alembic.runtime.migration] Running upgrade  -> 52bf0ccbedc1, initial revision
INFO  [alembic.runtime.migration] Running upgrade 52bf0ccbedc1 -> a98c1a320e88, Image media type initial migration
INFO  [alembic.runtime.migration] Running upgrade 52bf0ccbedc1 -> 071abb33d1da, OpenID plugin initial migration
INFO  [alembic.runtime.migration] Running upgrade 52bf0ccbedc1 -> 101510e3a713, #5382 Removes graveyard items from collections
INFO  [alembic.runtime.migration] Running upgrade 101510e3a713 -> 8429e33fdf7, Remove the Graveyard objects from CommentNotification objects
INFO  [alembic.runtime.migration] Running upgrade 8429e33fdf7 -> 4066b9f8b84a, use_comment_link_ids_notifications
INFO  [alembic.runtime.migration] Running upgrade 4066b9f8b84a -> 3145accb8fe3, remove tombstone comment wrappers
INFO  [alembic.runtime.migration] Running upgrade 3145accb8fe3 -> 228916769bd2, ensure Report.object_id is nullable
INFO  [alembic.runtime.migration] Running upgrade 228916769bd2 -> afd3d1da5e29, Subtitle plugin initial migration
INFO  [alembic.runtime.migration] Running upgrade 228916769bd2 -> cc3651803714, add main transcoding progress column to MediaEntry
____________________________ Test_PWG.test_session _____________________________
Traceback (most recent call last):
  File "/home/build/mediagoblin/mediagoblin/tests/test_piwigo.py", line 49, in test_session
    resp = self.do_post("pwg.session.login",
  File "/home/build/mediagoblin/mediagoblin/tests/test_piwigo.py", line 36, in do_post
    return self.test_app.post("/api/piwigo/ws.php", params)
  File "/usr/lib/python3.9/site-packages/webtest/app.py", line 368, in post
    return self._gen_request('POST', url, params=params, headers=headers,
  File "/usr/lib/python3.9/site-packages/webtest/app.py", line 749, in _gen_request
    return self.do_request(req, status=status,
  File "/usr/lib/python3.9/site-packages/webtest/app.py", line 620, in do_request
    res = req.get_response(app, catch_exc_info=True)
  File "/usr/lib/python3.9/site-packages/webob/request.py", line 1309, in send
    status, headers, app_iter, exc_info = self.call_application(
  File "/usr/lib/python3.9/site-packages/webob/request.py", line 1278, in call_application
    app_iter = application(self.environ, start_response)
  File "/usr/lib/python3.9/site-packages/webtest/lint.py", line 196, in lint_app
    iterator = application(environ, start_response_wrapper)
  File "/home/build/mediagoblin/mediagoblin/app.py", line 344, in __call__
    return self.call_backend(environ, start_response)
  File "/home/build/mediagoblin/lib/python3.9/site-packages/Werkzeug-1.0.1-py3.9.egg/werkzeug/middleware/shared_data.py", line 260, in __call__
    return self.app(environ, start_response)
  File "/home/build/mediagoblin/mediagoblin/app.py", line 278, in call_backend
    return self._finish_call_backend(request, environ, start_response)
  File "/home/build/mediagoblin/mediagoblin/app.py", line 320, in _finish_call_backend
    response = controller(request)
  File "/home/build/mediagoblin/mediagoblin/plugins/piwigo/views.py", line 219, in ws_php
    result = func(request)
  File "/home/build/mediagoblin/mediagoblin/plugins/piwigo/views.py", line 45, in pwg_login
    user = check_login_simple(username, password)
  File "/home/build/mediagoblin/mediagoblin/auth/tools.py", line 172, in check_login_simple
    if not auth.check_password(password, user.pw_hash):
  File "/home/build/mediagoblin/mediagoblin/auth/__init__.py", line 42, in check_password
    return hook_handle("auth_check_password",
  File "/home/build/mediagoblin/mediagoblin/tools/pluginapi.py", line 306, in hook_handle
    result = callable(*args, **kwargs)
  File "/home/build/mediagoblin/mediagoblin/plugins/basic_auth/__init__.py", line 91, in check_password
    return auth_tools.bcrypt_check_password(raw_pass,
  File "/home/build/mediagoblin/mediagoblin/plugins/basic_auth/tools.py", line 51, in bcrypt_check_password
    randplus_stored_hash = bcrypt.hashpw(stored_hash, rand_salt)
  File "/home/build/mediagoblin/lib/python3.9/site-packages/bcrypt-3.2.0-py3.9-linux-x86_64.egg/bcrypt/__init__.py", line 80, in hashpw
    raise TypeError("Unicode-objects must be encoded before hashing")
TypeError: Unicode-objects must be encoded before hashing
---------------------------- Captured stdout setup -----------------------------
Laying foundations for __main__:
   + Laying foundations for Privilege table
Laying foundations for __main__:
   + Laying foundations for Privilege table
---------------------------- Captured stderr setup -----------------------------
INFO  [alembic.runtime.migration] Context impl SQLiteImpl.
INFO  [alembic.runtime.migration] Will assume non-transactional DDL.
INFO  [alembic.runtime.migration] Running upgrade  -> 52bf0ccbedc1, initial revision
INFO  [alembic.runtime.migration] Running upgrade 52bf0ccbedc1 -> a98c1a320e88, Image media type initial migration
INFO  [alembic.runtime.migration] Running upgrade 52bf0ccbedc1 -> 071abb33d1da, OpenID plugin initial migration
INFO  [alembic.runtime.migration] Running upgrade 52bf0ccbedc1 -> 101510e3a713, #5382 Removes graveyard items from collections
INFO  [alembic.runtime.migration] Running upgrade 101510e3a713 -> 8429e33fdf7, Remove the Graveyard objects from CommentNotification objects
INFO  [alembic.runtime.migration] Running upgrade 8429e33fdf7 -> 4066b9f8b84a, use_comment_link_ids_notifications
INFO  [alembic.runtime.migration] Running upgrade 4066b9f8b84a -> 3145accb8fe3, remove tombstone comment wrappers
INFO  [alembic.runtime.migration] Running upgrade 3145accb8fe3 -> 228916769bd2, ensure Report.object_id is nullable
INFO  [alembic.runtime.migration] Running upgrade 228916769bd2 -> afd3d1da5e29, Subtitle plugin initial migration
INFO  [alembic.runtime.migration] Running upgrade 228916769bd2 -> cc3651803714, add main transcoding progress column to MediaEntry
INFO  [alembic.runtime.migration] Context impl SQLiteImpl.
INFO  [alembic.runtime.migration] Will assume non-transactional DDL.
INFO  [alembic.runtime.migration] Running upgrade  -> 52bf0ccbedc1, initial revision
INFO  [alembic.runtime.migration] Running upgrade 52bf0ccbedc1 -> a98c1a320e88, Image media type initial migration
INFO  [alembic.runtime.migration] Running upgrade 52bf0ccbedc1 -> 071abb33d1da, OpenID plugin initial migration
INFO  [alembic.runtime.migration] Running upgrade 52bf0ccbedc1 -> 101510e3a713, #5382 Removes graveyard items from collections
INFO  [alembic.runtime.migration] Running upgrade 101510e3a713 -> 8429e33fdf7, Remove the Graveyard objects from CommentNotification objects
INFO  [alembic.runtime.migration] Running upgrade 8429e33fdf7 -> 4066b9f8b84a, use_comment_link_ids_notifications
INFO  [alembic.runtime.migration] Running upgrade 4066b9f8b84a -> 3145accb8fe3, remove tombstone comment wrappers
INFO  [alembic.runtime.migration] Running upgrade 3145accb8fe3 -> 228916769bd2, ensure Report.object_id is nullable
INFO  [alembic.runtime.migration] Running upgrade 228916769bd2 -> afd3d1da5e29, Subtitle plugin initial migration
INFO  [alembic.runtime.migration] Running upgrade 228916769bd2 -> cc3651803714, add main transcoding progress column to MediaEntry
__________________ TestPrivilegeFunctionality.testUserBanned ___________________
Traceback (most recent call last):
  File "/home/build/mediagoblin/mediagoblin/tests/test_privileges.py", line 71, in testUserBanned
    self.login('natalie')
  File "/home/build/mediagoblin/mediagoblin/tests/test_privileges.py", line 43, in login
    self.test_app.post(
  File "/usr/lib/python3.9/site-packages/webtest/app.py", line 368, in post
    return self._gen_request('POST', url, params=params, headers=headers,
  File "/usr/lib/python3.9/site-packages/webtest/app.py", line 749, in _gen_request
    return self.do_request(req, status=status,
  File "/usr/lib/python3.9/site-packages/webtest/app.py", line 620, in do_request
    res = req.get_response(app, catch_exc_info=True)
  File "/usr/lib/python3.9/site-packages/webob/request.py", line 1309, in send
    status, headers, app_iter, exc_info = self.call_application(
  File "/usr/lib/python3.9/site-packages/webob/request.py", line 1278, in call_application
    app_iter = application(self.environ, start_response)
  File "/usr/lib/python3.9/site-packages/webtest/lint.py", line 196, in lint_app
    iterator = application(environ, start_response_wrapper)
  File "/home/build/mediagoblin/mediagoblin/app.py", line 344, in __call__
    return self.call_backend(environ, start_response)
  File "/home/build/mediagoblin/lib/python3.9/site-packages/Werkzeug-1.0.1-py3.9.egg/werkzeug/middleware/shared_data.py", line 260, in __call__
    return self.app(environ, start_response)
  File "/home/build/mediagoblin/mediagoblin/app.py", line 278, in call_backend
    return self._finish_call_backend(request, environ, start_response)
  File "/home/build/mediagoblin/mediagoblin/app.py", line 320, in _finish_call_backend
    response = controller(request)
  File "/home/build/mediagoblin/mediagoblin/decorators.py", line 366, in wrapper
    return controller(request, *args, **kwargs)
  File "/home/build/mediagoblin/mediagoblin/auth/views.py", line 93, in login
    user = check_login_simple(
  File "/home/build/mediagoblin/mediagoblin/auth/tools.py", line 172, in check_login_simple
    if not auth.check_password(password, user.pw_hash):
  File "/home/build/mediagoblin/mediagoblin/auth/__init__.py", line 42, in check_password
    return hook_handle("auth_check_password",
  File "/home/build/mediagoblin/mediagoblin/tools/pluginapi.py", line 306, in hook_handle
    result = callable(*args, **kwargs)
  File "/home/build/mediagoblin/mediagoblin/plugins/basic_auth/__init__.py", line 91, in check_password
    return auth_tools.bcrypt_check_password(raw_pass,
  File "/home/build/mediagoblin/mediagoblin/plugins/basic_auth/tools.py", line 51, in bcrypt_check_password
    randplus_stored_hash = bcrypt.hashpw(stored_hash, rand_salt)
  File "/home/build/mediagoblin/lib/python3.9/site-packages/bcrypt-3.2.0-py3.9-linux-x86_64.egg/bcrypt/__init__.py", line 80, in hashpw
    raise TypeError("Unicode-objects must be encoded before hashing")
TypeError: Unicode-objects must be encoded before hashing
---------------------------- Captured stdout setup -----------------------------
Laying foundations for __main__:
   + Laying foundations for Privilege table
Laying foundations for __main__:
   + Laying foundations for Privilege table
---------------------------- Captured stderr setup -----------------------------
INFO  [alembic.runtime.migration] Context impl SQLiteImpl.
INFO  [alembic.runtime.migration] Will assume non-transactional DDL.
INFO  [alembic.runtime.migration] Running upgrade  -> 52bf0ccbedc1, initial revision
INFO  [alembic.runtime.migration] Running upgrade 52bf0ccbedc1 -> a98c1a320e88, Image media type initial migration
INFO  [alembic.runtime.migration] Running upgrade 52bf0ccbedc1 -> 071abb33d1da, OpenID plugin initial migration
INFO  [alembic.runtime.migration] Running upgrade 52bf0ccbedc1 -> 101510e3a713, #5382 Removes graveyard items from collections
INFO  [alembic.runtime.migration] Running upgrade 101510e3a713 -> 8429e33fdf7, Remove the Graveyard objects from CommentNotification objects
INFO  [alembic.runtime.migration] Running upgrade 8429e33fdf7 -> 4066b9f8b84a, use_comment_link_ids_notifications
INFO  [alembic.runtime.migration] Running upgrade 4066b9f8b84a -> 3145accb8fe3, remove tombstone comment wrappers
INFO  [alembic.runtime.migration] Running upgrade 3145accb8fe3 -> 228916769bd2, ensure Report.object_id is nullable
INFO  [alembic.runtime.migration] Running upgrade 228916769bd2 -> afd3d1da5e29, Subtitle plugin initial migration
INFO  [alembic.runtime.migration] Running upgrade 228916769bd2 -> cc3651803714, add main transcoding progress column to MediaEntry
INFO  [alembic.runtime.migration] Context impl SQLiteImpl.
INFO  [alembic.runtime.migration] Will assume non-transactional DDL.
INFO  [alembic.runtime.migration] Running upgrade  -> 52bf0ccbedc1, initial revision
INFO  [alembic.runtime.migration] Running upgrade 52bf0ccbedc1 -> a98c1a320e88, Image media type initial migration
INFO  [alembic.runtime.migration] Running upgrade 52bf0ccbedc1 -> 071abb33d1da, OpenID plugin initial migration
INFO  [alembic.runtime.migration] Running upgrade 52bf0ccbedc1 -> 101510e3a713, #5382 Removes graveyard items from collections
INFO  [alembic.runtime.migration] Running upgrade 101510e3a713 -> 8429e33fdf7, Remove the Graveyard objects from CommentNotification objects
INFO  [alembic.runtime.migration] Running upgrade 8429e33fdf7 -> 4066b9f8b84a, use_comment_link_ids_notifications
INFO  [alembic.runtime.migration] Running upgrade 4066b9f8b84a -> 3145accb8fe3, remove tombstone comment wrappers
INFO  [alembic.runtime.migration] Running upgrade 3145accb8fe3 -> 228916769bd2, ensure Report.object_id is nullable
INFO  [alembic.runtime.migration] Running upgrade 228916769bd2 -> afd3d1da5e29, Subtitle plugin initial migration
INFO  [alembic.runtime.migration] Running upgrade 228916769bd2 -> cc3651803714, add main transcoding progress column to MediaEntry
_______________ TestPrivilegeFunctionality.testVariousPrivileges _______________
Traceback (most recent call last):
  File "/home/build/mediagoblin/mediagoblin/tests/test_privileges.py", line 124, in testVariousPrivileges
    self.login('natalie')
  File "/home/build/mediagoblin/mediagoblin/tests/test_privileges.py", line 43, in login
    self.test_app.post(
  File "/usr/lib/python3.9/site-packages/webtest/app.py", line 368, in post
    return self._gen_request('POST', url, params=params, headers=headers,
  File "/usr/lib/python3.9/site-packages/webtest/app.py", line 749, in _gen_request
    return self.do_request(req, status=status,
  File "/usr/lib/python3.9/site-packages/webtest/app.py", line 620, in do_request
    res = req.get_response(app, catch_exc_info=True)
  File "/usr/lib/python3.9/site-packages/webob/request.py", line 1309, in send
    status, headers, app_iter, exc_info = self.call_application(
  File "/usr/lib/python3.9/site-packages/webob/request.py", line 1278, in call_application
    app_iter = application(self.environ, start_response)
  File "/usr/lib/python3.9/site-packages/webtest/lint.py", line 196, in lint_app
    iterator = application(environ, start_response_wrapper)
  File "/home/build/mediagoblin/mediagoblin/app.py", line 344, in __call__
    return self.call_backend(environ, start_response)
  File "/home/build/mediagoblin/lib/python3.9/site-packages/Werkzeug-1.0.1-py3.9.egg/werkzeug/middleware/shared_data.py", line 260, in __call__
    return self.app(environ, start_response)
  File "/home/build/mediagoblin/mediagoblin/app.py", line 278, in call_backend
    return self._finish_call_backend(request, environ, start_response)
  File "/home/build/mediagoblin/mediagoblin/app.py", line 320, in _finish_call_backend
    response = controller(request)
  File "/home/build/mediagoblin/mediagoblin/decorators.py", line 366, in wrapper
    return controller(request, *args, **kwargs)
  File "/home/build/mediagoblin/mediagoblin/auth/views.py", line 93, in login
    user = check_login_simple(
  File "/home/build/mediagoblin/mediagoblin/auth/tools.py", line 172, in check_login_simple
    if not auth.check_password(password, user.pw_hash):
  File "/home/build/mediagoblin/mediagoblin/auth/__init__.py", line 42, in check_password
    return hook_handle("auth_check_password",
  File "/home/build/mediagoblin/mediagoblin/tools/pluginapi.py", line 306, in hook_handle
    result = callable(*args, **kwargs)
  File "/home/build/mediagoblin/mediagoblin/plugins/basic_auth/__init__.py", line 91, in check_password
    return auth_tools.bcrypt_check_password(raw_pass,
  File "/home/build/mediagoblin/mediagoblin/plugins/basic_auth/tools.py", line 51, in bcrypt_check_password
    randplus_stored_hash = bcrypt.hashpw(stored_hash, rand_salt)
  File "/home/build/mediagoblin/lib/python3.9/site-packages/bcrypt-3.2.0-py3.9-linux-x86_64.egg/bcrypt/__init__.py", line 80, in hashpw
    raise TypeError("Unicode-objects must be encoded before hashing")
TypeError: Unicode-objects must be encoded before hashing
---------------------------- Captured stdout setup -----------------------------
Laying foundations for __main__:
   + Laying foundations for Privilege table
Laying foundations for __main__:
   + Laying foundations for Privilege table
---------------------------- Captured stderr setup -----------------------------
INFO  [alembic.runtime.migration] Context impl SQLiteImpl.
INFO  [alembic.runtime.migration] Will assume non-transactional DDL.
INFO  [alembic.runtime.migration] Running upgrade  -> 52bf0ccbedc1, initial revision
INFO  [alembic.runtime.migration] Running upgrade 52bf0ccbedc1 -> a98c1a320e88, Image media type initial migration
INFO  [alembic.runtime.migration] Running upgrade 52bf0ccbedc1 -> 071abb33d1da, OpenID plugin initial migration
INFO  [alembic.runtime.migration] Running upgrade 52bf0ccbedc1 -> 101510e3a713, #5382 Removes graveyard items from collections
INFO  [alembic.runtime.migration] Running upgrade 101510e3a713 -> 8429e33fdf7, Remove the Graveyard objects from CommentNotification objects
INFO  [alembic.runtime.migration] Running upgrade 8429e33fdf7 -> 4066b9f8b84a, use_comment_link_ids_notifications
INFO  [alembic.runtime.migration] Running upgrade 4066b9f8b84a -> 3145accb8fe3, remove tombstone comment wrappers
INFO  [alembic.runtime.migration] Running upgrade 3145accb8fe3 -> 228916769bd2, ensure Report.object_id is nullable
INFO  [alembic.runtime.migration] Running upgrade 228916769bd2 -> afd3d1da5e29, Subtitle plugin initial migration
INFO  [alembic.runtime.migration] Running upgrade 228916769bd2 -> cc3651803714, add main transcoding progress column to MediaEntry
INFO  [alembic.runtime.migration] Context impl SQLiteImpl.
INFO  [alembic.runtime.migration] Will assume non-transactional DDL.
INFO  [alembic.runtime.migration] Running upgrade  -> 52bf0ccbedc1, initial revision
INFO  [alembic.runtime.migration] Running upgrade 52bf0ccbedc1 -> a98c1a320e88, Image media type initial migration
INFO  [alembic.runtime.migration] Running upgrade 52bf0ccbedc1 -> 071abb33d1da, OpenID plugin initial migration
INFO  [alembic.runtime.migration] Running upgrade 52bf0ccbedc1 -> 101510e3a713, #5382 Removes graveyard items from collections
INFO  [alembic.runtime.migration] Running upgrade 101510e3a713 -> 8429e33fdf7, Remove the Graveyard objects from CommentNotification objects
INFO  [alembic.runtime.migration] Running upgrade 8429e33fdf7 -> 4066b9f8b84a, use_comment_link_ids_notifications
INFO  [alembic.runtime.migration] Running upgrade 4066b9f8b84a -> 3145accb8fe3, remove tombstone comment wrappers
INFO  [alembic.runtime.migration] Running upgrade 3145accb8fe3 -> 228916769bd2, ensure Report.object_id is nullable
INFO  [alembic.runtime.migration] Running upgrade 228916769bd2 -> afd3d1da5e29, Subtitle plugin initial migration
INFO  [alembic.runtime.migration] Running upgrade 228916769bd2 -> cc3651803714, add main transcoding progress column to MediaEntry
______________________ TestReportFiling.testMediaReports _______________________
Traceback (most recent call last):
  File "/home/build/mediagoblin/mediagoblin/tests/test_reporting.py", line 60, in testMediaReports
    self.login('allie')
  File "/home/build/mediagoblin/mediagoblin/tests/test_reporting.py", line 35, in login
    self.test_app.post(
  File "/usr/lib/python3.9/site-packages/webtest/app.py", line 368, in post
    return self._gen_request('POST', url, params=params, headers=headers,
  File "/usr/lib/python3.9/site-packages/webtest/app.py", line 749, in _gen_request
    return self.do_request(req, status=status,
  File "/usr/lib/python3.9/site-packages/webtest/app.py", line 620, in do_request
    res = req.get_response(app, catch_exc_info=True)
  File "/usr/lib/python3.9/site-packages/webob/request.py", line 1309, in send
    status, headers, app_iter, exc_info = self.call_application(
  File "/usr/lib/python3.9/site-packages/webob/request.py", line 1278, in call_application
    app_iter = application(self.environ, start_response)
  File "/usr/lib/python3.9/site-packages/webtest/lint.py", line 196, in lint_app
    iterator = application(environ, start_response_wrapper)
  File "/home/build/mediagoblin/mediagoblin/app.py", line 344, in __call__
    return self.call_backend(environ, start_response)
  File "/home/build/mediagoblin/lib/python3.9/site-packages/Werkzeug-1.0.1-py3.9.egg/werkzeug/middleware/shared_data.py", line 260, in __call__
    return self.app(environ, start_response)
  File "/home/build/mediagoblin/mediagoblin/app.py", line 278, in call_backend
    return self._finish_call_backend(request, environ, start_response)
  File "/home/build/mediagoblin/mediagoblin/app.py", line 320, in _finish_call_backend
    response = controller(request)
  File "/home/build/mediagoblin/mediagoblin/decorators.py", line 366, in wrapper
    return controller(request, *args, **kwargs)
  File "/home/build/mediagoblin/mediagoblin/auth/views.py", line 93, in login
    user = check_login_simple(
  File "/home/build/mediagoblin/mediagoblin/auth/tools.py", line 172, in check_login_simple
    if not auth.check_password(password, user.pw_hash):
  File "/home/build/mediagoblin/mediagoblin/auth/__init__.py", line 42, in check_password
    return hook_handle("auth_check_password",
  File "/home/build/mediagoblin/mediagoblin/tools/pluginapi.py", line 306, in hook_handle
    result = callable(*args, **kwargs)
  File "/home/build/mediagoblin/mediagoblin/plugins/basic_auth/__init__.py", line 91, in check_password
    return auth_tools.bcrypt_check_password(raw_pass,
  File "/home/build/mediagoblin/mediagoblin/plugins/basic_auth/tools.py", line 51, in bcrypt_check_password
    randplus_stored_hash = bcrypt.hashpw(stored_hash, rand_salt)
  File "/home/build/mediagoblin/lib/python3.9/site-packages/bcrypt-3.2.0-py3.9-linux-x86_64.egg/bcrypt/__init__.py", line 80, in hashpw
    raise TypeError("Unicode-objects must be encoded before hashing")
TypeError: Unicode-objects must be encoded before hashing
---------------------------- Captured stdout setup -----------------------------
Laying foundations for __main__:
   + Laying foundations for Privilege table
Laying foundations for __main__:
   + Laying foundations for Privilege table
---------------------------- Captured stderr setup -----------------------------
INFO  [alembic.runtime.migration] Context impl SQLiteImpl.
INFO  [alembic.runtime.migration] Will assume non-transactional DDL.
INFO  [alembic.runtime.migration] Running upgrade  -> 52bf0ccbedc1, initial revision
INFO  [alembic.runtime.migration] Running upgrade 52bf0ccbedc1 -> a98c1a320e88, Image media type initial migration
INFO  [alembic.runtime.migration] Running upgrade 52bf0ccbedc1 -> 071abb33d1da, OpenID plugin initial migration
INFO  [alembic.runtime.migration] Running upgrade 52bf0ccbedc1 -> 101510e3a713, #5382 Removes graveyard items from collections
INFO  [alembic.runtime.migration] Running upgrade 101510e3a713 -> 8429e33fdf7, Remove the Graveyard objects from CommentNotification objects
INFO  [alembic.runtime.migration] Running upgrade 8429e33fdf7 -> 4066b9f8b84a, use_comment_link_ids_notifications
INFO  [alembic.runtime.migration] Running upgrade 4066b9f8b84a -> 3145accb8fe3, remove tombstone comment wrappers
INFO  [alembic.runtime.migration] Running upgrade 3145accb8fe3 -> 228916769bd2, ensure Report.object_id is nullable
INFO  [alembic.runtime.migration] Running upgrade 228916769bd2 -> afd3d1da5e29, Subtitle plugin initial migration
INFO  [alembic.runtime.migration] Running upgrade 228916769bd2 -> cc3651803714, add main transcoding progress column to MediaEntry
INFO  [alembic.runtime.migration] Context impl SQLiteImpl.
INFO  [alembic.runtime.migration] Will assume non-transactional DDL.
INFO  [alembic.runtime.migration] Running upgrade  -> 52bf0ccbedc1, initial revision
INFO  [alembic.runtime.migration] Running upgrade 52bf0ccbedc1 -> a98c1a320e88, Image media type initial migration
INFO  [alembic.runtime.migration] Running upgrade 52bf0ccbedc1 -> 071abb33d1da, OpenID plugin initial migration
INFO  [alembic.runtime.migration] Running upgrade 52bf0ccbedc1 -> 101510e3a713, #5382 Removes graveyard items from collections
INFO  [alembic.runtime.migration] Running upgrade 101510e3a713 -> 8429e33fdf7, Remove the Graveyard objects from CommentNotification objects
INFO  [alembic.runtime.migration] Running upgrade 8429e33fdf7 -> 4066b9f8b84a, use_comment_link_ids_notifications
INFO  [alembic.runtime.migration] Running upgrade 4066b9f8b84a -> 3145accb8fe3, remove tombstone comment wrappers
INFO  [alembic.runtime.migration] Running upgrade 3145accb8fe3 -> 228916769bd2, ensure Report.object_id is nullable
INFO  [alembic.runtime.migration] Running upgrade 228916769bd2 -> afd3d1da5e29, Subtitle plugin initial migration
INFO  [alembic.runtime.migration] Running upgrade 228916769bd2 -> cc3651803714, add main transcoding progress column to MediaEntry
_____________________ TestReportFiling.testCommentReports ______________________
Traceback (most recent call last):
  File "/home/build/mediagoblin/mediagoblin/tests/test_reporting.py", line 90, in testCommentReports
    self.login('allie')
  File "/home/build/mediagoblin/mediagoblin/tests/test_reporting.py", line 35, in login
    self.test_app.post(
  File "/usr/lib/python3.9/site-packages/webtest/app.py", line 368, in post
    return self._gen_request('POST', url, params=params, headers=headers,
  File "/usr/lib/python3.9/site-packages/webtest/app.py", line 749, in _gen_request
    return self.do_request(req, status=status,
  File "/usr/lib/python3.9/site-packages/webtest/app.py", line 620, in do_request
    res = req.get_response(app, catch_exc_info=True)
  File "/usr/lib/python3.9/site-packages/webob/request.py", line 1309, in send
    status, headers, app_iter, exc_info = self.call_application(
  File "/usr/lib/python3.9/site-packages/webob/request.py", line 1278, in call_application
    app_iter = application(self.environ, start_response)
  File "/usr/lib/python3.9/site-packages/webtest/lint.py", line 196, in lint_app
    iterator = application(environ, start_response_wrapper)
  File "/home/build/mediagoblin/mediagoblin/app.py", line 344, in __call__
    return self.call_backend(environ, start_response)
  File "/home/build/mediagoblin/lib/python3.9/site-packages/Werkzeug-1.0.1-py3.9.egg/werkzeug/middleware/shared_data.py", line 260, in __call__
    return self.app(environ, start_response)
  File "/home/build/mediagoblin/mediagoblin/app.py", line 278, in call_backend
    return self._finish_call_backend(request, environ, start_response)
  File "/home/build/mediagoblin/mediagoblin/app.py", line 320, in _finish_call_backend
    response = controller(request)
  File "/home/build/mediagoblin/mediagoblin/decorators.py", line 366, in wrapper
    return controller(request, *args, **kwargs)
  File "/home/build/mediagoblin/mediagoblin/auth/views.py", line 93, in login
    user = check_login_simple(
  File "/home/build/mediagoblin/mediagoblin/auth/tools.py", line 172, in check_login_simple
    if not auth.check_password(password, user.pw_hash):
  File "/home/build/mediagoblin/mediagoblin/auth/__init__.py", line 42, in check_password
    return hook_handle("auth_check_password",
  File "/home/build/mediagoblin/mediagoblin/tools/pluginapi.py", line 306, in hook_handle
    result = callable(*args, **kwargs)
  File "/home/build/mediagoblin/mediagoblin/plugins/basic_auth/__init__.py", line 91, in check_password
    return auth_tools.bcrypt_check_password(raw_pass,
  File "/home/build/mediagoblin/mediagoblin/plugins/basic_auth/tools.py", line 51, in bcrypt_check_password
    randplus_stored_hash = bcrypt.hashpw(stored_hash, rand_salt)
  File "/home/build/mediagoblin/lib/python3.9/site-packages/bcrypt-3.2.0-py3.9-linux-x86_64.egg/bcrypt/__init__.py", line 80, in hashpw
    raise TypeError("Unicode-objects must be encoded before hashing")
TypeError: Unicode-objects must be encoded before hashing
---------------------------- Captured stdout setup -----------------------------
Laying foundations for __main__:
   + Laying foundations for Privilege table
Laying foundations for __main__:
   + Laying foundations for Privilege table
---------------------------- Captured stderr setup -----------------------------
INFO  [alembic.runtime.migration] Context impl SQLiteImpl.
INFO  [alembic.runtime.migration] Will assume non-transactional DDL.
INFO  [alembic.runtime.migration] Running upgrade  -> 52bf0ccbedc1, initial revision
INFO  [alembic.runtime.migration] Running upgrade 52bf0ccbedc1 -> a98c1a320e88, Image media type initial migration
INFO  [alembic.runtime.migration] Running upgrade 52bf0ccbedc1 -> 071abb33d1da, OpenID plugin initial migration
INFO  [alembic.runtime.migration] Running upgrade 52bf0ccbedc1 -> 101510e3a713, #5382 Removes graveyard items from collections
INFO  [alembic.runtime.migration] Running upgrade 101510e3a713 -> 8429e33fdf7, Remove the Graveyard objects from CommentNotification objects
INFO  [alembic.runtime.migration] Running upgrade 8429e33fdf7 -> 4066b9f8b84a, use_comment_link_ids_notifications
INFO  [alembic.runtime.migration] Running upgrade 4066b9f8b84a -> 3145accb8fe3, remove tombstone comment wrappers
INFO  [alembic.runtime.migration] Running upgrade 3145accb8fe3 -> 228916769bd2, ensure Report.object_id is nullable
INFO  [alembic.runtime.migration] Running upgrade 228916769bd2 -> afd3d1da5e29, Subtitle plugin initial migration
INFO  [alembic.runtime.migration] Running upgrade 228916769bd2 -> cc3651803714, add main transcoding progress column to MediaEntry
INFO  [alembic.runtime.migration] Context impl SQLiteImpl.
INFO  [alembic.runtime.migration] Will assume non-transactional DDL.
INFO  [alembic.runtime.migration] Running upgrade  -> 52bf0ccbedc1, initial revision
INFO  [alembic.runtime.migration] Running upgrade 52bf0ccbedc1 -> a98c1a320e88, Image media type initial migration
INFO  [alembic.runtime.migration] Running upgrade 52bf0ccbedc1 -> 071abb33d1da, OpenID plugin initial migration
INFO  [alembic.runtime.migration] Running upgrade 52bf0ccbedc1 -> 101510e3a713, #5382 Removes graveyard items from collections
INFO  [alembic.runtime.migration] Running upgrade 101510e3a713 -> 8429e33fdf7, Remove the Graveyard objects from CommentNotification objects
INFO  [alembic.runtime.migration] Running upgrade 8429e33fdf7 -> 4066b9f8b84a, use_comment_link_ids_notifications
INFO  [alembic.runtime.migration] Running upgrade 4066b9f8b84a -> 3145accb8fe3, remove tombstone comment wrappers
INFO  [alembic.runtime.migration] Running upgrade 3145accb8fe3 -> 228916769bd2, ensure Report.object_id is nullable
INFO  [alembic.runtime.migration] Running upgrade 228916769bd2 -> afd3d1da5e29, Subtitle plugin initial migration
INFO  [alembic.runtime.migration] Running upgrade 228916769bd2 -> cc3651803714, add main transcoding progress column to MediaEntry
____________________ TestReportFiling.testArchivingReports _____________________
Traceback (most recent call last):
  File "/home/build/mediagoblin/mediagoblin/tests/test_reporting.py", line 126, in testArchivingReports
    self.login('natalie')
  File "/home/build/mediagoblin/mediagoblin/tests/test_reporting.py", line 35, in login
    self.test_app.post(
  File "/usr/lib/python3.9/site-packages/webtest/app.py", line 368, in post
    return self._gen_request('POST', url, params=params, headers=headers,
  File "/usr/lib/python3.9/site-packages/webtest/app.py", line 749, in _gen_request
    return self.do_request(req, status=status,
  File "/usr/lib/python3.9/site-packages/webtest/app.py", line 620, in do_request
    res = req.get_response(app, catch_exc_info=True)
  File "/usr/lib/python3.9/site-packages/webob/request.py", line 1309, in send
    status, headers, app_iter, exc_info = self.call_application(
  File "/usr/lib/python3.9/site-packages/webob/request.py", line 1278, in call_application
    app_iter = application(self.environ, start_response)
  File "/usr/lib/python3.9/site-packages/webtest/lint.py", line 196, in lint_app
    iterator = application(environ, start_response_wrapper)
  File "/home/build/mediagoblin/mediagoblin/app.py", line 344, in __call__
    return self.call_backend(environ, start_response)
  File "/home/build/mediagoblin/lib/python3.9/site-packages/Werkzeug-1.0.1-py3.9.egg/werkzeug/middleware/shared_data.py", line 260, in __call__
    return self.app(environ, start_response)
  File "/home/build/mediagoblin/mediagoblin/app.py", line 278, in call_backend
    return self._finish_call_backend(request, environ, start_response)
  File "/home/build/mediagoblin/mediagoblin/app.py", line 320, in _finish_call_backend
    response = controller(request)
  File "/home/build/mediagoblin/mediagoblin/decorators.py", line 366, in wrapper
    return controller(request, *args, **kwargs)
  File "/home/build/mediagoblin/mediagoblin/auth/views.py", line 93, in login
    user = check_login_simple(
  File "/home/build/mediagoblin/mediagoblin/auth/tools.py", line 172, in check_login_simple
    if not auth.check_password(password, user.pw_hash):
  File "/home/build/mediagoblin/mediagoblin/auth/__init__.py", line 42, in check_password
    return hook_handle("auth_check_password",
  File "/home/build/mediagoblin/mediagoblin/tools/pluginapi.py", line 306, in hook_handle
    result = callable(*args, **kwargs)
  File "/home/build/mediagoblin/mediagoblin/plugins/basic_auth/__init__.py", line 91, in check_password
    return auth_tools.bcrypt_check_password(raw_pass,
  File "/home/build/mediagoblin/mediagoblin/plugins/basic_auth/tools.py", line 51, in bcrypt_check_password
    randplus_stored_hash = bcrypt.hashpw(stored_hash, rand_salt)
  File "/home/build/mediagoblin/lib/python3.9/site-packages/bcrypt-3.2.0-py3.9-linux-x86_64.egg/bcrypt/__init__.py", line 80, in hashpw
    raise TypeError("Unicode-objects must be encoded before hashing")
TypeError: Unicode-objects must be encoded before hashing
---------------------------- Captured stdout setup -----------------------------
Laying foundations for __main__:
   + Laying foundations for Privilege table
Laying foundations for __main__:
   + Laying foundations for Privilege table
---------------------------- Captured stderr setup -----------------------------
INFO  [alembic.runtime.migration] Context impl SQLiteImpl.
INFO  [alembic.runtime.migration] Will assume non-transactional DDL.
INFO  [alembic.runtime.migration] Running upgrade  -> 52bf0ccbedc1, initial revision
INFO  [alembic.runtime.migration] Running upgrade 52bf0ccbedc1 -> a98c1a320e88, Image media type initial migration
INFO  [alembic.runtime.migration] Running upgrade 52bf0ccbedc1 -> 071abb33d1da, OpenID plugin initial migration
INFO  [alembic.runtime.migration] Running upgrade 52bf0ccbedc1 -> 101510e3a713, #5382 Removes graveyard items from collections
INFO  [alembic.runtime.migration] Running upgrade 101510e3a713 -> 8429e33fdf7, Remove the Graveyard objects from CommentNotification objects
INFO  [alembic.runtime.migration] Running upgrade 8429e33fdf7 -> 4066b9f8b84a, use_comment_link_ids_notifications
INFO  [alembic.runtime.migration] Running upgrade 4066b9f8b84a -> 3145accb8fe3, remove tombstone comment wrappers
INFO  [alembic.runtime.migration] Running upgrade 3145accb8fe3 -> 228916769bd2, ensure Report.object_id is nullable
INFO  [alembic.runtime.migration] Running upgrade 228916769bd2 -> afd3d1da5e29, Subtitle plugin initial migration
INFO  [alembic.runtime.migration] Running upgrade 228916769bd2 -> cc3651803714, add main transcoding progress column to MediaEntry
INFO  [alembic.runtime.migration] Context impl SQLiteImpl.
INFO  [alembic.runtime.migration] Will assume non-transactional DDL.
INFO  [alembic.runtime.migration] Running upgrade  -> 52bf0ccbedc1, initial revision
INFO  [alembic.runtime.migration] Running upgrade 52bf0ccbedc1 -> a98c1a320e88, Image media type initial migration
INFO  [alembic.runtime.migration] Running upgrade 52bf0ccbedc1 -> 071abb33d1da, OpenID plugin initial migration
INFO  [alembic.runtime.migration] Running upgrade 52bf0ccbedc1 -> 101510e3a713, #5382 Removes graveyard items from collections
INFO  [alembic.runtime.migration] Running upgrade 101510e3a713 -> 8429e33fdf7, Remove the Graveyard objects from CommentNotification objects
INFO  [alembic.runtime.migration] Running upgrade 8429e33fdf7 -> 4066b9f8b84a, use_comment_link_ids_notifications
INFO  [alembic.runtime.migration] Running upgrade 4066b9f8b84a -> 3145accb8fe3, remove tombstone comment wrappers
INFO  [alembic.runtime.migration] Running upgrade 3145accb8fe3 -> 228916769bd2, ensure Report.object_id is nullable
INFO  [alembic.runtime.migration] Running upgrade 228916769bd2 -> afd3d1da5e29, Subtitle plugin initial migration
INFO  [alembic.runtime.migration] Running upgrade 228916769bd2 -> cc3651803714, add main transcoding progress column to MediaEntry
=============================== warnings summary ===============================
lib/python3.9/site-packages/PyLD-1.0.5-py3.9.egg/pyld/jsonld.py:4413
lib/python3.9/site-packages/PyLD-1.0.5-py3.9.egg/pyld/jsonld.py:4413
  /home/build/mediagoblin/lib/python3.9/site-packages/PyLD-1.0.5-py3.9.egg/pyld/jsonld.py:4413: DeprecationWarning: invalid escape sequence \?

lib/python3.9/site-packages/PyLD-1.0.5-py3.9.egg/pyld/jsonld.py:577
lib/python3.9/site-packages/PyLD-1.0.5-py3.9.egg/pyld/jsonld.py:577
  /home/build/mediagoblin/lib/python3.9/site-packages/PyLD-1.0.5-py3.9.egg/pyld/jsonld.py:577: SyntaxWarning: "is" with a literal. Did you mean "=="?

lib/python3.9/site-packages/celery-4.2.2-py3.9.egg/celery/canvas.py:12
  /home/build/mediagoblin/lib/python3.9/site-packages/celery-4.2.2-py3.9.egg/celery/canvas.py:12: DeprecationWarning: Using or importing the ABCs from 'collections' instead of from 'collections.abc' is deprecated since Python 3.3, and in 3.10 it will stop working
    from collections import MutableSequence, deque

lib/python3.9/site-packages/celery-4.2.2-py3.9.egg/celery/schedules.py:8
  /home/build/mediagoblin/lib/python3.9/site-packages/celery-4.2.2-py3.9.egg/celery/schedules.py:8: DeprecationWarning: Using or importing the ABCs from 'collections' instead of from 'collections.abc' is deprecated since Python 3.3, and in 3.10 it will stop working
    from collections import Iterable, namedtuple

-- Docs: https://docs.pytest.org/en/stable/warnings.html
=========================== short test summary info ============================
SKIPPED [1] mediagoblin/tests/test_sql_migrations.py:19: could not import 'migrate': No module named 'migrate'
SKIPPED [1] mediagoblin/tests/test_pdf.py:28: condition: not os.path.exists(GOOD_PDF) or not check_prerequisites()
SKIPPED [1] mediagoblin/tests/test_submission.py:769: condition: not os.path.exists(GOOD_PDF) or not pdf_check_prerequisites()
= 21 failed, 134 passed, 3 skipped, 6 warnings, 29 errors in 154.62s (0:02:34) =
Build complete: failed 15 days ago (took 13 minutes)