#473190 failed

4b74d8aMichael Forney

Add struct passing call test

Owner
~mcf
Created
5 months ago
Updated
5 months ago
Build manifest
view manifest »

Tasks

view log »
build view log »
go to bottom »
go to top »
setup
1
2
3
4
5
6
7
8
9
10
11
12
13
14
15
16
17
18
19
20
21
22
23
24
25
26
27
28
29
30
31
32
33
34
35
36
37
38
39
40
41
42
43
44
45
46
47
48
49
50
51
52
53
54
55
56
57
58
59
60
61
62
63
64
65
66
67
68
69
70
71
72
73
74
75
76
77
78
79
80
81
82
83
84
85
86
87
88
89
90
91
92
93
94
95
96
97
98
99
100
101
102
103
104
105
106
107
108
109
110
111
112
113
114
115
116
117
118
119
120
121
122
123
124
125
126
127
128
129
130
131
132
133
134
135
136
137
138
139
140
141
142
143
144
145
146
147
148
149
150
151
152
153
154
155
156
157
158
159
160
161
162
163
164
165
166
167
168
169
170
171
172
173
174
175
176
177
178
179
180
181
182
183
184
185
186
187
188
189
190
191
192
193
194
[#473190] 2021/03/30 10:33:41 Booting image debian/sid (default) on port 22809
[#473190] 2021/03/30 10:33:45 Waiting for guest to settle
[#473190] 2021/03/30 10:33:53 Sending tasks
[#473190] 2021/03/30 10:33:53 Sending build environment
[#473190] 2021/03/30 10:33:53 Installing packages
Warning: Permanently added '[localhost]:22809' (ECDSA) to the list of known hosts.
Get:1 http://deb.debian.org/debian sid InRelease [154 kB]
Get:2 http://deb.debian.org/debian sid/main amd64 Packages.diff/Index [63.6 kB]
Get:3 http://deb.debian.org/debian sid/main amd64 Packages T-2021-03-30-0800.18-F-2021-03-30-0200.18.pdiff [1843 B]
Get:3 http://deb.debian.org/debian sid/main amd64 Packages T-2021-03-30-0800.18-F-2021-03-30-0200.18.pdiff [1843 B]
Fetched 219 kB in 3s (77.0 kB/s)
Reading package lists...
Warning: Permanently added '[localhost]:22809' (ECDSA) to the list of known hosts.
Reading package lists...
Building dependency tree...
Reading state information...
The following additional packages will be installed:
  binutils-aarch64-linux-gnu cpp-10-aarch64-linux-gnu cpp-aarch64-linux-gnu
  gcc-10-aarch64-linux-gnu gcc-10-aarch64-linux-gnu-base gcc-10-cross-base
  libasan6-arm64-cross libatomic1-arm64-cross libc6-arm64-cross libcapstone4
  libgcc-10-dev-arm64-cross libgcc-s1-arm64-cross libglib2.0-0
  libgomp1-arm64-cross libitm1-arm64-cross liblsan0-arm64-cross
  libstdc++6-arm64-cross libtsan0-arm64-cross libubsan1-arm64-cross
Suggested packages:
  binutils-doc gcc-10-locales cpp-doc gcc-10-doc manpages-dev autoconf
  automake libtool flex bison gdb-aarch64-linux-gnu gcc-doc
Recommended packages:
  libc6-dev-arm64-cross libc6-dev-arm64-cross | libc-dev-arm64-cross
  libglib2.0-data shared-mime-info xdg-user-dirs qemu-user-binfmt
The following NEW packages will be installed:
  binutils-aarch64-linux-gnu cpp-10-aarch64-linux-gnu cpp-aarch64-linux-gnu
  gcc-10-aarch64-linux-gnu gcc-10-aarch64-linux-gnu-base gcc-10-cross-base
  gcc-aarch64-linux-gnu libasan6-arm64-cross libatomic1-arm64-cross
  libc6-arm64-cross libcapstone4 libgcc-10-dev-arm64-cross
  libgcc-s1-arm64-cross libglib2.0-0 libgomp1-arm64-cross libitm1-arm64-cross
  liblsan0-arm64-cross libstdc++6-arm64-cross libtsan0-arm64-cross
  libubsan1-arm64-cross qemu-user
0 upgraded, 21 newly installed, 0 to remove and 0 not upgraded.
Need to get 124 MB of archives.
After this operation, 598 MB of additional disk space will be used.
Get:1 http://deb.debian.org/debian sid/main amd64 binutils-aarch64-linux-gnu amd64 2.35.2-2 [2813 kB]
Get:2 http://deb.debian.org/debian sid/main amd64 gcc-10-aarch64-linux-gnu-base amd64 10.2.1-6cross1 [202 kB]
Get:3 http://deb.debian.org/debian sid/main amd64 cpp-10-aarch64-linux-gnu amd64 10.2.1-6cross1 [46.6 MB]
Get:4 http://deb.debian.org/debian sid/main amd64 cpp-aarch64-linux-gnu amd64 4:10.2.1-1 [16.8 kB]
Get:5 http://deb.debian.org/debian sid/main amd64 gcc-10-cross-base all 10.2.1-6cross1 [197 kB]
Get:6 http://deb.debian.org/debian sid/main amd64 libc6-arm64-cross all 2.31-9cross4 [1233 kB]
Get:7 http://deb.debian.org/debian sid/main amd64 libgcc-s1-arm64-cross all 10.2.1-6cross1 [34.5 kB]
Get:8 http://deb.debian.org/debian sid/main amd64 libgomp1-arm64-cross all 10.2.1-6cross1 [89.5 kB]
Get:9 http://deb.debian.org/debian sid/main amd64 libitm1-arm64-cross all 10.2.1-6cross1 [23.4 kB]
Get:10 http://deb.debian.org/debian sid/main amd64 libatomic1-arm64-cross all 10.2.1-6cross1 [9240 B]
Get:11 http://deb.debian.org/debian sid/main amd64 libasan6-arm64-cross all 10.2.1-6cross1 [1994 kB]
Get:12 http://deb.debian.org/debian sid/main amd64 liblsan0-arm64-cross all 10.2.1-6cross1 [793 kB]
Get:13 http://deb.debian.org/debian sid/main amd64 libtsan0-arm64-cross all 10.2.1-6cross1 [1949 kB]
Get:14 http://deb.debian.org/debian sid/main amd64 libstdc++6-arm64-cross all 10.2.1-6cross1 [410 kB]
Get:15 http://deb.debian.org/debian sid/main amd64 libubsan1-arm64-cross all 10.2.1-6cross1 [759 kB]
Get:16 http://deb.debian.org/debian sid/main amd64 libgcc-10-dev-arm64-cross all 10.2.1-6cross1 [880 kB]
Get:17 http://deb.debian.org/debian sid/main amd64 gcc-10-aarch64-linux-gnu amd64 10.2.1-6cross1 [53.2 MB]
Get:18 http://deb.debian.org/debian sid/main amd64 gcc-aarch64-linux-gnu amd64 4:10.2.1-1 [1460 B]
Get:19 http://deb.debian.org/debian sid/main amd64 libcapstone4 amd64 4.0.2-3 [566 kB]
Get:20 http://deb.debian.org/debian sid/main amd64 libglib2.0-0 amd64 2.66.8-1 [1370 kB]
Get:21 http://deb.debian.org/debian sid/main amd64 qemu-user amd64 1:5.2+dfsg-9 [11.3 MB]
Fetched 124 MB in 20s (6124 kB/s)
Selecting previously unselected package binutils-aarch64-linux-gnu.
(Reading database ... 
(Reading database ... 5%
(Reading database ... 10%
(Reading database ... 15%
(Reading database ... 20%
(Reading database ... 25%
(Reading database ... 30%
(Reading database ... 35%
(Reading database ... 40%
(Reading database ... 45%
(Reading database ... 50%
(Reading database ... 55%
(Reading database ... 60%
(Reading database ... 65%
(Reading database ... 70%
(Reading database ... 75%
(Reading database ... 80%
(Reading database ... 85%
(Reading database ... 90%
(Reading database ... 95%
(Reading database ... 100%
(Reading database ... 23955 files and directories currently installed.)
Preparing to unpack .../00-binutils-aarch64-linux-gnu_2.35.2-2_amd64.deb ...
Unpacking binutils-aarch64-linux-gnu (2.35.2-2) ...
Selecting previously unselected package gcc-10-aarch64-linux-gnu-base:amd64.
Preparing to unpack .../01-gcc-10-aarch64-linux-gnu-base_10.2.1-6cross1_amd64.deb ...
Unpacking gcc-10-aarch64-linux-gnu-base:amd64 (10.2.1-6cross1) ...
Selecting previously unselected package cpp-10-aarch64-linux-gnu.
Preparing to unpack .../02-cpp-10-aarch64-linux-gnu_10.2.1-6cross1_amd64.deb ...
Unpacking cpp-10-aarch64-linux-gnu (10.2.1-6cross1) ...
Selecting previously unselected package cpp-aarch64-linux-gnu.
Preparing to unpack .../03-cpp-aarch64-linux-gnu_4%3a10.2.1-1_amd64.deb ...
Unpacking cpp-aarch64-linux-gnu (4:10.2.1-1) ...
Selecting previously unselected package gcc-10-cross-base.
Preparing to unpack .../04-gcc-10-cross-base_10.2.1-6cross1_all.deb ...
Unpacking gcc-10-cross-base (10.2.1-6cross1) ...
Selecting previously unselected package libc6-arm64-cross.
Preparing to unpack .../05-libc6-arm64-cross_2.31-9cross4_all.deb ...
Unpacking libc6-arm64-cross (2.31-9cross4) ...
Selecting previously unselected package libgcc-s1-arm64-cross.
Preparing to unpack .../06-libgcc-s1-arm64-cross_10.2.1-6cross1_all.deb ...
Unpacking libgcc-s1-arm64-cross (10.2.1-6cross1) ...
Selecting previously unselected package libgomp1-arm64-cross.
Preparing to unpack .../07-libgomp1-arm64-cross_10.2.1-6cross1_all.deb ...
Unpacking libgomp1-arm64-cross (10.2.1-6cross1) ...
Selecting previously unselected package libitm1-arm64-cross.
Preparing to unpack .../08-libitm1-arm64-cross_10.2.1-6cross1_all.deb ...
Unpacking libitm1-arm64-cross (10.2.1-6cross1) ...
Selecting previously unselected package libatomic1-arm64-cross.
Preparing to unpack .../09-libatomic1-arm64-cross_10.2.1-6cross1_all.deb ...
Unpacking libatomic1-arm64-cross (10.2.1-6cross1) ...
Selecting previously unselected package libasan6-arm64-cross.
Preparing to unpack .../10-libasan6-arm64-cross_10.2.1-6cross1_all.deb ...
Unpacking libasan6-arm64-cross (10.2.1-6cross1) ...
Selecting previously unselected package liblsan0-arm64-cross.
Preparing to unpack .../11-liblsan0-arm64-cross_10.2.1-6cross1_all.deb ...
Unpacking liblsan0-arm64-cross (10.2.1-6cross1) ...
Selecting previously unselected package libtsan0-arm64-cross.
Preparing to unpack .../12-libtsan0-arm64-cross_10.2.1-6cross1_all.deb ...
Unpacking libtsan0-arm64-cross (10.2.1-6cross1) ...
Selecting previously unselected package libstdc++6-arm64-cross.
Preparing to unpack .../13-libstdc++6-arm64-cross_10.2.1-6cross1_all.deb ...
Unpacking libstdc++6-arm64-cross (10.2.1-6cross1) ...
Selecting previously unselected package libubsan1-arm64-cross.
Preparing to unpack .../14-libubsan1-arm64-cross_10.2.1-6cross1_all.deb ...
Unpacking libubsan1-arm64-cross (10.2.1-6cross1) ...
Selecting previously unselected package libgcc-10-dev-arm64-cross.
Preparing to unpack .../15-libgcc-10-dev-arm64-cross_10.2.1-6cross1_all.deb ...
Unpacking libgcc-10-dev-arm64-cross (10.2.1-6cross1) ...
Selecting previously unselected package gcc-10-aarch64-linux-gnu.
Preparing to unpack .../16-gcc-10-aarch64-linux-gnu_10.2.1-6cross1_amd64.deb ...
Unpacking gcc-10-aarch64-linux-gnu (10.2.1-6cross1) ...
Selecting previously unselected package gcc-aarch64-linux-gnu.
Preparing to unpack .../17-gcc-aarch64-linux-gnu_4%3a10.2.1-1_amd64.deb ...
Unpacking gcc-aarch64-linux-gnu (4:10.2.1-1) ...
Selecting previously unselected package libcapstone4:amd64.
Preparing to unpack .../18-libcapstone4_4.0.2-3_amd64.deb ...
Unpacking libcapstone4:amd64 (4.0.2-3) ...
Selecting previously unselected package libglib2.0-0:amd64.
Preparing to unpack .../19-libglib2.0-0_2.66.8-1_amd64.deb ...
Unpacking libglib2.0-0:amd64 (2.66.8-1) ...
Selecting previously unselected package qemu-user.
Preparing to unpack .../20-qemu-user_1%3a5.2+dfsg-9_amd64.deb ...
Unpacking qemu-user (1:5.2+dfsg-9) ...
Setting up libglib2.0-0:amd64 (2.66.8-1) ...
No schema files found: doing nothing.
Setting up binutils-aarch64-linux-gnu (2.35.2-2) ...
Setting up libc6-arm64-cross (2.31-9cross4) ...
Setting up gcc-10-cross-base (10.2.1-6cross1) ...
Setting up libcapstone4:amd64 (4.0.2-3) ...
Setting up libgcc-s1-arm64-cross (10.2.1-6cross1) ...
Setting up gcc-10-aarch64-linux-gnu-base:amd64 (10.2.1-6cross1) ...
Setting up libatomic1-arm64-cross (10.2.1-6cross1) ...
Setting up liblsan0-arm64-cross (10.2.1-6cross1) ...
Setting up libgomp1-arm64-cross (10.2.1-6cross1) ...
Setting up libasan6-arm64-cross (10.2.1-6cross1) ...
Setting up libtsan0-arm64-cross (10.2.1-6cross1) ...
Setting up libstdc++6-arm64-cross (10.2.1-6cross1) ...
Setting up qemu-user (1:5.2+dfsg-9) ...
Setting up libitm1-arm64-cross (10.2.1-6cross1) ...
Setting up cpp-10-aarch64-linux-gnu (10.2.1-6cross1) ...
Setting up libubsan1-arm64-cross (10.2.1-6cross1) ...
Setting up libgcc-10-dev-arm64-cross (10.2.1-6cross1) ...
Setting up cpp-aarch64-linux-gnu (4:10.2.1-1) ...
Setting up gcc-10-aarch64-linux-gnu (10.2.1-6cross1) ...
Setting up gcc-aarch64-linux-gnu (4:10.2.1-1) ...
Processing triggers for libc-bin (2.31-10) ...
[#473190] 2021/03/30 10:34:32 Cloning repositories
Cloning into 'cproc'...
+ cd cproc
+ git checkout -q 4b74d8aa68fca6692782a47277e1dade5a2b039e
+ cd cproc
+ git submodule update --init
Submodule 'qbe' (https://git.sr.ht/~mcf/qbe) registered for path 'qbe'
Cloning into '/home/build/cproc/qbe'...
Submodule path 'qbe': checked out '365e89ab7746ed08fc3934f5d482a5cdd642f586'
Cloning into 'qbe'...
+ cd qbe
+ git submodule update --init
[#473190] 2021/03/30 10:34:34 Running task build
[#473190] 2021/03/30 10:34:36 Processing post-failed triggers...
[#473190] 2021/03/30 10:34:37 Sent build results email to <~mcf/cproc@lists.sr.ht>
[#473190] 2021/03/30 10:34:37 Build failed.
[#473190] 2021/03/30 10:34:37 The build environment will be kept alive for 10 minutes.
[#473190] 2021/03/30 10:34:37 To log in with SSH and examine it, use the following command:
[#473190] 2021/03/30 10:34:37 
[#473190] 2021/03/30 10:34:37 	ssh -t builds@yui.runners.sr.ht connect 473190
[#473190] 2021/03/30 10:34:37 
[#473190] 2021/03/30 10:34:37 After logging in, the deadline is increased to your remaining build time.
[#473190] 2021/03/30 10:44:37 Deadline elapsed. Terminating build environment.
[#473190] 2021/03/30 10:44:37 Error: Running task on guest: exit status 2
build
1
2
3
4
5
6
7
8
9
10
11
12
13
14
15
16
17
18
19
20
21
22
23
24
25
26
27
28
29
30
31
32
33
34
35
36
37
38
39
40
41
42
43
44
45
46
47
48
49
50
51
52
53
54
55
56
57
58
59
60
61
62
63
64
65
66
67
68
69
70
71
72
73
74
75
76
77
78
79
80
81
82
83
84
85
86
87
88
89
90
91
92
93
94
95
96
97
98
99
100
101
102
103
104
105
106
107
108
109
110
111
112
113
114
115
116
117
118
119
120
121
122
123
124
125
126
127
128
129
130
131
132
133
134
135
136
137
138
139
140
141
142
143
144
145
146
147
148
149
150
151
152
153
154
155
156
157
158
159
160
161
162
163
164
165
166
167
168
169
170
171
172
173
174
175
176
+ PATH=/home/build/qbe/obj:/usr/local/bin:/usr/bin:/bin:/usr/games
+ cd qbe
+ cat
+ make
cc main.c
cc util.c
cc parse.c
cc cfg.c
cc mem.c
cc ssa.c
cc alias.c
cc load.c
cc copy.c
cc fold.c
cc live.c
cc spill.c
cc rega.c
cc gas.c
cc amd64/targ.c
cc amd64/sysv.c
cc amd64/isel.c
cc amd64/emit.c
cc arm64/targ.c
cc arm64/abi.c
cc arm64/isel.c
cc arm64/emit.c
ld obj/qbe
+ cd ../cproc
++ aarch64-linux-gnu-gcc -print-file-name=crtbegin.o
+ crtbegin=/usr/lib/gcc-cross/aarch64-linux-gnu/10/crtbegin.o
+ ./configure --target=aarch64-linux-gnu --with-ldso=/usr/aarch64-linux-gnu/lib/ld-linux-aarch64.so.1 --with-gcc-libdir=/usr/lib/gcc-cross/aarch64-linux-gnu/10
checking host system type... x86_64-linux-gnu
checking target system type... aarch64-linux-gnu
creating config.h... done
creating config.mk... done
+ make all check
cc -std=c11 -Wall -Wpedantic -Wno-parentheses -Wno-switch -g -pipe -c -o driver.o driver.c
cc -std=c11 -Wall -Wpedantic -Wno-parentheses -Wno-switch -g -pipe -c -o util.o util.c
cc  -o cproc ./driver.o ./util.o
cc -std=c11 -Wall -Wpedantic -Wno-parentheses -Wno-switch -g -pipe -c -o decl.o decl.c
cc -std=c11 -Wall -Wpedantic -Wno-parentheses -Wno-switch -g -pipe -c -o eval.o eval.c
cc -std=c11 -Wall -Wpedantic -Wno-parentheses -Wno-switch -g -pipe -c -o expr.o expr.c
cc -std=c11 -Wall -Wpedantic -Wno-parentheses -Wno-switch -g -pipe -c -o init.o init.c
cc -std=c11 -Wall -Wpedantic -Wno-parentheses -Wno-switch -g -pipe -c -o main.o main.c
cc -std=c11 -Wall -Wpedantic -Wno-parentheses -Wno-switch -g -pipe -c -o map.o map.c
cc -std=c11 -Wall -Wpedantic -Wno-parentheses -Wno-switch -g -pipe -c -o pp.o pp.c
cc -std=c11 -Wall -Wpedantic -Wno-parentheses -Wno-switch -g -pipe -c -o scan.o scan.c
cc -std=c11 -Wall -Wpedantic -Wno-parentheses -Wno-switch -g -pipe -c -o scope.o scope.c
cc -std=c11 -Wall -Wpedantic -Wno-parentheses -Wno-switch -g -pipe -c -o siphash.o siphash.c
cc -std=c11 -Wall -Wpedantic -Wno-parentheses -Wno-switch -g -pipe -c -o stmt.o stmt.c
cc -std=c11 -Wall -Wpedantic -Wno-parentheses -Wno-switch -g -pipe -c -o targ.o targ.c
cc -std=c11 -Wall -Wpedantic -Wno-parentheses -Wno-switch -g -pipe -c -o token.o token.c
cc -std=c11 -Wall -Wpedantic -Wno-parentheses -Wno-switch -g -pipe -c -o tree.o tree.c
cc -std=c11 -Wall -Wpedantic -Wno-parentheses -Wno-switch -g -pipe -c -o type.o type.c
cc -std=c11 -Wall -Wpedantic -Wno-parentheses -Wno-switch -g -pipe -c -o qbe.o qbe.c
cc  -o cproc-qbe ./decl.o ./eval.o ./expr.o ./init.o ./main.o ./map.o ./pp.o ./scan.o ./scope.o ./siphash.o ./stmt.o ./targ.o ./token.o ./tree.o ./type.o ./util.o ./qbe.o
[PASS] test/abstract-function-declarator.c
[PASS] test/add-int-pointer.c
[PASS] test/alignas.c
[PASS] test/array-address.c
[PASS] test/asm-label.c
[PASS] test/basic.c
[PASS] test/bitfield-assignment-sign-extend.c
[PASS] test/bitfield-compound-assign.c
[PASS] test/bitfield-initializer-overflow.c
[PASS] test/bitfield-integer-promotion-long.c
[PASS] test/bitfield-integer-promotion.c
[PASS] test/bitfield-load-signed.c
[PASS] test/bitfield-load-unsigned.c
[PASS] test/bitfield-non-adjacent.c
[PASS] test/bitfield-union.c
[PASS] test/bitfield-unnamed-size-align.c
[PASS] test/builtin-alloca.c
[PASS] test/builtin-constant-p.c
[PASS] test/builtin-expect.c
[PASS] test/builtin-inff.c
[PASS] test/builtin-nanf.c
[PASS] test/builtin-offsetof.c
[PASS] test/builtin-types-compatible-p.c
[PASS] test/builtin-va-copy.c
[PASS] test/cast-bool-char.c
[PASS] test/common-real-int-sign.c
[PASS] test/common-real-unsigned-char.c
[PASS] test/compare-char.c
[PASS] test/compatible-enum-types.c
[PASS] test/compatible-function-types.c
[PASS] test/compound-assignment.c
[PASS] test/compound-literal-static.c
[PASS] test/conditional-compound-literal.c
[PASS] test/const-array.c
[PASS] test/const-expr-cast.c
[PASS] test/const-expr-div.c
[PASS] test/const-expr-mod.c
[PASS] test/const-expr-shr.c
[PASS] test/const-init.c
[PASS] test/do-loop.c
[PASS] test/enum-large-value.c
[PASS] test/escaped-newline.c
[PASS] test/extern-initializer.c
[PASS] test/float-const-leading-dot.c
[PASS] test/float-promote.c
[PASS] test/float-to-uint32.c
[PASS] test/float-to-uint64.c
[PASS] test/for-loop.c
[PASS] test/generic.c
[PASS] test/global-align.c
[PASS] test/hello.c
[PASS] test/initializer-long-string.c
[PASS] test/initializer-nested-array-address.c
[PASS] test/initializer-pointer-int-cast.c
[PASS] test/initializer-replace-local.c
[PASS] test/initializer-replace-static.c
[PASS] test/initializer-short-string.c
[PASS] test/initializer-string-array.c
[PASS] test/initializer-string-braces.c
[PASS] test/initializer-string.c
[PASS] test/initializer-unsigned-string.c
[PASS] test/inline-definition.c
[PASS] test/kr-function-argument-promotion.c
[PASS] test/label-typedef.c
[PASS] test/local-align.c
[PASS] test/local-init.c
[PASS] test/lvalue-conversion.c
[PASS] test/nested-array.c
[PASS] test/preprocess-macro-function-no-args.c
[PASS] test/preprocess-macro-function-paren.c
[PASS] test/preprocess-macro-function.c
[PASS] test/preprocess-macro-hide.c
[PASS] test/preprocess-macro-object.c
[PASS] test/preprocess-macro-stringize-2.c
[PASS] test/preprocess-macro-stringize.c
[PASS] test/preprocess-macro-vararg.c
[PASS] test/preprocess-standard-example-1.c
[PASS] test/preprocess-standard-example-2.c
[PASS] test/preprocess-undef.c
[PASS] test/sizeof-compound-literal.c
[PASS] test/sizeof-postfix.c
[PASS] test/sizeof-string-literal.c
[PASS] test/static-assert-concat.c
[PASS] test/struct-copy.c
[PASS] test/struct-passing-bitfield.c
[PASS] test/struct-passing-call.c
[PASS] test/struct-passing.c
[PASS] test/struct-return-1.c
[PASS] test/struct-return-2.c
[PASS] test/subtract-pointer.c
[PASS] test/switch-long-long.c
[PASS] test/switch.c
[PASS] test/tentative.c
[PASS] test/typedef-name.c
[PASS] test/typedef.c
[PASS] test/typeof-decay.c
[PASS] test/typeof.c
[PASS] test/uint32-to-float.c
[PASS] test/uint64-to-float.c
[PASS] test/union-passing.c
[PASS] test/union.c
[PASS] test/unused-return.c
[PASS] test/varargs.c
[PASS] test/while-condition.c
+ make bootstrap LDFLAGS=-Wl,-rpath,/usr/aarch64-linux-gnu/lib
make objdir=stage2 stagedeps='cproc cproc-qbe' CC=./cproc LDFLAGS='-Wl,-rpath,/usr/aarch64-linux-gnu/lib -s'
make[1]: Entering directory '/home/build/cproc'
./cproc -std=c11 -Wall -Wpedantic -Wno-parentheses -Wno-switch -g -pipe -c -o stage2/driver.o driver.c
In file included from /usr/include/errno.h:25,
                 from driver.c:2:
/usr/include/features.h:461:12: fatal error: sys/cdefs.h: No such file or directory
  461 | #  include <sys/cdefs.h>
      |            ^~~~~~~~~~~~~
compilation terminated.
cproc: preprocess: process 1250 exited with status 1
cproc: codegen: process signaled: Terminated
cproc: assemble: process signaled: Terminated
make[1]: *** [Makefile:48: stage2/driver.o] Error 1
make[1]: Leaving directory '/home/build/cproc'
make: *** [Makefile:73: stage2] Error 2
Build complete: failed 5 months ago (took 55 seconds)