#109783 failed

Owner
~hristoast
Created
8 months ago
Updated
8 months ago
Build manifest
view manifest »

Tasks

view log »
install-requirements view log »
install-dev-requirements view log »
setup-flake8 view log »
test-black view log »
test-flake8 view log »
test-pytest view log »
test-build-dist view log »
test-install view log »
go to bottom »
setup
1
2
3
4
5
6
7
8
9
10
11
12
13
14
15
16
17
18
19
20
21
22
23
24
25
26
27
28
29
30
31
32
33
34
35
36
37
38
39
40
41
42
43
44
45
46
47
48
49
50
51
52
53
54
55
56
57
58
59
60
61
62
63
64
65
66
67
68
69
70
71
72
73
74
75
76
77
78
79
80
81
82
83
84
85
86
87
88
89
90
91
92
93
94
95
96
97
98
99
100
101
102
103
104
105
106
107
108
109
110
111
112
113
114
115
116
117
118
119
120
121
122
123
124
125
126
127
128
129
130
131
132
133
134
135
136
137
138
139
140
141
142
143
144
145
146
147
148
149
150
[#109783] 2019/11/15 23:53:51 Booting image archlinux (default) on port 22869
[#109783] 2019/11/15 23:53:55 Waiting for guest to settle
[#109783] 2019/11/15 23:54:02 Sending tasks
[#109783] 2019/11/15 23:54:04 Sending build environment
[#109783] 2019/11/15 23:54:04 Installing packages
Warning: Permanently added '[localhost]:22869' (ECDSA) to the list of known hosts.
:: Synchronizing package databases...
downloading core.db...
downloading extra.db...
downloading community.db...
:: Starting full system upgrade...
warning: libutil-linux: ignoring package upgrade (2.34-3 => 2.34-6)
warning: util-linux: ignoring package upgrade (2.34-3 => 2.34-6)
resolving dependencies...
looking for conflicting packages...

Packages (36) audit-2.8.5-6  gpgme-1.13.1-3  icu-65.1-2  libxml2-2.9.9-6  libyaml-0.2.2-1  patch-2.7.6-8  perl-5.30.1-1  psmisc-23.3-1  python-3.8.0-1  python-appdirs-1.4.3-5  python-cachecontrol-0.12.5-6  python-chardet-3.0.4-4  python-colorama-0.4.1-3  python-distlib-0.3.0-1  python-distro-1.4.0-3  python-html5lib-1.0.1-6  python-idna-2.8-3  python-importlib-metadata-0.23-2  python-lockfile-0.12.2-6  python-more-itertools-7.2.0-3  python-msgpack-0.6.2-3  python-packaging-19.2-5  python-pep517-0.6.0-3  python-progress-1.5-3  python-pyparsing-2.4.5-1  python-pytoml-0.1.21-3  python-requests-2.22.0-3  python-retrying-1.3.3-6  python-setuptools-1:41.2.0-5  python-six-1.13.0-2  python-urllib3-1.25.7-1  python-webencodings-0.5.1-4  python-zipp-0.6.0-3  xz-5.2.4-2  python-pip-19.2.3-3  python-yaml-5.1.2-3

Total Download Size:    64.76 MiB
Total Installed Size:  269.32 MiB
Net Upgrade Size:      163.51 MiB

:: Proceed with installation? [Y/n] 
:: Retrieving packages...
downloading perl-5.30.1-1-x86_64.pkg.tar.xz...
downloading audit-2.8.5-6-x86_64.pkg.tar.xz...
downloading xz-5.2.4-2-x86_64.pkg.tar.xz...
downloading gpgme-1.13.1-3-x86_64.pkg.tar.xz...
downloading icu-65.1-2-x86_64.pkg.tar.xz...
downloading patch-2.7.6-8-x86_64.pkg.tar.xz...
downloading psmisc-23.3-1-x86_64.pkg.tar.xz...
downloading python-3.8.0-1-x86_64.pkg.tar.xz...
downloading python-appdirs-1.4.3-5-any.pkg.tar.xz...
downloading python-pyparsing-2.4.5-1-any.pkg.tar.xz...
downloading python-six-1.13.0-2-any.pkg.tar.xz...
downloading python-packaging-19.2-5-any.pkg.tar.xz...
downloading python-setuptools-1:41.2.0-5-any.pkg.tar.xz...
downloading python-urllib3-1.25.7-1-any.pkg.tar.xz...
downloading python-chardet-3.0.4-4-any.pkg.tar.xz...
downloading python-idna-2.8-3-any.pkg.tar.xz...
downloading python-requests-2.22.0-3-any.pkg.tar.xz...
downloading python-pep517-0.6.0-3-any.pkg.tar.xz...
downloading python-retrying-1.3.3-6-any.pkg.tar.xz...
downloading python-pip-19.2.3-3-any.pkg.tar.xz...
downloading libyaml-0.2.2-1-x86_64.pkg.tar.xz...
downloading libxml2-2.9.9-6-x86_64.pkg.tar.xz...
downloading python-msgpack-0.6.2-3-x86_64.pkg.tar.xz...
downloading python-cachecontrol-0.12.5-6-any.pkg.tar.xz...
downloading python-colorama-0.4.1-3-any.pkg.tar.xz...
downloading python-distlib-0.3.0-1-any.pkg.tar.xz...
downloading python-distro-1.4.0-3-any.pkg.tar.xz...
downloading python-webencodings-0.5.1-4-any.pkg.tar.xz...
downloading python-html5lib-1.0.1-6-any.pkg.tar.xz...
downloading python-lockfile-0.12.2-6-any.pkg.tar.xz...
downloading python-pytoml-0.1.21-3-any.pkg.tar.xz...
downloading python-more-itertools-7.2.0-3-any.pkg.tar.xz...
downloading python-zipp-0.6.0-3-x86_64.pkg.tar.xz...
downloading python-importlib-metadata-0.23-2-any.pkg.tar.xz...
downloading python-progress-1.5-3-any.pkg.tar.xz...
downloading python-yaml-5.1.2-3-x86_64.pkg.tar.xz...
checking keyring...
checking package integrity...
loading package files...
checking for file conflicts...
checking available disk space...
:: Processing package changes...
upgrading perl...
installing python...
Optional dependencies for python
    python-setuptools [pending]
    python-pip [pending]
    sqlite [installed]
    mpdecimal: for decimal
    xz: for lzma [installed]
    tk: for tkinter
installing python-appdirs...
installing python-pyparsing...
installing python-six...
installing python-packaging...
installing python-setuptools...
installing python-msgpack...
installing python-urllib3...
Optional dependencies for python-urllib3
    python-pysocks: SOCKS support
    python-brotlipy: Brotli support
    python-pyopenssl: security support
installing python-chardet...
installing python-idna...
installing python-requests...
Optional dependencies for python-requests
    python-pysocks: SOCKS proxy support
installing python-cachecontrol...
Optional dependencies for python-cachecontrol
    python-lockfile: for the FileCache [pending]
installing python-colorama...
installing python-distlib...
installing python-distro...
installing python-webencodings...
installing python-html5lib...
Optional dependencies for python-html5lib
    python-lxml: lxml treebuilder
    python-genshi: genshi treewalker
installing python-lockfile...
installing python-pytoml...
installing python-more-itertools...
installing python-zipp...
installing python-importlib-metadata...
installing python-pep517...
installing python-progress...
installing python-retrying...
installing python-pip...
installing libyaml...
installing python-yaml...
upgrading audit...
upgrading xz...
upgrading gpgme...
upgrading icu...
upgrading libxml2...
upgrading patch...
upgrading psmisc...
:: Running post-transaction hooks...
(1/4) Reloading system manager configuration...
(2/4) Arming ConditionNeedsUpdate...
(3/4) Warn about old perl modules
(4/4) Updating the info directory file...
:: Searching databases for updates...
:: Searching AUR for updates...
 -> libutil-linux: ignoring package upgrade (2.34-3 => 2.34-6)
 -> util-linux: ignoring package upgrade (2.34-3 => 2.34-6)
 there is nothing to do
[#109783] 2019/11/15 23:54:28 Cloning repositories
Cloning into 'mousikofidi'...
+ cd mousikofidi
+ git checkout -q 8515143618ea43e82b28ff30028ead26944281ca
+ cd mousikofidi
+ git submodule update --init
[#109783] 2019/11/15 23:54:47 Running task install-requirements
[#109783] 2019/11/15 23:55:14 Running task install-dev-requirements
[#109783] 2019/11/15 23:55:19 Running task setup-flake8
[#109783] 2019/11/15 23:55:19 Running task test-black
[#109783] 2019/11/15 23:55:22 Running task test-flake8
[#109783] 2019/11/15 23:55:22 Build failed.
[#109783] 2019/11/15 23:55:22 The build environment will be kept alive for 10 minutes.
[#109783] 2019/11/15 23:55:22 To log in with SSH and examine it, use the following command:
[#109783] 2019/11/15 23:55:22 
[#109783] 2019/11/15 23:55:22 	ssh -t builds@azusa.runners.sr.ht connect 109783
[#109783] 2019/11/15 23:55:22 
[#109783] 2019/11/15 23:55:22 After logging in, the deadline is increased to your remaining build time.
[#109783] 2019/11/16 00:05:22 Deadline elapsed. Terminating build environment.
[#109783] 2019/11/16 00:05:22 Error: Running task on guest: exit status 2
install-requirements
1
2
3
4
5
6
7
8
9
10
11
12
13
14
15
16
17
18
19
20
21
22
23
24
25
26
27
28
29
30
31
32
33
34
35
36
37
38
39
40
41
42
43
44
45
46
47
48
49
50
51
52
53
54
55
56
57
58
59
60
61
62
63
64
65
66
67
68
69
70
71
72
73
74
75
76
77
78
79
80
81
82
83
84
85
86
87
88
89
90
91
92
93
94
95
96
97
98
99
100
101
102
103
104
105
106
107
108
109
110
111
112
113
114
115
116
117
118
119
120
121
122
123
124
125
126
127
128
129
130
131
132
133
134
135
136
137
138
139
140
141
142
143
144
145
146
147
148
149
150
151
152
153
154
155
156
157
158
159
160
161
162
163
164
165
166
167
168
169
170
171
172
173
174
175
176
177
178
179
180
181
182
183
184
185
186
187
188
189
190
191
192
193
194
195
196
197
198
199
200
201
202
203
204
205
206
207
208
209
210
211
212
213
214
215
216
217
218
219
220
221
222
223
224
225
226
227
228
229
230
231
232
233
234
235
236
237
238
239
240
241
242
243
244
245
246
247
248
249
250
251
252
253
254
255
256
257
258
259
260
261
+ cd mousikofidi
+ sudo pip3 install -r requirements.txt
Collecting Flask==1.0.3 (from -r requirements.txt (line 1))
[?25l  Downloading https://files.pythonhosted.org/packages/9a/74/670ae9737d14114753b8c8fdf2e8bd212a05d3b361ab15b44937dfd40985/Flask-1.0.3-py2.py3-none-any.whl (92kB)

     |███▋                            | 10kB 8.1MB/s eta 0:00:01
     |███████▏                        | 20kB 1.4MB/s eta 0:00:01
     |██████████▊                     | 30kB 1.9MB/s eta 0:00:01
     |██████████████▎                 | 40kB 1.3MB/s eta 0:00:01
     |█████████████████▉              | 51kB 1.6MB/s eta 0:00:01
     |█████████████████████▍          | 61kB 1.9MB/s eta 0:00:01
     |█████████████████████████       | 71kB 2.1MB/s eta 0:00:01
     |████████████████████████████▌   | 81kB 2.4MB/s eta 0:00:01
     |████████████████████████████████| 92kB 1.8MB/s 
[?25hCollecting mutagen==1.42.0 (from -r requirements.txt (line 2))
[?25l  Downloading https://files.pythonhosted.org/packages/30/4c/5ad1a6e1ccbcfaf6462db727989c302d9d721beedd9b09c11e6f0c7065b0/mutagen-1.42.0.tar.gz (925kB)

     |▍                               | 10kB 9.0MB/s eta 0:00:01
     |▊                               | 20kB 11.6MB/s eta 0:00:01
     |█                               | 30kB 13.3MB/s eta 0:00:01
     |█▍                              | 40kB 14.3MB/s eta 0:00:01
     |█▊                              | 51kB 14.8MB/s eta 0:00:01
     |██▏                             | 61kB 15.2MB/s eta 0:00:01
     |██▌                             | 71kB 14.7MB/s eta 0:00:01
     |██▉                             | 81kB 5.6MB/s eta 0:00:01
     |███▏                            | 92kB 5.9MB/s eta 0:00:01
     |███▌                            | 102kB 6.2MB/s eta 0:00:01
     |████                            | 112kB 6.2MB/s eta 0:00:01
     |████▎                           | 122kB 6.2MB/s eta 0:00:01
     |████▋                           | 133kB 6.2MB/s eta 0:00:01
     |█████                           | 143kB 6.2MB/s eta 0:00:01
     |█████▎                          | 153kB 6.2MB/s eta 0:00:01
     |█████▋                          | 163kB 6.2MB/s eta 0:00:01
     |██████                          | 174kB 6.2MB/s eta 0:00:01
     |██████▍                         | 184kB 6.2MB/s eta 0:00:01
     |██████▊                         | 194kB 6.2MB/s eta 0:00:01
     |███████                         | 204kB 6.2MB/s eta 0:00:01
     |███████▍                        | 215kB 6.2MB/s eta 0:00:01
     |███████▉                        | 225kB 6.2MB/s eta 0:00:01
     |████████▏                       | 235kB 6.2MB/s eta 0:00:01
     |████████▌                       | 245kB 6.2MB/s eta 0:00:01
     |████████▉                       | 256kB 6.2MB/s eta 0:00:01
     |█████████▏                      | 266kB 6.2MB/s eta 0:00:01
     |█████████▌                      | 276kB 6.2MB/s eta 0:00:01
     |██████████                      | 286kB 6.2MB/s eta 0:00:01
     |██████████▎                     | 296kB 6.2MB/s eta 0:00:01
     |██████████▋                     | 307kB 6.2MB/s eta 0:00:01
     |███████████                     | 317kB 6.2MB/s eta 0:00:01
     |███████████▎                    | 327kB 6.2MB/s eta 0:00:01
     |███████████▊                    | 337kB 6.2MB/s eta 0:00:01
     |████████████                    | 348kB 6.2MB/s eta 0:00:01
     |████████████▍                   | 358kB 6.2MB/s eta 0:00:01
     |████████████▊                   | 368kB 6.2MB/s eta 0:00:01
     |█████████████                   | 378kB 6.2MB/s eta 0:00:01
     |█████████████▌                  | 389kB 6.2MB/s eta 0:00:01
     |█████████████▉                  | 399kB 6.2MB/s eta 0:00:01
     |██████████████▏                 | 409kB 6.2MB/s eta 0:00:01
     |██████████████▌                 | 419kB 6.2MB/s eta 0:00:01
     |██████████████▉                 | 430kB 6.2MB/s eta 0:00:01
     |███████████████▏                | 440kB 6.2MB/s eta 0:00:01
     |███████████████▋                | 450kB 6.2MB/s eta 0:00:01
     |████████████████                | 460kB 6.2MB/s eta 0:00:01
     |████████████████▎               | 471kB 6.2MB/s eta 0:00:01
     |████████████████▋               | 481kB 6.2MB/s eta 0:00:01
     |█████████████████               | 491kB 6.2MB/s eta 0:00:01
     |█████████████████▍              | 501kB 6.2MB/s eta 0:00:01
     |█████████████████▊              | 512kB 6.2MB/s eta 0:00:01
     |██████████████████              | 522kB 6.2MB/s eta 0:00:01
     |██████████████████▍             | 532kB 6.2MB/s eta 0:00:01
     |██████████████████▊             | 542kB 6.2MB/s eta 0:00:01
     |███████████████████             | 552kB 6.2MB/s eta 0:00:01
     |███████████████████▌            | 563kB 6.2MB/s eta 0:00:01
     |███████████████████▉            | 573kB 6.2MB/s eta 0:00:01
     |████████████████████▏           | 583kB 6.2MB/s eta 0:00:01
     |████████████████████▌           | 593kB 6.2MB/s eta 0:00:01
     |████████████████████▉           | 604kB 6.2MB/s eta 0:00:01
     |█████████████████████▎          | 614kB 6.2MB/s eta 0:00:01
     |█████████████████████▋          | 624kB 6.2MB/s eta 0:00:01
     |██████████████████████          | 634kB 6.2MB/s eta 0:00:01
     |██████████████████████▎         | 645kB 6.2MB/s eta 0:00:01
     |██████████████████████▋         | 655kB 6.2MB/s eta 0:00:01
     |███████████████████████         | 665kB 6.2MB/s eta 0:00:01
     |███████████████████████▍        | 675kB 6.2MB/s eta 0:00:01
     |███████████████████████▊        | 686kB 6.2MB/s eta 0:00:01
     |████████████████████████        | 696kB 6.2MB/s eta 0:00:01
     |████████████████████████▍       | 706kB 6.2MB/s eta 0:00:01
     |████████████████████████▊       | 716kB 6.2MB/s eta 0:00:01
     |█████████████████████████▏      | 727kB 6.2MB/s eta 0:00:01
     |█████████████████████████▌      | 737kB 6.2MB/s eta 0:00:01
     |█████████████████████████▉      | 747kB 6.2MB/s eta 0:00:01
     |██████████████████████████▏     | 757kB 6.2MB/s eta 0:00:01
     |██████████████████████████▌     | 768kB 6.2MB/s eta 0:00:01
     |███████████████████████████     | 778kB 6.2MB/s eta 0:00:01
     |███████████████████████████▎    | 788kB 6.2MB/s eta 0:00:01
     |███████████████████████████▋    | 798kB 6.2MB/s eta 0:00:01
     |████████████████████████████    | 808kB 6.2MB/s eta 0:00:01
     |████████████████████████████▎   | 819kB 6.2MB/s eta 0:00:01
     |████████████████████████████▋   | 829kB 6.2MB/s eta 0:00:01
     |█████████████████████████████   | 839kB 6.2MB/s eta 0:00:01
     |█████████████████████████████▍  | 849kB 6.2MB/s eta 0:00:01
     |█████████████████████████████▊  | 860kB 6.2MB/s eta 0:00:01
     |██████████████████████████████  | 870kB 6.2MB/s eta 0:00:01
     |██████████████████████████████▍ | 880kB 6.2MB/s eta 0:00:01
     |██████████████████████████████▉ | 890kB 6.2MB/s eta 0:00:01
     |███████████████████████████████▏| 901kB 6.2MB/s eta 0:00:01
     |███████████████████████████████▌| 911kB 6.2MB/s eta 0:00:01
     |███████████████████████████████▉| 921kB 6.2MB/s eta 0:00:01
     |████████████████████████████████| 931kB 6.2MB/s 
[?25hCollecting uWSGI==2.0.18 (from -r requirements.txt (line 3))
[?25l  Downloading https://files.pythonhosted.org/packages/e7/1e/3dcca007f974fe4eb369bf1b8629d5e342bb3055e2001b2e5340aaefae7a/uwsgi-2.0.18.tar.gz (801kB)

     |▍                               | 10kB 8.5MB/s eta 0:00:01
     |▉                               | 20kB 10.9MB/s eta 0:00:01
     |█▎                              | 30kB 12.8MB/s eta 0:00:01
     |█▋                              | 40kB 14.1MB/s eta 0:00:01
     |██                              | 51kB 13.6MB/s eta 0:00:01
     |██▌                             | 61kB 14.0MB/s eta 0:00:01
     |██▉                             | 71kB 13.9MB/s eta 0:00:01
     |███▎                            | 81kB 14.0MB/s eta 0:00:01
     |███▊                            | 92kB 14.6MB/s eta 0:00:01
     |████                            | 102kB 13.4MB/s eta 0:00:01
     |████▌                           | 112kB 13.4MB/s eta 0:00:01
     |█████                           | 122kB 13.4MB/s eta 0:00:01
     |█████▎                          | 133kB 13.4MB/s eta 0:00:01
     |█████▊                          | 143kB 13.4MB/s eta 0:00:01
     |██████▏                         | 153kB 13.4MB/s eta 0:00:01
     |██████▌                         | 163kB 13.4MB/s eta 0:00:01
     |███████                         | 174kB 13.4MB/s eta 0:00:01
     |███████▍                        | 184kB 13.4MB/s eta 0:00:01
     |███████▊                        | 194kB 13.4MB/s eta 0:00:01
     |████████▏                       | 204kB 13.4MB/s eta 0:00:01
     |████████▋                       | 215kB 13.4MB/s eta 0:00:01
     |█████████                       | 225kB 13.4MB/s eta 0:00:01
     |█████████▍                      | 235kB 13.4MB/s eta 0:00:01
     |█████████▉                      | 245kB 13.4MB/s eta 0:00:01
     |██████████▏                     | 256kB 13.4MB/s eta 0:00:01
     |██████████▋                     | 266kB 13.4MB/s eta 0:00:01
     |███████████                     | 276kB 13.4MB/s eta 0:00:01
     |███████████▌                    | 286kB 13.4MB/s eta 0:00:01
     |███████████▉                    | 296kB 13.4MB/s eta 0:00:01
     |████████████▎                   | 307kB 13.4MB/s eta 0:00:01
     |████████████▊                   | 317kB 13.4MB/s eta 0:00:01
     |█████████████                   | 327kB 13.4MB/s eta 0:00:01
     |█████████████▌                  | 337kB 13.4MB/s eta 0:00:01
     |██████████████                  | 348kB 13.4MB/s eta 0:00:01
     |██████████████▎                 | 358kB 13.4MB/s eta 0:00:01
     |██████████████▊                 | 368kB 13.4MB/s eta 0:00:01
     |███████████████▏                | 378kB 13.4MB/s eta 0:00:01
     |███████████████▌                | 389kB 13.4MB/s eta 0:00:01
     |████████████████                | 399kB 13.4MB/s eta 0:00:01
     |████████████████▍               | 409kB 13.4MB/s eta 0:00:01
     |████████████████▊               | 419kB 13.4MB/s eta 0:00:01
     |█████████████████▏              | 430kB 13.4MB/s eta 0:00:01
     |█████████████████▋              | 440kB 13.4MB/s eta 0:00:01
     |██████████████████              | 450kB 13.4MB/s eta 0:00:01
     |██████████████████▍             | 460kB 13.4MB/s eta 0:00:01
     |██████████████████▉             | 471kB 13.4MB/s eta 0:00:01
     |███████████████████▏            | 481kB 13.4MB/s eta 0:00:01
     |███████████████████▋            | 491kB 13.4MB/s eta 0:00:01
     |████████████████████            | 501kB 13.4MB/s eta 0:00:01
     |████████████████████▍           | 512kB 13.4MB/s eta 0:00:01
     |████████████████████▉           | 522kB 13.4MB/s eta 0:00:01
     |█████████████████████▎          | 532kB 13.4MB/s eta 0:00:01
     |█████████████████████▊          | 542kB 13.4MB/s eta 0:00:01
     |██████████████████████          | 552kB 13.4MB/s eta 0:00:01
     |██████████████████████▌         | 563kB 13.4MB/s eta 0:00:01
     |███████████████████████         | 573kB 13.4MB/s eta 0:00:01
     |███████████████████████▎        | 583kB 13.4MB/s eta 0:00:01
     |███████████████████████▊        | 593kB 13.4MB/s eta 0:00:01
     |████████████████████████▏       | 604kB 13.4MB/s eta 0:00:01
     |████████████████████████▌       | 614kB 13.4MB/s eta 0:00:01
     |█████████████████████████       | 624kB 13.4MB/s eta 0:00:01
     |█████████████████████████▍      | 634kB 13.4MB/s eta 0:00:01
     |█████████████████████████▊      | 645kB 13.4MB/s eta 0:00:01
     |██████████████████████████▏     | 655kB 13.4MB/s eta 0:00:01
     |██████████████████████████▋     | 665kB 13.4MB/s eta 0:00:01
     |███████████████████████████     | 675kB 13.4MB/s eta 0:00:01
     |███████████████████████████▍    | 686kB 13.4MB/s eta 0:00:01
     |███████████████████████████▉    | 696kB 13.4MB/s eta 0:00:01
     |████████████████████████████▏   | 706kB 13.4MB/s eta 0:00:01
     |████████████████████████████▋   | 716kB 13.4MB/s eta 0:00:01
     |█████████████████████████████   | 727kB 13.4MB/s eta 0:00:01
     |█████████████████████████████▍  | 737kB 13.4MB/s eta 0:00:01
     |█████████████████████████████▉  | 747kB 13.4MB/s eta 0:00:01
     |██████████████████████████████▎ | 757kB 13.4MB/s eta 0:00:01
     |██████████████████████████████▋ | 768kB 13.4MB/s eta 0:00:01
     |███████████████████████████████ | 778kB 13.4MB/s eta 0:00:01
     |███████████████████████████████▌| 788kB 13.4MB/s eta 0:00:01
     |███████████████████████████████▉| 798kB 13.4MB/s eta 0:00:01
     |████████████████████████████████| 808kB 13.4MB/s 
[?25hCollecting Jinja2>=2.10 (from Flask==1.0.3->-r requirements.txt (line 1))
[?25l  Downloading https://files.pythonhosted.org/packages/65/e0/eb35e762802015cab1ccee04e8a277b03f1d8e53da3ec3106882ec42558b/Jinja2-2.10.3-py2.py3-none-any.whl (125kB)

     |██▋                             | 10kB 13.1MB/s eta 0:00:01
     |█████▎                          | 20kB 11.0MB/s eta 0:00:01
     |███████▉                        | 30kB 14.1MB/s eta 0:00:01
     |██████████▌                     | 40kB 11.9MB/s eta 0:00:01
     |█████████████                   | 51kB 11.6MB/s eta 0:00:01
     |███████████████▊                | 61kB 12.9MB/s eta 0:00:01
     |██████████████████▎             | 71kB 12.1MB/s eta 0:00:01
     |█████████████████████           | 81kB 13.1MB/s eta 0:00:01
     |███████████████████████▌        | 92kB 12.4MB/s eta 0:00:01
     |██████████████████████████▏     | 102kB 11.8MB/s eta 0:00:01
     |████████████████████████████▊   | 112kB 11.8MB/s eta 0:00:01
     |███████████████████████████████▍| 122kB 11.8MB/s eta 0:00:01
     |████████████████████████████████| 133kB 11.8MB/s 
[?25hCollecting itsdangerous>=0.24 (from Flask==1.0.3->-r requirements.txt (line 1))
  Downloading https://files.pythonhosted.org/packages/76/ae/44b03b253d6fade317f32c24d100b3b35c2239807046a4c953c7b89fa49e/itsdangerous-1.1.0-py2.py3-none-any.whl
Collecting Werkzeug>=0.14 (from Flask==1.0.3->-r requirements.txt (line 1))
[?25l  Downloading https://files.pythonhosted.org/packages/ce/42/3aeda98f96e85fd26180534d36570e4d18108d62ae36f87694b476b83d6f/Werkzeug-0.16.0-py2.py3-none-any.whl (327kB)

     |█                               | 10kB 6.3MB/s eta 0:00:01
     |██                              | 20kB 8.1MB/s eta 0:00:01
     |███                             | 30kB 9.6MB/s eta 0:00:01
     |████                            | 40kB 10.4MB/s eta 0:00:01
     |█████                           | 51kB 10.6MB/s eta 0:00:01
     |██████                          | 61kB 12.0MB/s eta 0:00:01
     |███████                         | 71kB 12.2MB/s eta 0:00:01
     |████████                        | 81kB 13.1MB/s eta 0:00:01
     |█████████                       | 92kB 13.3MB/s eta 0:00:01
     |██████████                      | 102kB 12.8MB/s eta 0:00:01
     |███████████                     | 112kB 12.8MB/s eta 0:00:01
     |████████████                    | 122kB 12.8MB/s eta 0:00:01
     |█████████████                   | 133kB 12.8MB/s eta 0:00:01
     |██████████████                  | 143kB 12.8MB/s eta 0:00:01
     |███████████████                 | 153kB 12.8MB/s eta 0:00:01
     |████████████████                | 163kB 12.8MB/s eta 0:00:01
     |█████████████████               | 174kB 12.8MB/s eta 0:00:01
     |██████████████████              | 184kB 12.8MB/s eta 0:00:01
     |███████████████████             | 194kB 12.8MB/s eta 0:00:01
     |████████████████████            | 204kB 12.8MB/s eta 0:00:01
     |█████████████████████           | 215kB 12.8MB/s eta 0:00:01
     |██████████████████████          | 225kB 12.8MB/s eta 0:00:01
     |███████████████████████         | 235kB 12.8MB/s eta 0:00:01
     |████████████████████████        | 245kB 12.8MB/s eta 0:00:01
     |█████████████████████████       | 256kB 12.8MB/s eta 0:00:01
     |██████████████████████████      | 266kB 12.8MB/s eta 0:00:01
     |███████████████████████████     | 276kB 12.8MB/s eta 0:00:01
     |████████████████████████████    | 286kB 12.8MB/s eta 0:00:01
     |█████████████████████████████   | 296kB 12.8MB/s eta 0:00:01
     |██████████████████████████████  | 307kB 12.8MB/s eta 0:00:01
     |███████████████████████████████ | 317kB 12.8MB/s eta 0:00:01
     |████████████████████████████████| 327kB 12.8MB/s 
[?25hCollecting click>=5.1 (from Flask==1.0.3->-r requirements.txt (line 1))
[?25l  Downloading https://files.pythonhosted.org/packages/fa/37/45185cb5abbc30d7257104c434fe0b07e5a195a6847506c074527aa599ec/Click-7.0-py2.py3-none-any.whl (81kB)

     |████                            | 10kB 8.4MB/s eta 0:00:01
     |████████                        | 20kB 10.1MB/s eta 0:00:01
     |████████████                    | 30kB 13.7MB/s eta 0:00:01
     |████████████████▏               | 40kB 11.9MB/s eta 0:00:01
     |████████████████████▏           | 51kB 10.7MB/s eta 0:00:01
     |████████████████████████▏       | 61kB 12.2MB/s eta 0:00:01
     |████████████████████████████▏   | 71kB 11.7MB/s eta 0:00:01
     |████████████████████████████████| 81kB 11.5MB/s 
[?25hCollecting MarkupSafe>=0.23 (from Jinja2>=2.10->Flask==1.0.3->-r requirements.txt (line 1))
  Downloading https://files.pythonhosted.org/packages/b9/2e/64db92e53b86efccfaea71321f597fa2e1b2bd3853d8ce658568f7a13094/MarkupSafe-1.1.1.tar.gz
Installing collected packages: MarkupSafe, Jinja2, itsdangerous, Werkzeug, click, Flask, mutagen, uWSGI
  Running setup.py install for MarkupSafe ... [?25l- \ done
[?25h  Running setup.py install for mutagen ... [?25l- \ done
[?25h  Running setup.py install for uWSGI ... [?25l- \ | / - \ | / - \ | / - \ | / - \ | / - \ | / - \ | / - \ | / - \ | / - \ | / - \ | / - \ | / - \ | / - \ | / - \ | / - \ | / - \ | / - \ | / - \ | / - \ | / - \ | / - \ | / - done
[?25hSuccessfully installed Flask-1.0.3 Jinja2-2.10.3 MarkupSafe-1.1.1 Werkzeug-0.16.0 click-7.0 itsdangerous-1.1.0 mutagen-1.42.0 uWSGI-2.0.18
install-dev-requirements
1
2
3
4
5
6
7
8
9
10
11
12
13
14
15
16
17
18
19
20
21
22
23
24
25
26
27
28
29
30
31
32
33
34
35
36
37
38
39
40
41
42
43
44
45
46
47
48
49
50
51
52
53
54
55
56
57
58
59
60
61
62
63
64
65
66
67
68
69
70
71
72
73
74
75
76
77
78
79
80
81
82
83
84
85
86
87
88
89
90
91
92
93
94
95
96
97
98
99
100
101
102
103
104
105
106
107
108
109
110
111
112
113
114
115
116
117
118
119
120
121
122
123
124
125
126
127
128
129
130
131
132
133
134
135
136
137
138
139
140
141
142
143
144
145
146
147
148
149
150
151
152
153
154
155
156
157
158
159
160
161
162
163
164
165
166
167
168
169
170
171
172
173
174
175
176
177
178
179
180
181
182
183
184
185
186
187
188
189
190
191
192
193
194
195
196
197
198
199
200
201
202
203
204
205
206
207
208
209
210
211
212
213
214
215
216
217
218
219
220
221
222
223
224
225
226
227
228
229
230
231
232
233
234
235
236
237
238
239
240
241
242
243
244
245
246
247
248
249
250
251
252
253
254
255
256
257
258
259
260
261
262
263
264
265
266
267
268
269
270
271
272
273
274
275
276
277
278
279
280
281
282
283
284
285
286
287
288
289
290
291
292
293
294
295
296
297
298
299
300
+ cd mousikofidi
+ sudo pip3 install -r dev-requirements.txt
Collecting black==19.3b0 (from -r dev-requirements.txt (line 1))
[?25l  Downloading https://files.pythonhosted.org/packages/30/62/cf549544a5fe990bbaeca21e9c419501b2de7a701ab0afb377bc81676600/black-19.3b0-py36-none-any.whl (89kB)

     |███▋                            | 10kB 10.4MB/s eta 0:00:01
     |███████▎                        | 20kB 3.6MB/s eta 0:00:01
     |███████████                     | 30kB 4.5MB/s eta 0:00:01
     |██████████████▋                 | 40kB 3.3MB/s eta 0:00:01
     |██████████████████▎             | 51kB 3.8MB/s eta 0:00:01
     |█████████████████████▉          | 61kB 4.3MB/s eta 0:00:01
     |█████████████████████████▌      | 71kB 4.8MB/s eta 0:00:01
     |█████████████████████████████▏  | 81kB 4.4MB/s eta 0:00:01
     |████████████████████████████████| 92kB 4.5MB/s 
[?25hCollecting flake8==3.6.0 (from -r dev-requirements.txt (line 2))
[?25l  Downloading https://files.pythonhosted.org/packages/34/a6/49e2849a0e5464e1b5d621f63bc8453066f0f367bb3b744a33fca0bc1ddd/flake8-3.6.0-py2.py3-none-any.whl (68kB)

     |████▊                           | 10kB 6.8MB/s eta 0:00:01
     |█████████▌                      | 20kB 8.7MB/s eta 0:00:01
     |██████████████▎                 | 30kB 9.8MB/s eta 0:00:01
     |███████████████████             | 40kB 10.6MB/s eta 0:00:01
     |███████████████████████▉        | 51kB 11.3MB/s eta 0:00:01
     |████████████████████████████▌   | 61kB 11.9MB/s eta 0:00:01
     |████████████████████████████████| 71kB 10.9MB/s 
[?25hCollecting pytest==5.0.1 (from -r dev-requirements.txt (line 3))
[?25l  Downloading https://files.pythonhosted.org/packages/69/1d/2430053122a3c6106f7fd1ff0bc68eb73e27db8f951db70fcd942da52c7b/pytest-5.0.1-py3-none-any.whl (221kB)

     |█▌                              | 10kB 7.1MB/s eta 0:00:01
     |███                             | 20kB 9.3MB/s eta 0:00:01
     |████▍                           | 30kB 10.5MB/s eta 0:00:01
     |██████                          | 40kB 11.2MB/s eta 0:00:01
     |███████▍                        | 51kB 11.6MB/s eta 0:00:01
     |████████▉                       | 61kB 11.7MB/s eta 0:00:01
     |██████████▍                     | 71kB 12.3MB/s eta 0:00:01
     |███████████▉                    | 81kB 13.0MB/s eta 0:00:01
     |█████████████▎                  | 92kB 12.8MB/s eta 0:00:01
     |██████████████▊                 | 102kB 12.6MB/s eta 0:00:01
     |████████████████▎               | 112kB 12.6MB/s eta 0:00:01
     |█████████████████▊              | 122kB 12.6MB/s eta 0:00:01
     |███████████████████▏            | 133kB 12.6MB/s eta 0:00:01
     |████████████████████▊           | 143kB 12.6MB/s eta 0:00:01
     |██████████████████████▏         | 153kB 12.6MB/s eta 0:00:01
     |███████████████████████▋        | 163kB 12.6MB/s eta 0:00:01
     |█████████████████████████▏      | 174kB 12.6MB/s eta 0:00:01
     |██████████████████████████▋     | 184kB 12.6MB/s eta 0:00:01
     |████████████████████████████    | 194kB 12.6MB/s eta 0:00:01
     |█████████████████████████████▌  | 204kB 12.6MB/s eta 0:00:01
     |███████████████████████████████ | 215kB 12.6MB/s eta 0:00:01
     |████████████████████████████████| 225kB 12.6MB/s 
[?25hCollecting twine==1.14.0 (from -r dev-requirements.txt (line 4))
  Downloading https://files.pythonhosted.org/packages/8b/db/5f4b228e1b3a4776a593433dd8cc250ec438216ad26c46f4be1bc9eb00ec/twine-1.14.0-py2.py3-none-any.whl
Collecting wheel==0.33.6 (from -r dev-requirements.txt (line 5))
  Downloading https://files.pythonhosted.org/packages/00/83/b4a77d044e78ad1a45610eb88f745be2fd2c6d658f9798a15e384b7d57c9/wheel-0.33.6-py2.py3-none-any.whl
Collecting attrs>=18.1.0 (from black==19.3b0->-r dev-requirements.txt (line 1))
  Downloading https://files.pythonhosted.org/packages/a2/db/4313ab3be961f7a763066401fb77f7748373b6094076ae2bda2806988af6/attrs-19.3.0-py2.py3-none-any.whl
Collecting toml>=0.9.4 (from black==19.3b0->-r dev-requirements.txt (line 1))
  Downloading https://files.pythonhosted.org/packages/a2/12/ced7105d2de62fa7c8fb5fce92cc4ce66b57c95fb875e9318dba7f8c5db0/toml-0.10.0-py2.py3-none-any.whl
Requirement already satisfied: appdirs in /usr/lib/python3.8/site-packages (from black==19.3b0->-r dev-requirements.txt (line 1)) (1.4.3)
Requirement already satisfied: click>=6.5 in /usr/lib/python3.8/site-packages (from black==19.3b0->-r dev-requirements.txt (line 1)) (7.0)
Collecting pycodestyle<2.5.0,>=2.4.0 (from flake8==3.6.0->-r dev-requirements.txt (line 2))
[?25l  Downloading https://files.pythonhosted.org/packages/e5/c6/ce130213489969aa58610042dff1d908c25c731c9575af6935c2dfad03aa/pycodestyle-2.4.0-py2.py3-none-any.whl (62kB)

     |█████▎                          | 10kB 8.8MB/s eta 0:00:01
     |██████████▌                     | 20kB 11.3MB/s eta 0:00:01
     |███████████████▊                | 30kB 13.3MB/s eta 0:00:01
     |█████████████████████           | 40kB 13.9MB/s eta 0:00:01
     |██████████████████████████▎     | 51kB 12.2MB/s eta 0:00:01
     |███████████████████████████████▌| 61kB 13.5MB/s eta 0:00:01
     |████████████████████████████████| 71kB 10.7MB/s 
[?25hCollecting pyflakes<2.1.0,>=2.0.0 (from flake8==3.6.0->-r dev-requirements.txt (line 2))
[?25l  Downloading https://files.pythonhosted.org/packages/44/98/af7a72c9a543b1487d92813c648cb9b9adfbc96faef5455d60f4439aa99b/pyflakes-2.0.0-py2.py3-none-any.whl (53kB)

     |██████▏                         | 10kB 8.8MB/s eta 0:00:01
     |████████████▎                   | 20kB 10.9MB/s eta 0:00:01
     |██████████████████▍             | 30kB 12.8MB/s eta 0:00:01
     |████████████████████████▌       | 40kB 13.9MB/s eta 0:00:01
     |██████████████████████████████▊ | 51kB 14.9MB/s eta 0:00:01
     |████████████████████████████████| 61kB 10.9MB/s 
[?25hCollecting mccabe<0.7.0,>=0.6.0 (from flake8==3.6.0->-r dev-requirements.txt (line 2))
  Downloading https://files.pythonhosted.org/packages/87/89/479dc97e18549e21354893e4ee4ef36db1d237534982482c3681ee6e7b57/mccabe-0.6.1-py2.py3-none-any.whl
Requirement already satisfied: setuptools>=30 in /usr/lib/python3.8/site-packages (from flake8==3.6.0->-r dev-requirements.txt (line 2)) (41.2.0)
Collecting atomicwrites>=1.0 (from pytest==5.0.1->-r dev-requirements.txt (line 3))
  Downloading https://files.pythonhosted.org/packages/52/90/6155aa926f43f2b2a22b01be7241be3bfd1ceaf7d0b3267213e8127d41f4/atomicwrites-1.3.0-py2.py3-none-any.whl
Collecting pluggy<1.0,>=0.12 (from pytest==5.0.1->-r dev-requirements.txt (line 3))
  Downloading https://files.pythonhosted.org/packages/92/c7/48439f7d5fd6bddb4c04b850bb862b42e3e2b98570040dfaf68aedd8114b/pluggy-0.13.0-py2.py3-none-any.whl
Requirement already satisfied: packaging in /usr/lib/python3.8/site-packages (from pytest==5.0.1->-r dev-requirements.txt (line 3)) (19.2)
Requirement already satisfied: importlib-metadata>=0.12 in /usr/lib/python3.8/site-packages (from pytest==5.0.1->-r dev-requirements.txt (line 3)) (0.23)
Collecting wcwidth (from pytest==5.0.1->-r dev-requirements.txt (line 3))
  Downloading https://files.pythonhosted.org/packages/7e/9f/526a6947247599b084ee5232e4f9190a38f398d7300d866af3ab571a5bfe/wcwidth-0.1.7-py2.py3-none-any.whl
Requirement already satisfied: more-itertools>=4.0.0 in /usr/lib/python3.8/site-packages (from pytest==5.0.1->-r dev-requirements.txt (line 3)) (7.2.0)
Collecting py>=1.5.0 (from pytest==5.0.1->-r dev-requirements.txt (line 3))
[?25l  Downloading https://files.pythonhosted.org/packages/76/bc/394ad449851729244a97857ee14d7cba61ddb268dce3db538ba2f2ba1f0f/py-1.8.0-py2.py3-none-any.whl (83kB)

     |████                            | 10kB 15.8MB/s eta 0:00:01
     |███████▉                        | 20kB 9.4MB/s eta 0:00:01
     |███████████▊                    | 30kB 11.3MB/s eta 0:00:01
     |███████████████▋                | 40kB 11.3MB/s eta 0:00:01
     |███████████████████▋            | 51kB 10.5MB/s eta 0:00:01
     |███████████████████████▌        | 61kB 11.4MB/s eta 0:00:01
     |███████████████████████████▍    | 71kB 11.2MB/s eta 0:00:01
     |███████████████████████████████▎| 81kB 12.1MB/s eta 0:00:01
     |████████████████████████████████| 92kB 10.4MB/s 
[?25hCollecting pkginfo>=1.4.2 (from twine==1.14.0->-r dev-requirements.txt (line 4))
  Downloading https://files.pythonhosted.org/packages/e6/d5/451b913307b478c49eb29084916639dc53a88489b993530fed0a66bab8b9/pkginfo-1.5.0.1-py2.py3-none-any.whl
Collecting tqdm>=4.14 (from twine==1.14.0->-r dev-requirements.txt (line 4))
[?25l  Downloading https://files.pythonhosted.org/packages/b9/08/8505f192efc72bfafec79655e1d8351d219e2b80b0dec4ae71f50934c17a/tqdm-4.38.0-py2.py3-none-any.whl (53kB)

     |██████▏                         | 10kB 14.4MB/s eta 0:00:01
     |████████████▎                   | 20kB 10.1MB/s eta 0:00:01
     |██████████████████▍             | 30kB 14.1MB/s eta 0:00:01
     |████████████████████████▌       | 40kB 12.5MB/s eta 0:00:01
     |██████████████████████████████▋ | 51kB 13.5MB/s eta 0:00:01
     |████████████████████████████████| 61kB 13.0MB/s 
[?25hCollecting readme-renderer>=21.0 (from twine==1.14.0->-r dev-requirements.txt (line 4))
  Downloading https://files.pythonhosted.org/packages/c3/7e/d1aae793900f36b097cbfcc5e70eef82b5b56423a6c52a36dce51fedd8f0/readme_renderer-24.0-py2.py3-none-any.whl
Collecting requests-toolbelt!=0.9.0,>=0.8.0 (from twine==1.14.0->-r dev-requirements.txt (line 4))
[?25l  Downloading https://files.pythonhosted.org/packages/60/ef/7681134338fc097acef8d9b2f8abe0458e4d87559c689a8c306d0957ece5/requests_toolbelt-0.9.1-py2.py3-none-any.whl (54kB)

     |██████                          | 10kB 15.3MB/s eta 0:00:01
     |████████████                    | 20kB 10.2MB/s eta 0:00:01
     |██████████████████              | 30kB 14.3MB/s eta 0:00:01
     |████████████████████████▏       | 40kB 12.5MB/s eta 0:00:01
     |██████████████████████████████▏ | 51kB 13.3MB/s eta 0:00:01
     |████████████████████████████████| 61kB 13.0MB/s 
[?25hRequirement already satisfied: requests!=2.15,!=2.16,>=2.5.0 in /usr/lib/python3.8/site-packages (from twine==1.14.0->-r dev-requirements.txt (line 4)) (2.22.0)
Requirement already satisfied: pyparsing>=2.0.2 in /usr/lib/python3.8/site-packages (from packaging->pytest==5.0.1->-r dev-requirements.txt (line 3)) (2.4.5)
Requirement already satisfied: six in /usr/lib/python3.8/site-packages (from packaging->pytest==5.0.1->-r dev-requirements.txt (line 3)) (1.13.0)
Requirement already satisfied: zipp>=0.5 in /usr/lib/python3.8/site-packages (from importlib-metadata>=0.12->pytest==5.0.1->-r dev-requirements.txt (line 3)) (0.6.0)
Collecting bleach>=2.1.0 (from readme-renderer>=21.0->twine==1.14.0->-r dev-requirements.txt (line 4))
[?25l  Downloading https://files.pythonhosted.org/packages/ab/05/27e1466475e816d3001efb6e0a85a819be17411420494a1e602c36f8299d/bleach-3.1.0-py2.py3-none-any.whl (157kB)

     |██                              | 10kB 17.5MB/s eta 0:00:01
     |████▏                           | 20kB 9.8MB/s eta 0:00:01
     |██████▎                         | 30kB 13.6MB/s eta 0:00:01
     |████████▎                       | 40kB 12.4MB/s eta 0:00:01
     |██████████▍                     | 51kB 10.7MB/s eta 0:00:01
     |████████████▌                   | 61kB 12.5MB/s eta 0:00:01
     |██████████████▋                 | 71kB 11.5MB/s eta 0:00:01
     |████████████████▋               | 81kB 12.8MB/s eta 0:00:01
     |██████████████████▊             | 92kB 11.9MB/s eta 0:00:01
     |████████████████████▉           | 102kB 11.1MB/s eta 0:00:01
     |███████████████████████         | 112kB 11.1MB/s eta 0:00:01
     |█████████████████████████       | 122kB 11.1MB/s eta 0:00:01
     |███████████████████████████     | 133kB 11.1MB/s eta 0:00:01
     |█████████████████████████████▏  | 143kB 11.1MB/s eta 0:00:01
     |███████████████████████████████▏| 153kB 11.1MB/s eta 0:00:01
     |████████████████████████████████| 163kB 11.1MB/s 
[?25hCollecting docutils>=0.13.1 (from readme-renderer>=21.0->twine==1.14.0->-r dev-requirements.txt (line 4))
[?25l  Downloading https://files.pythonhosted.org/packages/22/cd/a6aa959dca619918ccb55023b4cb151949c64d4d5d55b3f4ffd7eee0c6e8/docutils-0.15.2-py3-none-any.whl (547kB)

     |▋                               | 10kB 14.4MB/s eta 0:00:01
     |█▏                              | 20kB 9.6MB/s eta 0:00:01
     |█▉                              | 30kB 11.5MB/s eta 0:00:01
     |██▍                             | 40kB 11.3MB/s eta 0:00:01
     |███                             | 51kB 10.6MB/s eta 0:00:01
     |███▋                            | 61kB 11.6MB/s eta 0:00:01
     |████▏                           | 71kB 11.3MB/s eta 0:00:01
     |████▉                           | 81kB 12.1MB/s eta 0:00:01
     |█████▍                          | 92kB 11.9MB/s eta 0:00:01
     |██████                          | 102kB 11.3MB/s eta 0:00:01
     |██████▋                         | 112kB 11.3MB/s eta 0:00:01
     |███████▏                        | 122kB 11.3MB/s eta 0:00:01
     |███████▉                        | 133kB 11.3MB/s eta 0:00:01
     |████████▍                       | 143kB 11.3MB/s eta 0:00:01
     |█████████                       | 153kB 11.3MB/s eta 0:00:01
     |█████████▋                      | 163kB 11.3MB/s eta 0:00:01
     |██████████▏                     | 174kB 11.3MB/s eta 0:00:01
     |██████████▊                     | 184kB 11.3MB/s eta 0:00:01
     |███████████▍                    | 194kB 11.3MB/s eta 0:00:01
     |████████████                    | 204kB 11.3MB/s eta 0:00:01
     |████████████▋                   | 215kB 11.3MB/s eta 0:00:01
     |█████████████▏                  | 225kB 11.3MB/s eta 0:00:01
     |█████████████▊                  | 235kB 11.3MB/s eta 0:00:01
     |██████████████▍                 | 245kB 11.3MB/s eta 0:00:01
     |███████████████                 | 256kB 11.3MB/s eta 0:00:01
     |███████████████▋                | 266kB 11.3MB/s eta 0:00:01
     |████████████████▏               | 276kB 11.3MB/s eta 0:00:01
     |████████████████▊               | 286kB 11.3MB/s eta 0:00:01
     |█████████████████▍              | 296kB 11.3MB/s eta 0:00:01
     |██████████████████              | 307kB 11.3MB/s eta 0:00:01
     |██████████████████▌             | 317kB 11.3MB/s eta 0:00:01
     |███████████████████▏            | 327kB 11.3MB/s eta 0:00:01
     |███████████████████▊            | 337kB 11.3MB/s eta 0:00:01
     |████████████████████▍           | 348kB 11.3MB/s eta 0:00:01
     |█████████████████████           | 358kB 11.3MB/s eta 0:00:01
     |█████████████████████▌          | 368kB 11.3MB/s eta 0:00:01
     |██████████████████████▏         | 378kB 11.3MB/s eta 0:00:01
     |██████████████████████▊         | 389kB 11.3MB/s eta 0:00:01
     |███████████████████████▍        | 399kB 11.3MB/s eta 0:00:01
     |████████████████████████        | 409kB 11.3MB/s eta 0:00:01
     |████████████████████████▌       | 419kB 11.3MB/s eta 0:00:01
     |█████████████████████████▏      | 430kB 11.3MB/s eta 0:00:01
     |█████████████████████████▊      | 440kB 11.3MB/s eta 0:00:01
     |██████████████████████████▎     | 450kB 11.3MB/s eta 0:00:01
     |███████████████████████████     | 460kB 11.3MB/s eta 0:00:01
     |███████████████████████████▌    | 471kB 11.3MB/s eta 0:00:01
     |████████████████████████████▏   | 481kB 11.3MB/s eta 0:00:01
     |████████████████████████████▊   | 491kB 11.3MB/s eta 0:00:01
     |█████████████████████████████▎  | 501kB 11.3MB/s eta 0:00:01
     |██████████████████████████████  | 512kB 11.3MB/s eta 0:00:01
     |██████████████████████████████▌ | 522kB 11.3MB/s eta 0:00:01
     |███████████████████████████████▏| 532kB 11.3MB/s eta 0:00:01
     |███████████████████████████████▊| 542kB 11.3MB/s eta 0:00:01
     |████████████████████████████████| 552kB 11.3MB/s 
[?25hCollecting Pygments (from readme-renderer>=21.0->twine==1.14.0->-r dev-requirements.txt (line 4))
[?25l  Downloading https://files.pythonhosted.org/packages/5c/73/1dfa428150e3ccb0fa3e68db406e5be48698f2a979ccbcec795f28f44048/Pygments-2.4.2-py2.py3-none-any.whl (883kB)

     |▍                               | 10kB 7.1MB/s eta 0:00:01
     |▊                               | 20kB 8.9MB/s eta 0:00:01
     |█▏                              | 30kB 11.3MB/s eta 0:00:01
     |█▌                              | 40kB 11.7MB/s eta 0:00:01
     |█▉                              | 51kB 10.7MB/s eta 0:00:01
     |██▎                             | 61kB 11.9MB/s eta 0:00:01
     |██▋                             | 71kB 11.3MB/s eta 0:00:01
     |███                             | 81kB 11.9MB/s eta 0:00:01
     |███▍                            | 92kB 11.9MB/s eta 0:00:01
     |███▊                            | 102kB 11.4MB/s eta 0:00:01
     |████                            | 112kB 11.4MB/s eta 0:00:01
     |████▌                           | 122kB 11.4MB/s eta 0:00:01
     |████▉                           | 133kB 11.4MB/s eta 0:00:01
     |█████▏                          | 143kB 11.4MB/s eta 0:00:01
     |█████▋                          | 153kB 11.4MB/s eta 0:00:01
     |██████                          | 163kB 11.4MB/s eta 0:00:01
     |██████▎                         | 174kB 11.4MB/s eta 0:00:01
     |██████▊                         | 184kB 11.4MB/s eta 0:00:01
     |███████                         | 194kB 11.4MB/s eta 0:00:01
     |███████▍                        | 204kB 11.4MB/s eta 0:00:01
     |███████▉                        | 215kB 11.4MB/s eta 0:00:01
     |████████▏                       | 225kB 11.4MB/s eta 0:00:01
     |████████▌                       | 235kB 11.4MB/s eta 0:00:01
     |█████████                       | 245kB 11.4MB/s eta 0:00:01
     |█████████▎                      | 256kB 11.4MB/s eta 0:00:01
     |█████████▋                      | 266kB 11.4MB/s eta 0:00:01
     |██████████                      | 276kB 11.4MB/s eta 0:00:01
     |██████████▍                     | 286kB 11.4MB/s eta 0:00:01
     |██████████▊                     | 296kB 11.4MB/s eta 0:00:01
     |███████████▏                    | 307kB 11.4MB/s eta 0:00:01
     |███████████▌                    | 317kB 11.4MB/s eta 0:00:01
     |███████████▉                    | 327kB 11.4MB/s eta 0:00:01
     |████████████▎                   | 337kB 11.4MB/s eta 0:00:01
     |████████████▋                   | 348kB 11.4MB/s eta 0:00:01
     |█████████████                   | 358kB 11.4MB/s eta 0:00:01
     |█████████████▍                  | 368kB 11.4MB/s eta 0:00:01
     |█████████████▊                  | 378kB 11.4MB/s eta 0:00:01
     |██████████████                  | 389kB 11.4MB/s eta 0:00:01
     |██████████████▌                 | 399kB 11.4MB/s eta 0:00:01
     |██████████████▉                 | 409kB 11.4MB/s eta 0:00:01
     |███████████████▏                | 419kB 11.4MB/s eta 0:00:01
     |███████████████▋                | 430kB 11.4MB/s eta 0:00:01
     |████████████████                | 440kB 11.4MB/s eta 0:00:01
     |████████████████▎               | 450kB 11.4MB/s eta 0:00:01
     |████████████████▊               | 460kB 11.4MB/s eta 0:00:01
     |█████████████████               | 471kB 11.4MB/s eta 0:00:01
     |█████████████████▍              | 481kB 11.4MB/s eta 0:00:01
     |█████████████████▉              | 491kB 11.4MB/s eta 0:00:01
     |██████████████████▏             | 501kB 11.4MB/s eta 0:00:01
     |██████████████████▌             | 512kB 11.4MB/s eta 0:00:01
     |███████████████████             | 522kB 11.4MB/s eta 0:00:01
     |███████████████████▎            | 532kB 11.4MB/s eta 0:00:01
     |███████████████████▋            | 542kB 11.4MB/s eta 0:00:01
     |████████████████████            | 552kB 11.4MB/s eta 0:00:01
     |████████████████████▍           | 563kB 11.4MB/s eta 0:00:01
     |████████████████████▉           | 573kB 11.4MB/s eta 0:00:01
     |█████████████████████▏          | 583kB 11.4MB/s eta 0:00:01
     |█████████████████████▌          | 593kB 11.4MB/s eta 0:00:01
     |██████████████████████          | 604kB 11.4MB/s eta 0:00:01
     |██████████████████████▎         | 614kB 11.4MB/s eta 0:00:01
     |██████████████████████▋         | 624kB 11.4MB/s eta 0:00:01
     |███████████████████████         | 634kB 11.4MB/s eta 0:00:01
     |███████████████████████▍        | 645kB 11.4MB/s eta 0:00:01
     |███████████████████████▊        | 655kB 11.4MB/s eta 0:00:01
     |████████████████████████▏       | 665kB 11.4MB/s eta 0:00:01
     |████████████████████████▌       | 675kB 11.4MB/s eta 0:00:01
     |████████████████████████▉       | 686kB 11.4MB/s eta 0:00:01
     |█████████████████████████▎      | 696kB 11.4MB/s eta 0:00:01
     |█████████████████████████▋      | 706kB 11.4MB/s eta 0:00:01
     |██████████████████████████      | 716kB 11.4MB/s eta 0:00:01
     |██████████████████████████▍     | 727kB 11.4MB/s eta 0:00:01
     |██████████████████████████▊     | 737kB 11.4MB/s eta 0:00:01
     |███████████████████████████     | 747kB 11.4MB/s eta 0:00:01
     |███████████████████████████▌    | 757kB 11.4MB/s eta 0:00:01
     |███████████████████████████▉    | 768kB 11.4MB/s eta 0:00:01
     |████████████████████████████▏   | 778kB 11.4MB/s eta 0:00:01
     |████████████████████████████▋   | 788kB 11.4MB/s eta 0:00:01
     |█████████████████████████████   | 798kB 11.4MB/s eta 0:00:01
     |█████████████████████████████▎  | 808kB 11.4MB/s eta 0:00:01
     |█████████████████████████████▊  | 819kB 11.4MB/s eta 0:00:01
     |██████████████████████████████  | 829kB 11.4MB/s eta 0:00:01
     |██████████████████████████████▍ | 839kB 11.4MB/s eta 0:00:01
     |██████████████████████████████▉ | 849kB 11.4MB/s eta 0:00:01
     |███████████████████████████████▏| 860kB 11.4MB/s eta 0:00:01
     |███████████████████████████████▌| 870kB 11.4MB/s eta 0:00:01
     |████████████████████████████████| 880kB 11.4MB/s eta 0:00:01
     |████████████████████████████████| 890kB 11.4MB/s 
[?25hRequirement already satisfied: chardet>=3.0.2 in /usr/lib/python3.8/site-packages (from requests!=2.15,!=2.16,>=2.5.0->twine==1.14.0->-r dev-requirements.txt (line 4)) (3.0.4)
Requirement already satisfied: idna>=2.5 in /usr/lib/python3.8/site-packages (from requests!=2.15,!=2.16,>=2.5.0->twine==1.14.0->-r dev-requirements.txt (line 4)) (2.8)
Requirement already satisfied: urllib3>=1.21.1 in /usr/lib/python3.8/site-packages (from requests!=2.15,!=2.16,>=2.5.0->twine==1.14.0->-r dev-requirements.txt (line 4)) (1.25.7)
Requirement already satisfied: webencodings in /usr/lib/python3.8/site-packages (from bleach>=2.1.0->readme-renderer>=21.0->twine==1.14.0->-r dev-requirements.txt (line 4)) (0.5.1)
Installing collected packages: attrs, toml, black, pycodestyle, pyflakes, mccabe, flake8, atomicwrites, pluggy, wcwidth, py, pytest, pkginfo, tqdm, bleach, docutils, Pygments, readme-renderer, requests-toolbelt, twine, wheel
Successfully installed Pygments-2.4.2 atomicwrites-1.3.0 attrs-19.3.0 black-19.3b0 bleach-3.1.0 docutils-0.15.2 flake8-3.6.0 mccabe-0.6.1 pkginfo-1.5.0.1 pluggy-0.13.0 py-1.8.0 pycodestyle-2.4.0 pyflakes-2.0.0 pytest-5.0.1 readme-renderer-24.0 requests-toolbelt-0.9.1 toml-0.10.0 tqdm-4.38.0 twine-1.14.0 wcwidth-0.1.7 wheel-0.33.6
setup-flake8
1
2
3
4
+ mkdir /home/build/.config
mkdir: cannot create directory '/home/build/.config': File exists
+ printf OK
OK+ cat
test-black
1
2
3
4
5
+ cd mousikofidi
+ make test-black
black --check /home/build/mousikofidi
All done! ✨ 🍰 ✨
4 files would be left unchanged.
test-flake8
1
2
3
4
5
6
7
8
9
10
11
12
13
14
15
16
17
18
19
20
21
22
23
24
25
26
27
28
29
30
31
32
33
34
35
36
37
38
39
40
41
42
43
44
45
46
47
48
49
50
51
52
53
54
55
56
57
58
59
60
61
62
63
64
65
66
67
68
69
70
71
+ cd mousikofidi
+ make test-flake8
flake8 /home/build/mousikofidi
multiprocessing.pool.RemoteTraceback: 
"""
Traceback (most recent call last):
  File "/usr/lib/python3.8/site-packages/flake8/checker.py", line 451, in run_check
    return plugin["plugin"](**arguments)
  File "/usr/lib/python3.8/site-packages/flake8/plugins/pyflakes.py", line 99, in __init__
    super(FlakesChecker, self).__init__(
  File "/usr/lib/python3.8/site-packages/pyflakes/checker.py", line 497, in __init__
    self.handleChildren(tree)
  File "/usr/lib/python3.8/site-packages/pyflakes/checker.py", line 824, in handleChildren
    self.handleNode(node, tree)
  File "/usr/lib/python3.8/site-packages/pyflakes/checker.py", line 871, in handleNode
    handler(node)
  File "/usr/lib/python3.8/site-packages/pyflakes/checker.py", line 824, in handleChildren
    self.handleNode(node, tree)
  File "/usr/lib/python3.8/site-packages/pyflakes/checker.py", line 871, in handleNode
    handler(node)
  File "/usr/lib/python3.8/site-packages/pyflakes/checker.py", line 824, in handleChildren
    self.handleNode(node, tree)
  File "/usr/lib/python3.8/site-packages/pyflakes/checker.py", line 871, in handleNode
    handler(node)
  File "/usr/lib/python3.8/site-packages/pyflakes/checker.py", line 824, in handleChildren
    self.handleNode(node, tree)
  File "/usr/lib/python3.8/site-packages/pyflakes/checker.py", line 870, in handleNode
    handler = self.getNodeHandler(node.__class__)
  File "/usr/lib/python3.8/site-packages/pyflakes/checker.py", line 700, in getNodeHandler
    self._nodeHandlers[node_class] = handler = getattr(self, nodeType)
AttributeError: 'FlakesChecker' object has no attribute 'CONSTANT'

During handling of the above exception, another exception occurred:

Traceback (most recent call last):
  File "/usr/lib/python3.8/multiprocessing/pool.py", line 125, in worker
    result = (True, func(*args, **kwds))
  File "/usr/lib/python3.8/site-packages/flake8/checker.py", line 682, in _run_checks
    return checker.run_checks()
  File "/usr/lib/python3.8/site-packages/flake8/checker.py", line 612, in run_checks
    self.run_ast_checks()
  File "/usr/lib/python3.8/site-packages/flake8/checker.py", line 513, in run_ast_checks
    checker = self.run_check(plugin, tree=ast)
  File "/usr/lib/python3.8/site-packages/flake8/checker.py", line 456, in run_check
    raise exceptions.PluginExecutionFailed(
  File "/usr/lib/python3.8/site-packages/flake8/exceptions.py", line 86, in __init__
    self.original_exception = kwargs.pop("exception")
KeyError: 'exception'
"""

The above exception was the direct cause of the following exception:

Traceback (most recent call last):
  File "/usr/bin/flake8", line 10, in <module>
    sys.exit(main())
  File "/usr/lib/python3.8/site-packages/flake8/main/cli.py", line 16, in main
    app.run(argv)
  File "/usr/lib/python3.8/site-packages/flake8/main/application.py", line 412, in run
    self._run(argv)
  File "/usr/lib/python3.8/site-packages/flake8/main/application.py", line 400, in _run
    self.run_checks()
  File "/usr/lib/python3.8/site-packages/flake8/main/application.py", line 318, in run_checks
    self.file_checker_manager.run()
  File "/usr/lib/python3.8/site-packages/flake8/checker.py", line 338, in run
    self.run_parallel()
  File "/usr/lib/python3.8/site-packages/flake8/checker.py", line 302, in run_parallel
    for ret in pool_map:
  File "/usr/lib/python3.8/multiprocessing/pool.py", line 865, in next
    raise value
KeyError: 'exception'
make: *** [Makefile:93: test-flake8] Error 1
Build complete: failed 8 months ago (took a minute)