#254153 failed

Owner
~emersion
Created
1 year, 13 days ago
Updated
1 year, 13 days ago
Build manifest
view manifest »

Tasks

view log »
_apply_patch view log »
setup view log »
build view log »
test view log »
build-release view log »
build-minimal view log »
go to bottom »
setup
1
2
3
4
5
6
7
8
9
10
11
12
13
14
15
16
17
18
19
20
21
22
23
24
25
26
27
28
29
30
31
32
33
34
35
36
37
38
39
40
41
42
43
44
45
46
47
48
49
50
51
52
53
54
55
56
57
58
59
60
61
62
63
64
65
66
67
68
69
70
71
72
73
[#254153] 2020/07/13 20:48:06 Booting image archlinux (default) on port 22257
[#254153] 2020/07/13 20:48:06 Waiting for guest to settle
[#254153] 2020/07/13 20:48:14 Sending tasks
[#254153] 2020/07/13 20:48:15 Sending build environment
[#254153] 2020/07/13 20:48:15 Installing packages
Warning: Permanently added '[localhost]:22257' (ECDSA) to the list of known hosts.
:: Synchronizing package databases...
 core is up to date
 extra is up to date
downloading community.db...
warning: gcc-10.1.0-2 is up to date -- skipping
:: Starting full system upgrade...
warning: readline-8.0.004-1 is up to date -- skipping
resolving dependencies...
looking for conflicting packages...

Packages (8) ninja-1.10.0-1  python-appdirs-1.4.4-1  python-ordered-set-3.1.1-2  python-packaging-20.4-1  python-pyparsing-2.4.7-1  python-setuptools-1:49.2.0-1  python-six-1.15.0-1  meson-0.54.3-1

Total Download Size:    1.89 MiB
Total Installed Size:  10.24 MiB

:: Proceed with installation? [Y/n] 
:: Retrieving packages...
downloading python-appdirs-1.4.4-1-any.pkg.tar.zst...
downloading python-pyparsing-2.4.7-1-any.pkg.tar.zst...
downloading python-six-1.15.0-1-any.pkg.tar.zst...
downloading python-packaging-20.4-1-any.pkg.tar.zst...
downloading python-ordered-set-3.1.1-2-any.pkg.tar.zst...
downloading python-setuptools-1:49.2.0-1-any.pkg.tar.zst...
downloading meson-0.54.3-1-any.pkg.tar.zst...
downloading ninja-1.10.0-1-x86_64.pkg.tar.zst...
checking keyring...
checking package integrity...
loading package files...
checking for file conflicts...
checking available disk space...
:: Processing package changes...
installing python-appdirs...
installing python-pyparsing...
installing python-six...
installing python-packaging...
installing python-ordered-set...
installing python-setuptools...
installing ninja...
installing meson...
:: Running post-transaction hooks...
(1/1) Arming ConditionNeedsUpdate...
:: Searching databases for updates...
:: Searching AUR for updates...
 there is nothing to do
[#254153] 2020/07/13 20:48:18 Cloning repositories
Cloning into 'mrsh'...
+ cd mrsh
+ git submodule update --init
[#254153] 2020/07/13 20:48:20 Running task _apply_patch
[#254153] 2020/07/13 20:48:21 Running task setup
[#254153] 2020/07/13 20:48:22 Running task build
[#254153] 2020/07/13 20:48:26 Running task test
[#254153] 2020/07/13 20:48:28 Running task build-release
[#254153] 2020/07/13 20:48:32 Processing post-failed triggers...
[#254153] 2020/07/13 20:48:33 Sent build results email to , c, o, n, t, a, c, t, , e, m, e, r, s, i, o, n, ., f, r, , Drew DeVault <sir@cmpwn.com>
[#254153] 2020/07/13 20:48:33 Sending webhook...
[#254153] 2020/07/13 20:48:33 Webhook response: 200
[#254153] 2020/07/13 20:48:33 Thanks!
[#254153] 2020/07/13 20:48:33 Build failed.
[#254153] 2020/07/13 20:48:33 The build environment will be kept alive for 10 minutes.
[#254153] 2020/07/13 20:48:33 To log in with SSH and examine it, use the following command:
[#254153] 2020/07/13 20:48:33 
[#254153] 2020/07/13 20:48:33 	ssh -t builds@azusa.runners.sr.ht connect 254153
[#254153] 2020/07/13 20:48:33 
[#254153] 2020/07/13 20:48:33 After logging in, the deadline is increased to your remaining build time.
[#254153] 2020/07/13 20:58:33 Deadline elapsed. Terminating build environment.
[#254153] 2020/07/13 20:58:33 Error: Running task on guest: exit status 1
_apply_patch
1
2
3
4
5
6
7
8
+ echo Applying patch from lists.sr.ht
Applying patch from lists.sr.ht
+ git config --global user.name builds.sr.ht
+ git config --global user.email builds@sr.ht
+ cd mrsh
+ curl --no-progress-meter https://lists.sr.ht/~emersion/mrsh-dev/patches/11599/mbox
+ git am -3 /tmp/11599.patch
Applying: mrsh_populate_env: unset COLUMNS
setup
1
2
3
4
5
6
7
8
9
10
11
12
13
14
15
16
17
18
19
20
21
22
23
24
25
26
27
28
29
30
31
32
33
34
35
36
37
38
39
40
41
42
43
44
45
+ cd mrsh
+ meson build -Db_sanitize=address,undefined -Dauto_features=enabled
The Meson build system
Version: 0.54.3
Source dir: /home/build/mrsh
Build dir: /home/build/mrsh/build
Build type: native build
Project name: mrsh
Project version: 0.0.0
C compiler for the host machine: cc (gcc 10.1.0 "cc (GCC) 10.1.0")
C linker for the host machine: cc ld.bfd 2.34.0
Host machine cpu family: x86_64
Host machine cpu: x86_64
Compiler for C supports arguments -Wundef: YES 
Compiler for C supports arguments -Wlogical-op: YES 
Compiler for C supports arguments -Wmissing-include-dirs: YES 
Compiler for C supports arguments -Wold-style-definition: YES 
Compiler for C supports arguments -Wpointer-arith: YES 
Compiler for C supports arguments -Winit-self: YES 
Compiler for C supports arguments -Wfloat-equal: YES 
Compiler for C supports arguments -Wstrict-prototypes: YES 
Compiler for C supports arguments -Wredundant-decls: YES 
Compiler for C supports arguments -Wimplicit-fallthrough=2: YES 
Compiler for C supports arguments -Wendif-labels: YES 
Compiler for C supports arguments -Wstrict-aliasing=2: YES 
Compiler for C supports arguments -Woverflow: YES 
Compiler for C supports arguments -Wformat=2: YES 
Compiler for C supports arguments -Wmissing-prototypes: YES 
Compiler for C supports arguments -Wno-missing-braces -Wmissing-braces: YES 
Compiler for C supports arguments -Wno-missing-field-initializers -Wmissing-field-initializers: YES 
Compiler for C supports arguments -Wno-unused-parameter -Wunused-parameter: YES 
Compiler for C supports arguments -Wno-unused-result -Wunused-result: YES 
Library readline found: YES
Checking for function "rl_replace_line" with dependency -lreadline: YES 
Checking if "-Wl,--version-script" links: YES 
Program ./harness.sh found: YES (/home/build/mrsh/test/./harness.sh)
Program sh found: YES (/usr/bin/sh)
Program ./harness.sh found: YES (/bin/sh /home/build/mrsh/test/conformance/./harness.sh)
Message: 
Features:
  readline: true
  examples: true
Build targets in project: 3

Found ninja-1.10.0 at /usr/bin/ninja
build
1
2
3
4
5
6
7
8
9
10
11
12
13
14
15
16
17
18
19
20
21
22
23
24
25
26
27
28
29
30
31
32
33
34
35
36
37
38
39
40
41
42
43
44
45
46
47
48
49
50
51
52
53
54
55
56
57
58
59
60
61
62
63
64
65
66
67
68
69
70
71
72
73
74
75
76
77
78
79
80
81
82
83
84
85
86
87
88
89
90
91
92
93
94
95
96
97
98
99
100
101
102
103
104
105
106
107
108
109
110
111
112
113
114
115
116
117
118
119
120
121
122
123
124
125
126
127
128
129
130
+ cd mrsh
+ ninja -C build
ninja: Entering directory `build'

[0/63] Compiling C object 'mrsh@sha/arithm.c.o'
[0/63] Compiling C object 'mrsh@sha/array.c.o'
[0/63] Compiling C object 'mrsh@sha/ast_print.c.o'
[1/63] Compiling C object 'mrsh@sha/array.c.o'
[1/63] Compiling C object 'mrsh@sha/ast.c.o'
[2/63] Compiling C object 'mrsh@sha/arithm.c.o'
[2/63] Compiling C object 'mrsh@sha/buffer.c.o'
[3/63] Compiling C object 'mrsh@sha/buffer.c.o'
[3/63] Compiling C object 'mrsh@sha/builtin_alias.c.o'
[4/63] Compiling C object 'mrsh@sha/ast_print.c.o'
[4/63] Compiling C object 'mrsh@sha/builtin_bg.c.o'
[5/63] Compiling C object 'mrsh@sha/builtin_alias.c.o'
[5/63] Compiling C object 'mrsh@sha/builtin_break.c.o'
[6/63] Compiling C object 'mrsh@sha/builtin_bg.c.o'
[6/63] Compiling C object 'mrsh@sha/builtin_builtin.c.o'
[7/63] Compiling C object 'mrsh@sha/builtin_break.c.o'
[7/63] Compiling C object 'mrsh@sha/builtin_cd.c.o'
[8/63] Compiling C object 'mrsh@sha/builtin_builtin.c.o'
[8/63] Compiling C object 'mrsh@sha/builtin_colon.c.o'
[9/63] Compiling C object 'mrsh@sha/builtin_colon.c.o'
[9/63] Compiling C object 'mrsh@sha/builtin_command.c.o'
[10/63] Compiling C object 'mrsh@sha/builtin_cd.c.o'
[10/63] Compiling C object 'mrsh@sha/builtin_dot.c.o'
[11/63] Compiling C object 'mrsh@sha/builtin_command.c.o'
[11/63] Compiling C object 'mrsh@sha/builtin_eval.c.o'
[12/63] Compiling C object 'mrsh@sha/ast.c.o'
[12/63] Compiling C object 'mrsh@sha/builtin_exec.c.o'
[13/63] Compiling C object 'mrsh@sha/builtin_dot.c.o'
[13/63] Compiling C object 'mrsh@sha/builtin_exit.c.o'
[14/63] Compiling C object 'mrsh@sha/builtin_exec.c.o'
[14/63] Compiling C object 'mrsh@sha/builtin_export.c.o'
[15/63] Compiling C object 'mrsh@sha/builtin_eval.c.o'
[15/63] Compiling C object 'mrsh@sha/builtin_false.c.o'
[16/63] Compiling C object 'mrsh@sha/builtin_exit.c.o'
[16/63] Compiling C object 'mrsh@sha/builtin_fg.c.o'
[17/63] Compiling C object 'mrsh@sha/builtin_false.c.o'
[17/63] Compiling C object 'mrsh@sha/builtin_getopts.c.o'
[18/63] Compiling C object 'mrsh@sha/builtin_fg.c.o'
[18/63] Compiling C object 'mrsh@sha/builtin_hash.c.o'
[19/63] Compiling C object 'mrsh@sha/builtin_export.c.o'
[19/63] Compiling C object 'mrsh@sha/builtin_jobs.c.o'
[20/63] Compiling C object 'mrsh@sha/builtin_hash.c.o'
[20/63] Compiling C object 'mrsh@sha/builtin_pwd.c.o'
[21/63] Compiling C object 'mrsh@sha/builtin_getopts.c.o'
[21/63] Compiling C object 'mrsh@sha/builtin_read.c.o'
[22/63] Compiling C object 'mrsh@sha/builtin_pwd.c.o'
[22/63] Compiling C object 'mrsh@sha/builtin_return.c.o'
[23/63] Compiling C object 'mrsh@sha/builtin_jobs.c.o'
[23/63] Compiling C object 'mrsh@sha/builtin_set.c.o'
[24/63] Compiling C object 'mrsh@sha/builtin_return.c.o'
[24/63] Compiling C object 'mrsh@sha/builtin_shift.c.o'
[25/63] Compiling C object 'mrsh@sha/builtin_read.c.o'
[25/63] Compiling C object 'mrsh@sha/builtin_times.c.o'
[26/63] Compiling C object 'mrsh@sha/builtin_times.c.o'
[26/63] Compiling C object 'mrsh@sha/builtin_trap.c.o'
[27/63] Compiling C object 'mrsh@sha/builtin_shift.c.o'
[27/63] Compiling C object 'mrsh@sha/builtin_true.c.o'
[28/63] Compiling C object 'mrsh@sha/builtin_true.c.o'
[28/63] Compiling C object 'mrsh@sha/builtin_type.c.o'
[29/63] Compiling C object 'mrsh@sha/builtin_set.c.o'
[29/63] Compiling C object 'mrsh@sha/builtin_ulimit.c.o'
[30/63] Compiling C object 'mrsh@sha/builtin_trap.c.o'
[30/63] Compiling C object 'mrsh@sha/builtin_umask.c.o'
[31/63] Compiling C object 'mrsh@sha/builtin_type.c.o'
[31/63] Compiling C object 'mrsh@sha/builtin_unalias.c.o'
[32/63] Compiling C object 'mrsh@sha/builtin_ulimit.c.o'
[32/63] Compiling C object 'mrsh@sha/builtin_unset.c.o'
[33/63] Compiling C object 'mrsh@sha/builtin_unset.c.o'
[33/63] Compiling C object 'mrsh@sha/builtin_unspecified.c.o'
[34/63] Compiling C object 'mrsh@sha/builtin_unalias.c.o'
[34/63] Compiling C object 'mrsh@sha/builtin_wait.c.o'
[35/63] Compiling C object 'mrsh@sha/builtin_unspecified.c.o'
[35/63] Compiling C object 'mrsh@sha/getopt.c.o'
[36/63] Compiling C object 'mrsh@sha/builtin_umask.c.o'
[36/63] Compiling C object 'mrsh@sha/hashtable.c.o'
[37/63] Compiling C object 'mrsh@sha/getopt.c.o'
[37/63] Compiling C object 'mrsh@sha/parser_arithm.c.o'
[38/63] Compiling C object 'mrsh@sha/hashtable.c.o'
[38/63] Compiling C object 'mrsh@sha/parser_parser.c.o'
[39/63] Compiling C object 'mrsh@sha/builtin_wait.c.o'
[39/63] Compiling C object 'mrsh@sha/parser_program.c.o'
[40/63] Compiling C object 'mrsh@sha/parser_arithm.c.o'
[40/63] Compiling C object 'mrsh@sha/parser_word.c.o'
[41/63] Compiling C object 'mrsh@sha/parser_parser.c.o'
[41/63] Compiling C object 'mrsh@sha/shell_arithm.c.o'
[42/63] Compiling C object 'mrsh@sha/shell_arithm.c.o'
[42/63] Compiling C object 'mrsh@sha/shell_entry.c.o'
[43/63] Compiling C object 'mrsh@sha/shell_entry.c.o'
[43/63] Compiling C object 'mrsh@sha/shell_job.c.o'
[44/63] Compiling C object 'mrsh@sha/parser_word.c.o'
[44/63] Compiling C object 'mrsh@sha/shell_path.c.o'
[45/63] Compiling C object 'mrsh@sha/parser_program.c.o'
[45/63] Compiling C object 'mrsh@sha/shell_process.c.o'
[46/63] Compiling C object 'mrsh@sha/shell_job.c.o'
[46/63] Compiling C object 'mrsh@sha/shell_redir.c.o'
[47/63] Compiling C object 'mrsh@sha/shell_path.c.o'
[47/63] Compiling C object 'mrsh@sha/shell_shell.c.o'
[48/63] Compiling C object 'mrsh@sha/shell_process.c.o'
[48/63] Compiling C object 'mrsh@sha/shell_task_pipeline.c.o'
[49/63] Compiling C object 'mrsh@sha/shell_redir.c.o'
[49/63] Compiling C object 'mrsh@sha/shell_task_simple_command.c.o'
[50/63] Compiling C object 'mrsh@sha/shell_shell.c.o'
[50/63] Compiling C object 'mrsh@sha/shell_task_task.c.o'
[51/63] Compiling C object 'mrsh@sha/shell_task_pipeline.c.o'
[51/63] Compiling C object 'mrsh@sha/shell_task_word.c.o'
[52/63] Compiling C object 'mrsh@sha/shell_task_simple_command.c.o'
[52/63] Compiling C object 'mrsh@sha/shell_trap.c.o'
[53/63] Compiling C object 'mrsh@sha/shell_task_task.c.o'
[53/63] Compiling C object 'mrsh@sha/shell_word.c.o'
[54/63] Compiling C object 'mrsh@sha/shell_trap.c.o'
[54/63] Compiling C object 'example/50d858e@@highlight@exe/highlight.c.o'
[55/63] Compiling C object 'mrsh@sha/shell_task_word.c.o'
[55/63] Compiling C object 'mrsh@exe/main.c.o'
[56/63] Compiling C object 'mrsh@sha/shell_word.c.o'
[56/63] Linking target libmrsh.so.0.0.0
[57/63] Compiling C object 'mrsh@exe/main.c.o'
[57/63] Compiling C object 'mrsh@exe/frontend_readline.c.o'
[58/63] Compiling C object 'example/50d858e@@highlight@exe/highlight.c.o'
[59/63] Linking target libmrsh.so.0.0.0
[59/63] Generating symbol file 'mrsh@sha/libmrsh.so.0.0.0.symbols'
[60/63] Compiling C object 'mrsh@exe/frontend_readline.c.o'
[61/63] Generating symbol file 'mrsh@sha/libmrsh.so.0.0.0.symbols'
[61/63] Linking target example/highlight
[61/63] Linking target mrsh
[62/63] Linking target mrsh
[63/63] Linking target example/highlight
test
1
2
3
4
5
6
7
8
9
10
11
12
13
14
15
16
17
18
19
20
21
22
23
24
25
26
27
28
29
30
31
32
33
34
35
36
+ cd mrsh
+ ninja -C build test
ninja: Entering directory `build'

[0/1] Running all tests.
 1/22 args.sh                                                       OK             0.13s
 2/22 arithm.sh                                                     OK             0.13s
 3/22 async.sh                                                      OK             0.13s
 4/22 case.sh                                                       OK             0.08s
 5/22 command.sh                                                    OK             0.08s
 6/22 for.sh                                                        OK             0.22s
 7/22 function.sh                                                   OK             0.07s
 8/22 loop.sh                                                       OK             0.07s
 9/22 pipeline.sh                                                   OK             0.27s
10/22 read.sh                                                       OK             0.17s
11/22 readonly.sh                                                   OK             0.12s
12/22 redir.sh                                                      OK             0.07s
13/22 return.sh                                                     OK             0.08s
14/22 subshell.sh                                                   OK             0.13s
15/22 syntax.sh                                                     OK             0.07s
16/22 ulimit.sh                                                     OK             0.22s
17/22 word.sh                                                       OK             0.37s
18/22 conformance/2.2-quoted-characters.sh                          OK             0.17s
19/22 conformance/2.2.2-nested-single-quotes.fail.sh                EXPECTEDFAIL   0.12s
20/22 conformance/2.2.3-backquote-nonterminated-squote.undefined.sh EXPECTEDFAIL   0.08s
21/22 conformance/2.2.3-backquote-nonterminated-dquote.undefined.sh EXPECTEDFAIL   0.07s
22/22 conformance/2.2.3-dquote-nonterminated-backquote.undefined.sh EXPECTEDFAIL   0.08s

Ok:                 18  
Expected Fail:      4   
Fail:               0   
Unexpected Pass:    0   
Skipped:            0   
Timeout:            0   

Full log written to /home/build/mrsh/build/meson-logs/testlog.txt
build-release
1
2
3
4
5
6
7
8
9
10
11
12
13
14
15
16
17
18
19
20
21
22
23
24
25
26
27
28
29
30
31
32
33
34
35
36
37
38
39
40
41
42
43
44
45
46
47
48
49
50
51
52
53
54
55
56
57
58
59
60
61
62
63
64
65
66
67
68
69
70
71
72
73
74
75
76
77
78
79
80
81
82
83
84
85
86
87
88
89
90
91
92
93
94
95
96
97
98
99
100
101
102
103
104
105
106
107
+ cd mrsh
+ meson configure build --buildtype release
+ ninja -C build
ninja: Entering directory `build'

[0/1] Regenerating build files.
The Meson build system
Version: 0.54.3
Source dir: /home/build/mrsh
Build dir: /home/build/mrsh/build
Build type: native build
Project name: mrsh
Project version: 0.0.0
C compiler for the host machine: cc (gcc 10.1.0 "cc (GCC) 10.1.0")
C linker for the host machine: cc ld.bfd 2.34.0
Host machine cpu family: x86_64
Host machine cpu: x86_64
Compiler for C supports arguments -Wundef: YES 
Compiler for C supports arguments -Wlogical-op: YES 
Compiler for C supports arguments -Wmissing-include-dirs: YES 
Compiler for C supports arguments -Wold-style-definition: YES 
Compiler for C supports arguments -Wpointer-arith: YES 
Compiler for C supports arguments -Winit-self: YES 
Compiler for C supports arguments -Wfloat-equal: YES 
Compiler for C supports arguments -Wstrict-prototypes: YES 
Compiler for C supports arguments -Wredundant-decls: YES 
Compiler for C supports arguments -Wimplicit-fallthrough=2: YES 
Compiler for C supports arguments -Wendif-labels: YES 
Compiler for C supports arguments -Wstrict-aliasing=2: YES 
Compiler for C supports arguments -Woverflow: YES 
Compiler for C supports arguments -Wformat=2: YES 
Compiler for C supports arguments -Wmissing-prototypes: YES 
Compiler for C supports arguments -Wno-missing-braces -Wmissing-braces: YES 
Compiler for C supports arguments -Wno-missing-field-initializers -Wmissing-field-initializers: YES 
Compiler for C supports arguments -Wno-unused-parameter -Wunused-parameter: YES 
Compiler for C supports arguments -Wno-unused-result -Wunused-result: YES 
Library readline found: YES
Checking for function "rl_replace_line" with dependency -lreadline: YES (cached)
Checking if "-Wl,--version-script" links: YES (cached)
Program ./harness.sh found: YES (/home/build/mrsh/test/./harness.sh)
Program sh found: YES (/usr/bin/sh)
Program ./harness.sh found: YES (/bin/sh /home/build/mrsh/test/conformance/./harness.sh)
Message: 
Features:
  readline: true
  examples: true
Build targets in project: 3

Found ninja-1.10.0 at /usr/bin/ninja

[0/63] Compiling C object 'mrsh@sha/builtin_command.c.o'
[0/63] Compiling C object 'mrsh@sha/arithm.c.o'
[0/63] Compiling C object 'mrsh@sha/array.c.o'
[1/63] Compiling C object 'mrsh@sha/array.c.o'
[1/63] Compiling C object 'mrsh@sha/ast_print.c.o'
[2/63] Compiling C object 'mrsh@sha/arithm.c.o'
[2/63] Compiling C object 'mrsh@sha/builtin_alias.c.o'
[3/63] Compiling C object 'mrsh@sha/builtin_command.c.o'
[3/63] Compiling C object 'mrsh@sha/builtin_bg.c.o'
[4/63] Compiling C object 'mrsh@sha/builtin_bg.c.o'
[4/63] Compiling C object 'mrsh@sha/builtin_break.c.o'
[5/63] Compiling C object 'mrsh@sha/builtin_alias.c.o'
[5/63] Compiling C object 'mrsh@sha/builtin_builtin.c.o'
[6/63] Compiling C object 'mrsh@sha/builtin_break.c.o'
[6/63] Compiling C object 'mrsh@sha/builtin_cd.c.o'
[7/63] Compiling C object 'mrsh@sha/builtin_builtin.c.o'
[7/63] Compiling C object 'mrsh@sha/builtin_colon.c.o'
[8/63] Compiling C object 'mrsh@sha/builtin_colon.c.o'
[8/63] Compiling C object 'mrsh@sha/ast.c.o'
[9/63] Compiling C object 'mrsh@sha/builtin_cd.c.o'
[9/63] Compiling C object 'mrsh@sha/buffer.c.o'
[10/63] Compiling C object 'mrsh@sha/buffer.c.o'
[10/63] Compiling C object 'mrsh@sha/builtin_dot.c.o'
[11/63] Compiling C object 'mrsh@sha/builtin_dot.c.o'
[11/63] Compiling C object 'mrsh@sha/builtin_eval.c.o'
[12/63] Compiling C object 'mrsh@sha/ast_print.c.o'
FAILED: mrsh@sha/ast_print.c.o 
cc -Imrsh@sha -I. -I.. -I../include -fdiagnostics-color=always -fsanitize=address,undefined -fno-omit-frame-pointer -pipe -D_FILE_OFFSET_BITS=64 -Wall -Winvalid-pch -Wextra -Wpedantic -Werror -std=c99 -O3 -Wundef -Wlogical-op -Wmissing-include-dirs -Wold-style-definition -Wpointer-arith -Winit-self -Wfloat-equal -Wstrict-prototypes -Wredundant-decls -Wimplicit-fallthrough=2 -Wendif-labels -Wstrict-aliasing=2 -Woverflow -Wformat=2 -Wmissing-prototypes -Wno-missing-braces -Wno-missing-field-initializers -Wno-unused-parameter -Wno-unused-result -DHAVE_READLINE -DHAVE_READLINE_REPLACE_LINE -fPIC -MD -MQ 'mrsh@sha/ast_print.c.o' -MF 'mrsh@sha/ast_print.c.o.d' -o 'mrsh@sha/ast_print.c.o' -c ../ast_print.c
In function 'print_prefix',
    inlined from 'print_case_clause' at ../ast_print.c:376:2,
    inlined from 'print_command' at ../ast_print.c:424:3:
../ast_print.c:22:2: error: '%s' directive argument is null [-Werror=format-overflow=]
   22 |  printf("%s%s", prefix, last ? L_LAST : L_VAL);
      |  ^~~~~~~~~~~~~~~~~~~~~~~~~~~~~~~~~~~~~~~~~~~~~
In function 'print_prefix',
    inlined from 'print_loop_clause' at ../ast_print.c:328:2,
    inlined from 'print_command' at ../ast_print.c:420:3:
../ast_print.c:22:2: error: '%s' directive argument is null [-Werror=format-overflow=]
   22 |  printf("%s%s", prefix, last ? L_LAST : L_VAL);
      |  ^~~~~~~~~~~~~~~~~~~~~~~~~~~~~~~~~~~~~~~~~~~~~
In function 'print_prefix',
    inlined from 'print_if_clause' at ../ast_print.c:257:2,
    inlined from 'print_command' at ../ast_print.c:412:3:
../ast_print.c:22:2: error: '%s' directive argument is null [-Werror=format-overflow=]
   22 |  printf("%s%s", prefix, last ? L_LAST : L_VAL);
      |  ^~~~~~~~~~~~~~~~~~~~~~~~~~~~~~~~~~~~~~~~~~~~~
In function 'print_prefix',
    inlined from 'print_binop' at ../ast_print.c:467:2,
    inlined from 'print_and_or_list' at ../ast_print.c:483:3:
../ast_print.c:22:2: error: '%s' directive argument is null [-Werror=format-overflow=]
   22 |  printf("%s%s", prefix, last ? L_LAST : L_VAL);
      |  ^~~~~~~~~~~~~~~~~~~~~~~~~~~~~~~~~~~~~~~~~~~~~
cc1: all warnings being treated as errors

[13/63] Compiling C object 'mrsh@sha/builtin_eval.c.o'
[14/63] Compiling C object 'mrsh@sha/ast.c.o'
ninja: build stopped: subcommand failed.
Build complete: failed 1 year, 13 days ago (took 25 seconds)