#90520 failed

f54f89bDevan Carpenter

build scripts: use V=s make option for some verbosity

Owner
~dvn
Created
1 year, 11 days ago
Updated
1 year, 11 days ago
Build manifest
view manifest »

Tasks

view log »
prepare_docker view log »
build_docker_image view log »
build_openwrt_image view log »
go to bottom »
setup
1
2
3
4
5
6
7
8
9
10
11
12
13
14
15
16
17
18
19
20
21
22
23
24
25
26
27
28
29
30
31
32
33
34
35
36
37
38
39
40
41
42
43
44
45
46
47
48
49
50
51
52
53
54
55
56
57
58
59
60
61
62
63
64
65
66
67
68
69
[#90520] 2019/09/19 22:34:44 Booting image archlinux (default) on port 22612
[#90520] 2019/09/19 22:34:48 Waiting for guest to settle
[#90520] 2019/09/19 22:34:59 Sending tasks
[#90520] 2019/09/19 22:35:00 Sending build environment
[#90520] 2019/09/19 22:35:00 Installing packages
Warning: Permanently added '[localhost]:22612' (ECDSA) to the list of known hosts.
:: Synchronizing package databases...
downloading core.db...
downloading extra.db...
downloading community.db...
:: Starting full system upgrade...
warning: linux: ignoring package upgrade (5.2.14.arch2-1 => 5.3.arch1-1)
resolving dependencies...
looking for conflicting packages...

Packages (5) bridge-utils-1.6-3  containerd-1.2.9-1  openresolv-3.9.2-1  runc-1.0.0rc8-2  docker-1:19.03.2-1

Total Download Size:    61.22 MiB
Total Installed Size:  294.20 MiB
Net Upgrade Size:      294.15 MiB

:: Proceed with installation? [Y/n] 
:: Retrieving packages...
downloading bridge-utils-1.6-3-x86_64.pkg.tar.xz...
downloading openresolv-3.9.2-1-any.pkg.tar.xz...
downloading runc-1.0.0rc8-2-x86_64.pkg.tar.xz...
downloading containerd-1.2.9-1-x86_64.pkg.tar.xz...
downloading docker-1:19.03.2-1-x86_64.pkg.tar.xz...
checking keyring...
checking package integrity...
loading package files...
checking for file conflicts...
checking available disk space...
:: Processing package changes...
installing bridge-utils...
installing runc...
installing containerd...
installing docker...
Optional dependencies for docker
    btrfs-progs: btrfs backend support
    pigz: parallel gzip compressor support
upgrading openresolv...
:: Running post-transaction hooks...
(1/4) Creating system user accounts...
(2/4) Reloading system manager configuration...
(3/4) Reloading device manager configuration...
(4/4) Arming ConditionNeedsUpdate...
:: Searching databases for updates...
:: Searching AUR for updates...
 -> linux: ignoring package upgrade (5.2.14.arch2-1 => 5.3.arch1-1)
 there is nothing to do
[#90520] 2019/09/19 22:35:19 Cloning repositories
Cloning into 'secushareBOX'...
+ cd secushareBOX
+ git checkout -q f54f89bd54273e0a6b9d240d99c4eb35e93134f8
+ cd secushareBOX
+ git submodule update --init
[#90520] 2019/09/19 22:35:20 Running task prepare_docker
[#90520] 2019/09/19 22:35:22 Running task build_docker_image
[#90520] 2019/09/19 22:36:30 Running task build_openwrt_image
[#90520] 2019/09/20 00:07:57 Build failed.
[#90520] 2019/09/20 00:07:57 The build environment will be kept alive for 10 minutes.
[#90520] 2019/09/20 00:07:57 To log in with SSH and examine it, use the following command:
[#90520] 2019/09/20 00:07:57 
[#90520] 2019/09/20 00:07:57 	ssh -t builds@azusa.runners.sr.ht connect 90520
[#90520] 2019/09/20 00:07:57 
[#90520] 2019/09/20 00:07:57 After logging in, the deadline is increased to your remaining build time.
[#90520] 2019/09/20 00:17:57 Deadline elapsed. Terminating build environment.
[#90520] 2019/09/20 00:17:57 Error: Running task on guest: exit status 2
prepare_docker
1
2
3
4
5
+ sudo mount -t tmpfs -o size=4G /dev/null /dev/shm
+ sleep 2
+ sudo nohup dockerd --bip 172.18.0.1/16
++ whoami
+ sudo usermod -aG docker build
build_docker_image
1
2
3
4
5
6
7
8
9
10
11
12
13
14
15
16
17
18
19
20
21
22
23
24
25
26
27
28
29
30
31
32
33
34
35
36
37
38
39
40
41
42
43
44
45
46
47
48
49
50
51
52
53
54
55
56
57
58
59
60
61
62
63
64
65
66
67
68
69
70
71
72
73
74
75
76
77
78
79
80
81
82
83
84
85
86
87
88
89
90
91
92
93
94
95
96
97
98
99
100
101
102
103
104
105
106
107
108
109
110
111
112
113
114
115
116
117
118
119
120
121
122
123
124
125
126
127
128
129
130
131
132
133
134
135
136
137
138
139
140
141
142
143
144
145
146
147
148
149
150
151
152
153
154
155
156
157
158
159
160
161
162
163
164
165
166
167
168
169
170
171
172
173
174
175
176
177
178
179
180
181
182
183
184
185
186
187
188
189
190
191
192
193
194
195
196
197
198
199
200
201
202
203
204
205
206
207
208
209
210
211
212
213
214
215
216
217
218
219
220
221
222
223
224
225
226
227
228
229
230
231
232
233
234
235
236
237
238
239
240
241
242
243
244
245
246
247
248
249
250
251
252
253
254
255
256
257
258
259
260
261
262
263
264
265
266
267
268
269
270
271
272
273
274
275
276
277
278
279
280
281
282
283
284
285
286
287
288
289
290
291
292
293
294
295
296
297
298
299
300
301
302
303
304
305
306
307
308
309
310
311
312
313
314
315
316
317
318
319
320
321
322
323
324
325
326
327
328
329
330
331
332
333
334
335
336
337
338
339
340
341
342
343
344
345
346
347
348
349
350
351
352
353
354
355
356
357
358
359
360
361
362
363
364
365
366
367
368
369
370
371
372
373
374
375
376
377
378
379
380
381
382
383
384
385
386
387
388
389
390
391
392
393
394
395
396
397
398
399
400
401
402
403
404
405
406
407
408
409
410
411
412
413
414
415
416
417
418
419
420
421
422
423
424
425
426
427
428
429
430
431
432
433
434
435
436
437
438
439
440
441
442
443
444
445
446
447
448
449
450
451
452
453
454
455
456
457
458
459
460
461
462
463
464
465
466
467
468
469
470
471
472
473
474
475
476
477
478
479
480
481
482
483
484
485
486
487
488
489
490
491
492
493
494
495
496
497
498
499
500
501
502
503
504
505
506
507
508
509
510
511
512
513
514
515
516
517
518
519
520
521
522
523
524
525
526
527
528
529
530
531
532
533
534
535
536
537
538
539
540
541
542
543
544
545
546
547
548
549
550
551
552
553
554
555
556
557
558
559
560
561
562
563
564
565
566
567
568
569
570
571
572
573
574
575
576
577
578
579
580
581
582
583
584
585
586
587
588
589
590
591
592
593
594
595
596
597
598
599
600
601
602
603
604
605
606
607
608
609
610
611
612
613
614
615
616
617
618
619
620
621
622
623
624
625
626
627
628
629
630
631
632
633
634
635
636
637
638
639
640
641
642
643
644
645
646
647
648
649
650
651
652
653
654
655
656
657
658
659
660
661
662
663
664
665
666
667
668
669
670
671
672
673
674
675
676
677
678
679
680
681
682
683
684
685
686
687
688
689
690
691
692
693
694
695
696
697
698
699
700
701
702
703
704
705
706
707
708
709
710
711
712
713
714
715
716
717
718
719
720
721
722
723
724
725
726
727
728
729
730
731
732
733
734
735
736
737
738
739
740
741
742
743
744
745
746
747
748
749
750
751
752
753
754
755
756
757
758
759
760
761
762
763
764
765
766
767
768
769
770
771
772
773
774
775
776
777
778
779
780
781
782
783
784
785
786
787
788
789
790
791
792
793
794
795
796
797
798
799
800
801
802
803
804
805
806
807
808
809
810
811
812
813
814
815
816
817
818
819
820
821
822
823
824
825
826
827
828
829
830
831
832
833
834
835
836
837
838
839
840
841
842
843
844
845
846
847
848
849
850
851
852
853
854
855
856
857
858
859
860
861
862
863
864
865
866
867
868
869
870
871
872
873
874
875
876
877
878
879
880
881
882
883
884
885
886
887
888
889
890
891
892
893
894
895
896
897
898
899
900
901
902
903
904
905
906
907
908
909
910
911
912
913
914
915
916
917
918
919
920
921
922
923
924
925
926
927
928
929
930
931
932
933
934
935
936
937
938
939
940
941
942
943
944
945
946
947
948
949
950
951
952
953
954
955
956
957
958
959
960
961
962
963
964
965
966
967
968
969
970
971
972
973
974
975
976
977
978
979
980
981
982
983
984
985
986
987
988
989
990
991
992
993
994
995
996
997
998
999
1000
1001
1002
1003
1004
1005
1006
1007
1008
1009
1010
1011
1012
1013
1014
1015
1016
1017
1018
1019
1020
1021
1022
1023
1024
1025
1026
1027
1028
1029
1030
1031
1032
1033
1034
1035
1036
1037
1038
1039
1040
1041
1042
1043
1044
1045
1046
1047
1048
1049
1050
1051
1052
1053
1054
1055
1056
1057
1058
1059
1060
1061
1062
1063
1064
1065
1066
1067
1068
1069
1070
1071
1072
1073
1074
1075
1076
1077
1078
1079
1080
1081
1082
1083
1084
1085
1086
1087
1088
1089
1090
1091
1092
1093
1094
1095
1096
1097
1098
1099
1100
1101
1102
1103
1104
1105
1106
1107
1108
1109
1110
1111
1112
1113
1114
1115
1116
1117
1118
1119
1120
1121
1122
1123
1124
1125
1126
1127
1128
1129
1130
1131
1132
1133
1134
1135
1136
1137
1138
1139
1140
1141
1142
1143
1144
1145
1146
1147
1148
1149
1150
1151
1152
1153
1154
1155
1156
1157
1158
1159
1160
1161
1162
1163
1164
1165
1166
1167
1168
1169
1170
1171
1172
1173
1174
1175
1176
1177
1178
1179
1180
1181
1182
1183
1184
1185
1186
1187
1188
1189
1190
1191
1192
1193
1194
1195
1196
1197
1198
1199
1200
1201
1202
1203
1204
1205
1206
1207
1208
1209
1210
1211
1212
1213
1214
1215
1216
1217
1218
1219
1220
1221
1222
1223
1224
1225
1226
1227
1228
1229
1230
1231
1232
1233
1234
1235
1236
1237
1238
1239
1240
1241
1242
1243
1244
1245
1246
1247
1248
1249
1250
1251
1252
1253
1254
1255
1256
1257
1258
1259
1260
1261
1262
1263
1264
1265
1266
1267
1268
1269
1270
1271
1272
1273
1274
1275
1276
1277
1278
1279
1280
1281
1282
1283
1284
1285
1286
1287
1288
1289
1290
1291
1292
1293
1294
1295
1296
1297
1298
1299
1300
1301
1302
1303
1304
1305
1306
1307
1308
1309
1310
1311
1312
1313
1314
1315
1316
1317
1318
1319
1320
1321
1322
1323
1324
1325
1326
1327
1328
1329
1330
1331
1332
1333
1334
1335
1336
1337
1338
1339
1340
1341
1342
1343
1344
1345
1346
1347
1348
1349
1350
1351
1352
1353
1354
1355
1356
1357
1358
1359
1360
1361
1362
1363
1364
1365
1366
1367
1368
1369
1370
1371
1372
1373
1374
1375
1376
1377
1378
1379
1380
1381
1382
1383
1384
1385
1386
1387
1388
1389
1390
1391
1392
1393
1394
1395
1396
1397
1398
1399
1400
1401
1402
1403
1404
1405
1406
1407
1408
1409
1410
1411
1412
1413
1414
1415
1416
1417
1418
1419
1420
1421
1422
1423
1424
1425
1426
1427
1428
1429
1430
1431
1432
1433
1434
1435
1436
1437
1438
1439
1440
1441
1442
1443
1444
1445
1446
1447
1448
1449
1450
1451
1452
1453
1454
1455
1456
1457
1458
1459
1460
1461
1462
1463
1464
1465
1466
1467
1468
1469
1470
1471
1472
1473
1474
1475
1476
1477
1478
1479
1480
1481
1482
1483
1484
1485
1486
1487
1488
1489
1490
1491
1492
1493
1494
1495
1496
1497
1498
1499
1500
1501
1502
1503
1504
1505
1506
1507
1508
1509
1510
1511
1512
1513
1514
1515
1516
1517
1518
1519
1520
1521
1522
1523
1524
1525
1526
1527
1528
1529
1530
1531
1532
1533
1534
1535
1536
1537
1538
1539
1540
1541
1542
1543
1544
1545
1546
1547
1548
1549
1550
1551
1552
1553
1554
1555
1556
1557
1558
1559
1560
1561
1562
1563
1564
1565
1566
1567
1568
1569
1570
1571
1572
1573
1574
1575
1576
1577
1578
1579
1580
1581
1582
1583
1584
1585
1586
1587
1588
1589
1590
1591
1592
1593
1594
1595
1596
1597
1598
1599
1600
1601
1602
1603
1604
1605
1606
1607
1608
1609
1610
1611
1612
1613
1614
1615
1616
1617
1618
1619
1620
1621
1622
1623
1624
1625
1626
1627
1628
1629
1630
1631
1632
1633
1634
1635
1636
1637
1638
1639
1640
1641
1642
1643
1644
1645
1646
1647
1648
1649
1650
1651
1652
1653
1654
1655
1656
1657
1658
1659
1660
1661
1662
1663
1664
1665
1666
1667
1668
1669
1670
1671
1672
1673
1674
1675
1676
1677
1678
1679
1680
1681
1682
1683
1684
1685
1686
1687
1688
1689
1690
1691
1692
1693
1694
1695
1696
1697
1698
1699
1700
1701
1702
1703
1704
1705
1706
1707
1708
1709
1710
1711
1712
1713
1714
1715
1716
1717
1718
1719
1720
1721
1722
1723
1724
1725
1726
1727
1728
1729
1730
1731
1732
1733
1734
1735
1736
1737
1738
1739
1740
1741
1742
1743
1744
1745
1746
1747
1748
1749
1750
1751
1752
1753
1754
1755
1756
1757
1758
1759
1760
1761
1762
1763
1764
1765
1766
1767
1768
1769
1770
1771
1772
1773
1774
1775
1776
1777
1778
1779
1780
1781
1782
1783
1784
1785
1786
1787
1788
1789
1790
1791
1792
1793
1794
1795
1796
1797
1798
1799
1800
1801
1802
1803
1804
1805
1806
1807
1808
1809
1810
1811
1812
1813
1814
1815
1816
1817
1818
1819
1820
1821
1822
1823
1824
1825
1826
1827
1828
1829
1830
1831
1832
1833
1834
1835
1836
1837
1838
1839
1840
1841
1842
1843
1844
1845
1846
1847
1848
1849
1850
1851
1852
1853
1854
1855
1856
1857
1858
1859
1860
1861
1862
1863
1864
1865
1866
1867
1868
1869
1870
1871
1872
1873
1874
1875
1876
1877
1878
1879
1880
1881
1882
1883
1884
1885
1886
1887
1888
1889
1890
1891
1892
1893
1894
1895
1896
1897
1898
1899
1900
1901
1902
1903
1904
1905
1906
1907
1908
1909
1910
1911
1912
1913
1914
1915
1916
1917
1918
1919
1920
1921
1922
1923
1924
1925
1926
1927
1928
1929
1930
1931
1932
1933
1934
1935
1936
1937
1938
1939
1940
1941
1942
1943
1944
1945
1946
1947
1948
1949
1950
1951
1952
1953
1954
1955
1956
1957
1958
1959
1960
1961
1962
1963
1964
1965
1966
1967
1968
1969
1970
1971
1972
1973
1974
1975
1976
1977
1978
1979
1980
1981
1982
1983
1984
1985
1986
1987
1988
1989
1990
1991
1992
1993
1994
1995
1996
1997
1998
1999
2000
2001
2002
2003
2004
2005
2006
2007
2008
2009
2010
2011
2012
2013
2014
2015
2016
2017
2018
2019
2020
2021
2022
2023
2024
2025
2026
2027
2028
2029
2030
2031
2032
2033
2034
2035
2036
2037
2038
2039
2040
2041
2042
2043
2044
2045
2046
2047
2048
2049
2050
2051
2052
2053
2054
2055
2056
2057
2058
2059
2060
2061
2062
2063
2064
2065
2066
2067
2068
2069
2070
2071
2072
2073
2074
2075
2076
2077
2078
2079
2080
2081
2082
2083
2084
2085
2086
2087
2088
2089
2090
2091
2092
2093
2094
2095
2096
2097
2098
2099
2100
2101
2102
2103
2104
2105
2106
2107
2108
2109
2110
2111
2112
2113
2114
2115
2116
2117
2118
2119
2120
2121
2122
2123
2124
2125
2126
2127
2128
4a56a430b2ba: Pull complete 
Digest: sha256:e25b64a9cf82c72080074d6b1bba7329cdd752d51574971fd37731ed164f3345
Status: Downloaded newer image for debian:buster
 ---> c2c03a296d23
Step 2/5 : RUN apt-get update &&    apt-get install -y sudo time git-core subversion build-essential g++     bash make libssl-dev patch libncurses5 libncurses5-dev zlib1g-dev gawk     flex gettext wget unzip xz-utils python python-distutils-extra python3     python3-distutils-extra &&     apt-get clean &&     useradd -m user &&     echo 'user ALL=NOPASSWD: ALL' > /etc/sudoers.d/user
 ---> Running in 0e3ad8d1e3d1
Get:1 http://cdn-fastly.deb.debian.org/debian buster InRelease [122 kB]
Get:2 http://cdn-fastly.deb.debian.org/debian buster-updates InRelease [49.3 kB]
Get:3 http://security-cdn.debian.org/debian-security buster/updates InRelease [39.1 kB]
Get:4 http://cdn-fastly.deb.debian.org/debian buster/main amd64 Packages [7899 kB]
Get:5 http://security-cdn.debian.org/debian-security buster/updates/main amd64 Packages [91.3 kB]
Get:6 http://cdn-fastly.deb.debian.org/debian buster-updates/main amd64 Packages [3352 B]
Fetched 8203 kB in 2s (3549 kB/s)
Reading package lists...
Reading package lists...
Building dependency tree...
Reading state information...
bash is already the newest version (5.0-4).
bash set to manually installed.
The following additional packages will be installed:
  autoconf automake autotools-dev binutils binutils-common
  binutils-x86-64-linux-gnu bzip2 ca-certificates cpp cpp-8 dirmngr dpkg-dev
  fakeroot file g++-8 gcc gcc-8 gettext-base git-man gnupg gnupg-l10n
  gnupg-utils gpg gpg-agent gpg-wks-client gpg-wks-server gpgconf gpgsm
  intltool krb5-locales less libalgorithm-diff-perl libalgorithm-diff-xs-perl
  libalgorithm-merge-perl libapr1 libaprutil1 libasan5 libassuan0 libatomic1
  libauthen-sasl-perl libbinutils libbsd0 libc-dev-bin libc6-dev libcc1-0
  libcroco3 libcurl3-gnutls libdata-dump-perl libdpkg-perl libedit2
  libencode-locale-perl liberror-perl libexpat1 libfakeroot
  libfile-fcntllock-perl libfile-listing-perl libfl-dev libfl2
  libfont-afm-perl libgcc-8-dev libgdbm-compat4 libgdbm6 libglib2.0-0
  libglib2.0-data libgomp1 libgpm2 libgssapi-krb5-2 libhtml-form-perl
  libhtml-format-perl libhtml-parser-perl libhtml-tagset-perl
  libhtml-tree-perl libhttp-cookies-perl libhttp-daemon-perl libhttp-date-perl
  libhttp-message-perl libhttp-negotiate-perl libicu63 libio-html-perl
  libio-socket-ssl-perl libisl19 libitm1 libk5crypto3 libkeyutils1 libkrb5-3
  libkrb5support0 libksba8 libldap-2.4-2 libldap-common liblocale-gettext-perl
  liblsan0 liblwp-mediatypes-perl liblwp-protocol-https-perl libmagic-mgc
  libmagic1 libmailtools-perl libmpc3 libmpdec2 libmpfr6 libmpx2
  libncurses-dev libncurses6 libnet-http-perl libnet-smtp-ssl-perl
  libnet-ssleay-perl libnghttp2-14 libnpth0 libpcre2-8-0 libperl5.28 libpsl5
  libpython-stdlib libpython2-stdlib libpython2.7-minimal libpython2.7-stdlib
  libpython3-stdlib libpython3.7-minimal libpython3.7-stdlib libquadmath0
  libreadline7 librtmp1 libsasl2-2 libsasl2-modules libsasl2-modules-db
  libserf-1-1 libsigsegv2 libsqlite3-0 libssh2-1 libssl1.1 libstdc++-8-dev
  libsvn1 libtimedate-perl libtinfo5 libtry-tiny-perl libtsan0 libubsan1
  liburi-perl libutf8proc2 libwww-perl libwww-robotrules-perl libx11-6
  libx11-data libxau6 libxcb1 libxdmcp6 libxext6 libxml-parser-perl libxml2
  libxmuu1 linux-libc-dev lsb-base m4 manpages manpages-dev mime-support
  netbase openssh-client openssl perl perl-modules-5.28 perl-openssl-defaults
  pinentry-curses publicsuffix python-minimal python-pkg-resources python2
  python2-minimal python2.7 python2.7-minimal python3-distutils
  python3-lib2to3 python3-minimal python3-pkg-resources python3.7
  python3.7-minimal readline-common shared-mime-info xauth xdg-user-dirs
Suggested packages:
  autoconf-archive gnu-standards autoconf-doc libtool binutils-doc bzip2-doc
  cpp-doc gcc-8-locales dbus-user-session libpam-systemd pinentry-gnome3 tor
  debian-keyring bison flex-doc g++-multilib g++-8-multilib gcc-8-doc
  libstdc++6-8-dbg gawk-doc gcc-multilib gdb gcc-doc gcc-8-multilib
  libgcc1-dbg libgomp1-dbg libitm1-dbg libatomic1-dbg libasan5-dbg
  liblsan0-dbg libtsan0-dbg libubsan1-dbg libmpx2-dbg libquadmath0-dbg
  gettext-doc autopoint libasprintf-dev libgettextpo-dev git-daemon-run
  | git-daemon-sysvinit git-doc git-el git-email git-gui gitk gitweb git-cvs
  git-mediawiki git-svn parcimonie xloadimage scdaemon libdigest-hmac-perl
  libgssapi-perl glibc-doc sensible-utils bzr gdbm-l10n gpm krb5-doc krb5-user
  libcrypt-ssleay-perl ncurses-doc libsasl2-modules-gssapi-mit
  | libsasl2-modules-gssapi-heimdal libsasl2-modules-ldap libsasl2-modules-otp
  libsasl2-modules-sql libssl-doc libstdc++-8-doc libauthen-ntlm-perl m4-doc
  make-doc man-browser keychain libpam-ssh monkeysphere ssh-askpass ed
  diffutils-doc perl-doc libterm-readline-gnu-perl
  | libterm-readline-perl-perl libb-debug-perl liblocale-codes-perl
  pinentry-doc python-doc python-tk devscripts python-setuptools python2-doc
  python2.7-doc binfmt-support python3-doc python3-tk python3-venv
  python3-setuptools python3.7-venv python3.7-doc readline-doc db5.3-util
  libapache2-mod-svn subversion-tools zip
The following NEW packages will be installed:
  autoconf automake autotools-dev binutils binutils-common
  binutils-x86-64-linux-gnu build-essential bzip2 ca-certificates cpp cpp-8
  dirmngr dpkg-dev fakeroot file flex g++ g++-8 gawk gcc gcc-8 gettext
  gettext-base git git-man gnupg gnupg-l10n gnupg-utils gpg gpg-agent
  gpg-wks-client gpg-wks-server gpgconf gpgsm intltool krb5-locales less
  libalgorithm-diff-perl libalgorithm-diff-xs-perl libalgorithm-merge-perl
  libapr1 libaprutil1 libasan5 libassuan0 libatomic1 libauthen-sasl-perl
  libbinutils libbsd0 libc-dev-bin libc6-dev libcc1-0 libcroco3
  libcurl3-gnutls libdata-dump-perl libdpkg-perl libedit2
  libencode-locale-perl liberror-perl libexpat1 libfakeroot
  libfile-fcntllock-perl libfile-listing-perl libfl-dev libfl2
  libfont-afm-perl libgcc-8-dev libgdbm-compat4 libgdbm6 libglib2.0-0
  libglib2.0-data libgomp1 libgpm2 libgssapi-krb5-2 libhtml-form-perl
  libhtml-format-perl libhtml-parser-perl libhtml-tagset-perl
  libhtml-tree-perl libhttp-cookies-perl libhttp-daemon-perl libhttp-date-perl
  libhttp-message-perl libhttp-negotiate-perl libicu63 libio-html-perl
  libio-socket-ssl-perl libisl19 libitm1 libk5crypto3 libkeyutils1 libkrb5-3
  libkrb5support0 libksba8 libldap-2.4-2 libldap-common liblocale-gettext-perl
  liblsan0 liblwp-mediatypes-perl liblwp-protocol-https-perl libmagic-mgc
  libmagic1 libmailtools-perl libmpc3 libmpdec2 libmpfr6 libmpx2
  libncurses-dev libncurses5 libncurses5-dev libncurses6 libnet-http-perl
  libnet-smtp-ssl-perl libnet-ssleay-perl libnghttp2-14 libnpth0 libpcre2-8-0
  libperl5.28 libpsl5 libpython-stdlib libpython2-stdlib libpython2.7-minimal
  libpython2.7-stdlib libpython3-stdlib libpython3.7-minimal
  libpython3.7-stdlib libquadmath0 libreadline7 librtmp1 libsasl2-2
  libsasl2-modules libsasl2-modules-db libserf-1-1 libsigsegv2 libsqlite3-0
  libssh2-1 libssl-dev libssl1.1 libstdc++-8-dev libsvn1 libtimedate-perl
  libtinfo5 libtry-tiny-perl libtsan0 libubsan1 liburi-perl libutf8proc2
  libwww-perl libwww-robotrules-perl libx11-6 libx11-data libxau6 libxcb1
  libxdmcp6 libxext6 libxml-parser-perl libxml2 libxmuu1 linux-libc-dev
  lsb-base m4 make manpages manpages-dev mime-support netbase openssh-client
  openssl patch perl perl-modules-5.28 perl-openssl-defaults pinentry-curses
  publicsuffix python python-distutils-extra python-minimal
  python-pkg-resources python2 python2-minimal python2.7 python2.7-minimal
  python3 python3-distutils python3-distutils-extra python3-lib2to3
  python3-minimal python3-pkg-resources python3.7 python3.7-minimal
  readline-common shared-mime-info subversion sudo time unzip wget xauth
  xdg-user-dirs xz-utils zlib1g-dev
0 upgraded, 200 newly installed, 0 to remove and 1 not upgraded.
Need to get 117 MB of archives.
After this operation, 463 MB of additional disk space will be used.
Get:1 http://security-cdn.debian.org/debian-security buster/updates/main amd64 libnghttp2-14 amd64 1.36.0-2+deb10u1 [85.0 kB]
Get:2 http://cdn-fastly.deb.debian.org/debian buster/main amd64 perl-modules-5.28 all 5.28.1-6 [2873 kB]
Get:3 http://cdn-fastly.deb.debian.org/debian buster/main amd64 libgdbm6 amd64 1.18.1-4 [64.7 kB]
Get:4 http://cdn-fastly.deb.debian.org/debian buster/main amd64 libgdbm-compat4 amd64 1.18.1-4 [44.1 kB]
Get:5 http://cdn-fastly.deb.debian.org/debian buster/main amd64 libperl5.28 amd64 5.28.1-6 [3883 kB]
Get:6 http://cdn-fastly.deb.debian.org/debian buster/main amd64 perl amd64 5.28.1-6 [204 kB]
Get:7 http://cdn-fastly.deb.debian.org/debian buster/main amd64 libpython2.7-minimal amd64 2.7.16-2 [395 kB]
Get:8 http://cdn-fastly.deb.debian.org/debian buster/main amd64 python2.7-minimal amd64 2.7.16-2 [1367 kB]
Get:9 http://cdn-fastly.deb.debian.org/debian buster/main amd64 python2-minimal amd64 2.7.16-1 [41.4 kB]
Get:10 http://cdn-fastly.deb.debian.org/debian buster/main amd64 python-minimal amd64 2.7.16-1 [21.0 kB]
Get:11 http://cdn-fastly.deb.debian.org/debian buster/main amd64 libssl1.1 amd64 1.1.1c-1 [1535 kB]
Get:12 http://cdn-fastly.deb.debian.org/debian buster/main amd64 mime-support all 3.62 [37.2 kB]
Get:13 http://cdn-fastly.deb.debian.org/debian buster/main amd64 libexpat1 amd64 2.2.6-2 [106 kB]
Get:14 http://cdn-fastly.deb.debian.org/debian buster/main amd64 readline-common all 7.0-5 [70.6 kB]
Get:15 http://cdn-fastly.deb.debian.org/debian buster/main amd64 libreadline7 amd64 7.0-5 [151 kB]
Get:16 http://cdn-fastly.deb.debian.org/debian buster/main amd64 libsqlite3-0 amd64 3.27.2-3 [641 kB]
Get:17 http://cdn-fastly.deb.debian.org/debian buster/main amd64 libpython2.7-stdlib amd64 2.7.16-2 [1910 kB]
Get:18 http://cdn-fastly.deb.debian.org/debian buster/main amd64 python2.7 amd64 2.7.16-2 [305 kB]
Get:19 http://cdn-fastly.deb.debian.org/debian buster/main amd64 libpython2-stdlib amd64 2.7.16-1 [20.8 kB]
Get:20 http://cdn-fastly.deb.debian.org/debian buster/main amd64 libpython-stdlib amd64 2.7.16-1 [20.8 kB]
Get:21 http://cdn-fastly.deb.debian.org/debian buster/main amd64 python2 amd64 2.7.16-1 [41.6 kB]
Get:22 http://cdn-fastly.deb.debian.org/debian buster/main amd64 python amd64 2.7.16-1 [22.8 kB]
Get:23 http://cdn-fastly.deb.debian.org/debian buster/main amd64 libsigsegv2 amd64 2.12-2 [32.8 kB]
Get:24 http://cdn-fastly.deb.debian.org/debian buster/main amd64 m4 amd64 1.4.18-2 [203 kB]
Get:25 http://cdn-fastly.deb.debian.org/debian buster/main amd64 flex amd64 2.6.4-6.2 [456 kB]
Get:26 http://cdn-fastly.deb.debian.org/debian buster/main amd64 libmpfr6 amd64 4.0.2-1 [775 kB]
Get:27 http://cdn-fastly.deb.debian.org/debian buster/main amd64 gawk amd64 1:4.2.1+dfsg-1 [660 kB]
Get:28 http://cdn-fastly.deb.debian.org/debian buster/main amd64 liblocale-gettext-perl amd64 1.07-3+b4 [18.9 kB]
Get:29 http://cdn-fastly.deb.debian.org/debian buster/main amd64 libpython3.7-minimal amd64 3.7.3-2 [588 kB]
Get:30 http://cdn-fastly.deb.debian.org/debian buster/main amd64 python3.7-minimal amd64 3.7.3-2 [1736 kB]
Get:31 http://cdn-fastly.deb.debian.org/debian buster/main amd64 python3-minimal amd64 3.7.3-1 [36.6 kB]
Get:32 http://cdn-fastly.deb.debian.org/debian buster/main amd64 libmpdec2 amd64 2.4.2-2 [87.2 kB]
Get:33 http://cdn-fastly.deb.debian.org/debian buster/main amd64 libpython3.7-stdlib amd64 3.7.3-2 [1732 kB]
Get:34 http://cdn-fastly.deb.debian.org/debian buster/main amd64 python3.7 amd64 3.7.3-2 [330 kB]
Get:35 http://cdn-fastly.deb.debian.org/debian buster/main amd64 libpython3-stdlib amd64 3.7.3-1 [20.0 kB]
Get:36 http://cdn-fastly.deb.debian.org/debian buster/main amd64 python3 amd64 3.7.3-1 [61.5 kB]
Get:37 http://cdn-fastly.deb.debian.org/debian buster/main amd64 less amd64 487-0.1+b1 [129 kB]
Get:38 http://cdn-fastly.deb.debian.org/debian buster/main amd64 netbase all 5.6 [19.4 kB]
Get:39 http://cdn-fastly.deb.debian.org/debian buster/main amd64 bzip2 amd64 1.0.6-9.2~deb10u1 [48.4 kB]
Get:40 http://cdn-fastly.deb.debian.org/debian buster/main amd64 libmagic-mgc amd64 1:5.35-4 [242 kB]
Get:41 http://cdn-fastly.deb.debian.org/debian buster/main amd64 libmagic1 amd64 1:5.35-4 [117 kB]
Get:42 http://cdn-fastly.deb.debian.org/debian buster/main amd64 file amd64 1:5.35-4 [66.3 kB]
Get:43 http://cdn-fastly.deb.debian.org/debian buster/main amd64 gettext-base amd64 0.19.8.1-9 [123 kB]
Get:44 http://cdn-fastly.deb.debian.org/debian buster/main amd64 krb5-locales all 1.17-3 [95.4 kB]
Get:45 http://cdn-fastly.deb.debian.org/debian buster/main amd64 manpages all 4.16-2 [1295 kB]
Get:46 http://cdn-fastly.deb.debian.org/debian buster/main amd64 libbsd0 amd64 0.9.1-2 [99.5 kB]
Get:47 http://cdn-fastly.deb.debian.org/debian buster/main amd64 libedit2 amd64 3.1-20181209-1 [94.0 kB]
Get:48 http://cdn-fastly.deb.debian.org/debian buster/main amd64 libkeyutils1 amd64 1.6-6 [15.0 kB]
Get:49 http://cdn-fastly.deb.debian.org/debian buster/main amd64 libkrb5support0 amd64 1.17-3 [65.6 kB]
Get:50 http://cdn-fastly.deb.debian.org/debian buster/main amd64 libk5crypto3 amd64 1.17-3 [121 kB]
Get:51 http://cdn-fastly.deb.debian.org/debian buster/main amd64 libkrb5-3 amd64 1.17-3 [370 kB]
Get:52 http://cdn-fastly.deb.debian.org/debian buster/main amd64 libgssapi-krb5-2 amd64 1.17-3 [158 kB]
Get:53 http://cdn-fastly.deb.debian.org/debian buster/main amd64 openssh-client amd64 1:7.9p1-10 [782 kB]
Get:54 http://cdn-fastly.deb.debian.org/debian buster/main amd64 libpcre2-8-0 amd64 10.32-5 [213 kB]
Get:55 http://cdn-fastly.deb.debian.org/debian buster/main amd64 libpsl5 amd64 0.20.2-2 [53.7 kB]
Get:56 http://cdn-fastly.deb.debian.org/debian buster/main amd64 wget amd64 1.20.1-1.1 [902 kB]
Get:57 http://cdn-fastly.deb.debian.org/debian buster/main amd64 xz-utils amd64 5.2.4-1 [183 kB]
Get:58 http://cdn-fastly.deb.debian.org/debian buster/main amd64 autoconf all 2.69-11 [341 kB]
Get:59 http://cdn-fastly.deb.debian.org/debian buster/main amd64 autotools-dev all 20180224.1 [77.0 kB]
Get:60 http://cdn-fastly.deb.debian.org/debian buster/main amd64 automake all 1:1.16.1-4 [771 kB]
Get:61 http://cdn-fastly.deb.debian.org/debian buster/main amd64 binutils-common amd64 2.31.1-16 [2073 kB]
Get:62 http://cdn-fastly.deb.debian.org/debian buster/main amd64 libbinutils amd64 2.31.1-16 [478 kB]
Get:63 http://cdn-fastly.deb.debian.org/debian buster/main amd64 binutils-x86-64-linux-gnu amd64 2.31.1-16 [1823 kB]
Get:64 http://cdn-fastly.deb.debian.org/debian buster/main amd64 binutils amd64 2.31.1-16 [56.8 kB]
Get:65 http://cdn-fastly.deb.debian.org/debian buster/main amd64 libc-dev-bin amd64 2.28-10 [275 kB]
Get:66 http://cdn-fastly.deb.debian.org/debian buster/main amd64 linux-libc-dev amd64 4.19.67-2 [1232 kB]
Get:67 http://cdn-fastly.deb.debian.org/debian buster/main amd64 libc6-dev amd64 2.28-10 [2691 kB]
Get:68 http://cdn-fastly.deb.debian.org/debian buster/main amd64 libisl19 amd64 0.20-2 [587 kB]
Get:69 http://cdn-fastly.deb.debian.org/debian buster/main amd64 libmpc3 amd64 1.1.0-1 [41.3 kB]
Get:70 http://cdn-fastly.deb.debian.org/debian buster/main amd64 cpp-8 amd64 8.3.0-6 [8914 kB]
Get:71 http://cdn-fastly.deb.debian.org/debian buster/main amd64 cpp amd64 4:8.3.0-1 [19.4 kB]
Get:72 http://cdn-fastly.deb.debian.org/debian buster/main amd64 libcc1-0 amd64 8.3.0-6 [46.6 kB]
Get:73 http://cdn-fastly.deb.debian.org/debian buster/main amd64 libgomp1 amd64 8.3.0-6 [75.8 kB]
Get:74 http://cdn-fastly.deb.debian.org/debian buster/main amd64 libitm1 amd64 8.3.0-6 [27.7 kB]
Get:75 http://cdn-fastly.deb.debian.org/debian buster/main amd64 libatomic1 amd64 8.3.0-6 [9032 B]
Get:76 http://cdn-fastly.deb.debian.org/debian buster/main amd64 libasan5 amd64 8.3.0-6 [362 kB]
Get:77 http://cdn-fastly.deb.debian.org/debian buster/main amd64 liblsan0 amd64 8.3.0-6 [131 kB]
Get:78 http://cdn-fastly.deb.debian.org/debian buster/main amd64 libtsan0 amd64 8.3.0-6 [283 kB]
Get:79 http://cdn-fastly.deb.debian.org/debian buster/main amd64 libubsan1 amd64 8.3.0-6 [120 kB]
Get:80 http://cdn-fastly.deb.debian.org/debian buster/main amd64 libmpx2 amd64 8.3.0-6 [11.4 kB]
Get:81 http://cdn-fastly.deb.debian.org/debian buster/main amd64 libquadmath0 amd64 8.3.0-6 [133 kB]
Get:82 http://cdn-fastly.deb.debian.org/debian buster/main amd64 libgcc-8-dev amd64 8.3.0-6 [2298 kB]
Get:83 http://cdn-fastly.deb.debian.org/debian buster/main amd64 gcc-8 amd64 8.3.0-6 [9452 kB]
Get:84 http://cdn-fastly.deb.debian.org/debian buster/main amd64 gcc amd64 4:8.3.0-1 [5196 B]
Get:85 http://cdn-fastly.deb.debian.org/debian buster/main amd64 libstdc++-8-dev amd64 8.3.0-6 [1532 kB]
Get:86 http://cdn-fastly.deb.debian.org/debian buster/main amd64 g++-8 amd64 8.3.0-6 [9752 kB]
Get:87 http://cdn-fastly.deb.debian.org/debian buster/main amd64 g++ amd64 4:8.3.0-1 [1644 B]
Get:88 http://cdn-fastly.deb.debian.org/debian buster/main amd64 make amd64 4.2.1-1.2 [341 kB]
Get:89 http://cdn-fastly.deb.debian.org/debian buster/main amd64 libdpkg-perl all 1.19.7 [1414 kB]
Get:90 http://cdn-fastly.deb.debian.org/debian buster/main amd64 patch amd64 2.7.6-3+deb10u1 [126 kB]
Get:91 http://cdn-fastly.deb.debian.org/debian buster/main amd64 dpkg-dev all 1.19.7 [1773 kB]
Get:92 http://cdn-fastly.deb.debian.org/debian buster/main amd64 build-essential amd64 12.6 [7576 B]
Get:93 http://cdn-fastly.deb.debian.org/debian buster/main amd64 openssl amd64 1.1.1c-1 [842 kB]
Get:94 http://cdn-fastly.deb.debian.org/debian buster/main amd64 ca-certificates all 20190110 [157 kB]
Get:95 http://cdn-fastly.deb.debian.org/debian buster/main amd64 libassuan0 amd64 2.5.2-1 [49.4 kB]
Get:96 http://cdn-fastly.deb.debian.org/debian buster/main amd64 gpgconf amd64 2.2.12-1+deb10u1 [510 kB]
Get:97 http://cdn-fastly.deb.debian.org/debian buster/main amd64 lsb-base all 10.2019051400 [28.4 kB]
Get:98 http://cdn-fastly.deb.debian.org/debian buster/main amd64 libksba8 amd64 1.3.5-2 [99.7 kB]
Get:99 http://cdn-fastly.deb.debian.org/debian buster/main amd64 libsasl2-modules-db amd64 2.1.27+dfsg-1 [69.0 kB]
Get:100 http://cdn-fastly.deb.debian.org/debian buster/main amd64 libsasl2-2 amd64 2.1.27+dfsg-1 [106 kB]
Get:101 http://cdn-fastly.deb.debian.org/debian buster/main amd64 libldap-common all 2.4.47+dfsg-3+deb10u1 [89.6 kB]
Get:102 http://cdn-fastly.deb.debian.org/debian buster/main amd64 libldap-2.4-2 amd64 2.4.47+dfsg-3+deb10u1 [225 kB]
Get:103 http://cdn-fastly.deb.debian.org/debian buster/main amd64 libnpth0 amd64 1.6-1 [18.4 kB]
Get:104 http://cdn-fastly.deb.debian.org/debian buster/main amd64 dirmngr amd64 2.2.12-1+deb10u1 [712 kB]
Get:105 http://cdn-fastly.deb.debian.org/debian buster/main amd64 libfakeroot amd64 1.23-1 [45.9 kB]
Get:106 http://cdn-fastly.deb.debian.org/debian buster/main amd64 fakeroot amd64 1.23-1 [85.8 kB]
Get:107 http://cdn-fastly.deb.debian.org/debian buster/main amd64 libglib2.0-0 amd64 2.58.3-2+deb10u1 [1259 kB]
Get:108 http://cdn-fastly.deb.debian.org/debian buster/main amd64 libicu63 amd64 63.1-6 [8292 kB]
Get:109 http://cdn-fastly.deb.debian.org/debian buster/main amd64 libxml2 amd64 2.9.4+dfsg1-7+b3 [687 kB]
Get:110 http://cdn-fastly.deb.debian.org/debian buster/main amd64 libcroco3 amd64 0.6.12-3 [145 kB]
Get:111 http://cdn-fastly.deb.debian.org/debian buster/main amd64 libncurses6 amd64 6.1+20181013-2+deb10u1 [102 kB]
Get:112 http://cdn-fastly.deb.debian.org/debian buster/main amd64 gettext amd64 0.19.8.1-9 [1303 kB]
Get:113 http://cdn-fastly.deb.debian.org/debian buster/main amd64 librtmp1 amd64 2.4+20151223.gitfa8646d.1-2 [60.5 kB]
Get:114 http://cdn-fastly.deb.debian.org/debian buster/main amd64 libssh2-1 amd64 1.8.0-2.1 [140 kB]
Get:115 http://cdn-fastly.deb.debian.org/debian buster/main amd64 libcurl3-gnutls amd64 7.64.0-4 [329 kB]
Get:116 http://cdn-fastly.deb.debian.org/debian buster/main amd64 liberror-perl all 0.17027-2 [30.9 kB]
Get:117 http://cdn-fastly.deb.debian.org/debian buster/main amd64 git-man all 1:2.20.1-2 [1619 kB]
Get:118 http://cdn-fastly.deb.debian.org/debian buster/main amd64 git amd64 1:2.20.1-2 [5621 kB]
Get:119 http://cdn-fastly.deb.debian.org/debian buster/main amd64 gnupg-l10n all 2.2.12-1+deb10u1 [1010 kB]
Get:120 http://cdn-fastly.deb.debian.org/debian buster/main amd64 gnupg-utils amd64 2.2.12-1+deb10u1 [861 kB]
Get:121 http://cdn-fastly.deb.debian.org/debian buster/main amd64 gpg amd64 2.2.12-1+deb10u1 [865 kB]
Get:122 http://cdn-fastly.deb.debian.org/debian buster/main amd64 pinentry-curses amd64 1.1.0-2 [64.5 kB]
Get:123 http://cdn-fastly.deb.debian.org/debian buster/main amd64 gpg-agent amd64 2.2.12-1+deb10u1 [617 kB]
Get:124 http://cdn-fastly.deb.debian.org/debian buster/main amd64 gpg-wks-client amd64 2.2.12-1+deb10u1 [485 kB]
Get:125 http://cdn-fastly.deb.debian.org/debian buster/main amd64 gpg-wks-server amd64 2.2.12-1+deb10u1 [478 kB]
Get:126 http://cdn-fastly.deb.debian.org/debian buster/main amd64 gpgsm amd64 2.2.12-1+deb10u1 [604 kB]
Get:127 http://cdn-fastly.deb.debian.org/debian buster/main amd64 gnupg all 2.2.12-1+deb10u1 [715 kB]
Get:128 http://cdn-fastly.deb.debian.org/debian buster/main amd64 liburi-perl all 1.76-1 [89.9 kB]
Get:129 http://cdn-fastly.deb.debian.org/debian buster/main amd64 libencode-locale-perl all 1.05-1 [13.7 kB]
Get:130 http://cdn-fastly.deb.debian.org/debian buster/main amd64 libtimedate-perl all 2.3000-2 [42.2 kB]
Get:131 http://cdn-fastly.deb.debian.org/debian buster/main amd64 libhttp-date-perl all 6.02-1 [10.7 kB]
Get:132 http://cdn-fastly.deb.debian.org/debian buster/main amd64 libfile-listing-perl all 6.04-1 [10.3 kB]
Get:133 http://cdn-fastly.deb.debian.org/debian buster/main amd64 libhtml-tagset-perl all 3.20-3 [12.7 kB]
Get:134 http://cdn-fastly.deb.debian.org/debian buster/main amd64 libhtml-parser-perl amd64 3.72-3+b3 [105 kB]
Get:135 http://cdn-fastly.deb.debian.org/debian buster/main amd64 libhtml-tree-perl all 5.07-2 [213 kB]
Get:136 http://cdn-fastly.deb.debian.org/debian buster/main amd64 libio-html-perl all 1.001-1 [17.6 kB]
Get:137 http://cdn-fastly.deb.debian.org/debian buster/main amd64 liblwp-mediatypes-perl all 6.02-1 [22.1 kB]
Get:138 http://cdn-fastly.deb.debian.org/debian buster/main amd64 libhttp-message-perl all 6.18-1 [77.8 kB]
Get:139 http://cdn-fastly.deb.debian.org/debian buster/main amd64 libhttp-cookies-perl all 6.04-1 [17.8 kB]
Get:140 http://cdn-fastly.deb.debian.org/debian buster/main amd64 libhttp-negotiate-perl all 6.01-1 [12.8 kB]
Get:141 http://cdn-fastly.deb.debian.org/debian buster/main amd64 perl-openssl-defaults amd64 3 [6782 B]
Get:142 http://cdn-fastly.deb.debian.org/debian buster/main amd64 libnet-ssleay-perl amd64 1.85-2+b1 [308 kB]
Get:143 http://cdn-fastly.deb.debian.org/debian buster/main amd64 libio-socket-ssl-perl all 2.060-3 [207 kB]
Get:144 http://cdn-fastly.deb.debian.org/debian buster/main amd64 libnet-http-perl all 6.18-1 [24.5 kB]
Get:145 http://cdn-fastly.deb.debian.org/debian buster/main amd64 liblwp-protocol-https-perl all 6.07-2 [9242 B]
Get:146 http://cdn-fastly.deb.debian.org/debian buster/main amd64 libtry-tiny-perl all 0.30-1 [23.3 kB]
Get:147 http://cdn-fastly.deb.debian.org/debian buster/main amd64 libwww-robotrules-perl all 6.02-1 [12.9 kB]
Get:148 http://cdn-fastly.deb.debian.org/debian buster/main amd64 libwww-perl all 6.36-2 [188 kB]
Get:149 http://cdn-fastly.deb.debian.org/debian buster/main amd64 libxml-parser-perl amd64 2.44-4 [213 kB]
Get:150 http://cdn-fastly.deb.debian.org/debian buster/main amd64 intltool all 0.51.0-5 [50.2 kB]
Get:151 http://cdn-fastly.deb.debian.org/debian buster/main amd64 libalgorithm-diff-perl all 1.19.03-2 [47.9 kB]
Get:152 http://cdn-fastly.deb.debian.org/debian buster/main amd64 libalgorithm-diff-xs-perl amd64 0.04-5+b1 [11.8 kB]
Get:153 http://cdn-fastly.deb.debian.org/debian buster/main amd64 libalgorithm-merge-perl all 0.08-3 [12.7 kB]
Get:154 http://cdn-fastly.deb.debian.org/debian buster/main amd64 libapr1 amd64 1.6.5-1+b1 [102 kB]
Get:155 http://cdn-fastly.deb.debian.org/debian buster/main amd64 libaprutil1 amd64 1.6.1-4 [91.8 kB]
Get:156 http://cdn-fastly.deb.debian.org/debian buster/main amd64 libauthen-sasl-perl all 2.1600-1 [50.8 kB]
Get:157 http://cdn-fastly.deb.debian.org/debian buster/main amd64 libdata-dump-perl all 1.23-1 [29.5 kB]
Get:158 http://cdn-fastly.deb.debian.org/debian buster/main amd64 libfile-fcntllock-perl amd64 0.22-3+b5 [35.4 kB]
Get:159 http://cdn-fastly.deb.debian.org/debian buster/main amd64 libfl2 amd64 2.6.4-6.2 [103 kB]
Get:160 http://cdn-fastly.deb.debian.org/debian buster/main amd64 libfl-dev amd64 2.6.4-6.2 [104 kB]
Get:161 http://cdn-fastly.deb.debian.org/debian buster/main amd64 libfont-afm-perl all 1.20-2 [13.6 kB]
Get:162 http://cdn-fastly.deb.debian.org/debian buster/main amd64 libglib2.0-data all 2.58.3-2+deb10u1 [1109 kB]
Get:163 http://cdn-fastly.deb.debian.org/debian buster/main amd64 libgpm2 amd64 1.20.7-5 [35.1 kB]
Get:164 http://cdn-fastly.deb.debian.org/debian buster/main amd64 libhtml-form-perl all 6.03-1 [23.9 kB]
Get:165 http://cdn-fastly.deb.debian.org/debian buster/main amd64 libhtml-format-perl all 2.12-1 [43.5 kB]
Get:166 http://cdn-fastly.deb.debian.org/debian buster/main amd64 libhttp-daemon-perl all 6.01-3 [16.6 kB]
Get:167 http://cdn-fastly.deb.debian.org/debian buster/main amd64 libnet-smtp-ssl-perl all 1.04-1 [6184 B]
Get:168 http://cdn-fastly.deb.debian.org/debian buster/main amd64 libmailtools-perl all 2.18-1 [88.5 kB]
Get:169 http://cdn-fastly.deb.debian.org/debian buster/main amd64 libncurses-dev amd64 6.1+20181013-2+deb10u1 [333 kB]
Get:170 http://cdn-fastly.deb.debian.org/debian buster/main amd64 libtinfo5 amd64 6.1+20181013-2+deb10u1 [320 kB]
Get:171 http://cdn-fastly.deb.debian.org/debian buster/main amd64 libncurses5 amd64 6.1+20181013-2+deb10u1 [96.0 kB]
Get:172 http://cdn-fastly.deb.debian.org/debian buster/main amd64 libncurses5-dev amd64 6.1+20181013-2+deb10u1 [948 B]
Get:173 http://cdn-fastly.deb.debian.org/debian buster/main amd64 libsasl2-modules amd64 2.1.27+dfsg-1 [104 kB]
Get:174 http://cdn-fastly.deb.debian.org/debian buster/main amd64 libserf-1-1 amd64 1.3.9-7+b10 [53.6 kB]
Get:175 http://cdn-fastly.deb.debian.org/debian buster/main amd64 libssl-dev amd64 1.1.1c-1 [1790 kB]
Get:176 http://cdn-fastly.deb.debian.org/debian buster/main amd64 libutf8proc2 amd64 2.3.0-1 [53.0 kB]
Get:177 http://cdn-fastly.deb.debian.org/debian buster/main amd64 libsvn1 amd64 1.10.4-1+deb10u1 [1402 kB]
Get:178 http://cdn-fastly.deb.debian.org/debian buster/main amd64 libxau6 amd64 1:1.0.8-1+b2 [19.9 kB]
Get:179 http://cdn-fastly.deb.debian.org/debian buster/main amd64 libxdmcp6 amd64 1:1.1.2-3 [26.3 kB]
Get:180 http://cdn-fastly.deb.debian.org/debian buster/main amd64 libxcb1 amd64 1.13.1-2 [137 kB]
Get:181 http://cdn-fastly.deb.debian.org/debian buster/main amd64 libx11-data all 2:1.6.7-1 [298 kB]
Get:182 http://cdn-fastly.deb.debian.org/debian buster/main amd64 libx11-6 amd64 2:1.6.7-1 [754 kB]
Get:183 http://cdn-fastly.deb.debian.org/debian buster/main amd64 libxext6 amd64 2:1.3.3-1+b2 [52.5 kB]
Get:184 http://cdn-fastly.deb.debian.org/debian buster/main amd64 libxmuu1 amd64 2:1.1.2-2+b3 [23.9 kB]
Get:185 http://cdn-fastly.deb.debian.org/debian buster/main amd64 manpages-dev all 4.16-2 [2232 kB]
Get:186 http://cdn-fastly.deb.debian.org/debian buster/main amd64 publicsuffix all 20190415.1030-1 [116 kB]
Get:187 http://cdn-fastly.deb.debian.org/debian buster/main amd64 python-pkg-resources all 40.8.0-1 [182 kB]
Get:188 http://cdn-fastly.deb.debian.org/debian buster/main amd64 python-distutils-extra all 2.42 [29.7 kB]
Get:189 http://cdn-fastly.deb.debian.org/debian buster/main amd64 python3-lib2to3 all 3.7.3-1 [76.7 kB]
Get:190 http://cdn-fastly.deb.debian.org/debian buster/main amd64 python3-distutils all 3.7.3-1 [142 kB]
Get:191 http://cdn-fastly.deb.debian.org/debian buster/main amd64 python3-pkg-resources all 40.8.0-1 [153 kB]
Get:192 http://cdn-fastly.deb.debian.org/debian buster/main amd64 python3-distutils-extra all 2.42 [23.8 kB]
Get:193 http://cdn-fastly.deb.debian.org/debian buster/main amd64 shared-mime-info amd64 1.10-1 [766 kB]
Get:194 http://cdn-fastly.deb.debian.org/debian buster/main amd64 subversion amd64 1.10.4-1+deb10u1 [1008 kB]
Get:195 http://cdn-fastly.deb.debian.org/debian buster/main amd64 sudo amd64 1.8.27-1 [1245 kB]
Get:196 http://cdn-fastly.deb.debian.org/debian buster/main amd64 time amd64 1.7-25.1+b1 [31.6 kB]
Get:197 http://cdn-fastly.deb.debian.org/debian buster/main amd64 unzip amd64 6.0-23+deb10u1 [172 kB]
Get:198 http://cdn-fastly.deb.debian.org/debian buster/main amd64 xauth amd64 1:1.0.10-1 [40.3 kB]
Get:199 http://cdn-fastly.deb.debian.org/debian buster/main amd64 xdg-user-dirs amd64 0.17-2 [53.8 kB]
Get:200 http://cdn-fastly.deb.debian.org/debian buster/main amd64 zlib1g-dev amd64 1:1.2.11.dfsg-1 [214 kB]
debconf: delaying package configuration, since apt-utils is not installed
Fetched 117 MB in 11s (11.0 MB/s)
Selecting previously unselected package perl-modules-5.28.

(Reading database ... 
(Reading database ... 5%
(Reading database ... 10%
(Reading database ... 15%
(Reading database ... 20%
(Reading database ... 25%
(Reading database ... 30%
(Reading database ... 35%
(Reading database ... 40%
(Reading database ... 45%
(Reading database ... 50%
(Reading database ... 55%
(Reading database ... 60%
(Reading database ... 65%
(Reading database ... 70%
(Reading database ... 75%
(Reading database ... 80%
(Reading database ... 85%
(Reading database ... 90%
(Reading database ... 95%
(Reading database ... 100%
(Reading database ... 6674 files and directories currently installed.)

Preparing to unpack .../00-perl-modules-5.28_5.28.1-6_all.deb ...

Unpacking perl-modules-5.28 (5.28.1-6) ...

Selecting previously unselected package libgdbm6:amd64.

Preparing to unpack .../01-libgdbm6_1.18.1-4_amd64.deb ...

Unpacking libgdbm6:amd64 (1.18.1-4) ...

Selecting previously unselected package libgdbm-compat4:amd64.

Preparing to unpack .../02-libgdbm-compat4_1.18.1-4_amd64.deb ...

Unpacking libgdbm-compat4:amd64 (1.18.1-4) ...

Selecting previously unselected package libperl5.28:amd64.

Preparing to unpack .../03-libperl5.28_5.28.1-6_amd64.deb ...

Unpacking libperl5.28:amd64 (5.28.1-6) ...

Selecting previously unselected package perl.

Preparing to unpack .../04-perl_5.28.1-6_amd64.deb ...

Unpacking perl (5.28.1-6) ...

Selecting previously unselected package libpython2.7-minimal:amd64.

Preparing to unpack .../05-libpython2.7-minimal_2.7.16-2_amd64.deb ...

Unpacking libpython2.7-minimal:amd64 (2.7.16-2) ...

Selecting previously unselected package python2.7-minimal.

Preparing to unpack .../06-python2.7-minimal_2.7.16-2_amd64.deb ...

Unpacking python2.7-minimal (2.7.16-2) ...

Selecting previously unselected package python2-minimal.

Preparing to unpack .../07-python2-minimal_2.7.16-1_amd64.deb ...

Unpacking python2-minimal (2.7.16-1) ...

Selecting previously unselected package python-minimal.

Preparing to unpack .../08-python-minimal_2.7.16-1_amd64.deb ...

Unpacking python-minimal (2.7.16-1) ...

Selecting previously unselected package libssl1.1:amd64.

Preparing to unpack .../09-libssl1.1_1.1.1c-1_amd64.deb ...

Unpacking libssl1.1:amd64 (1.1.1c-1) ...

Selecting previously unselected package mime-support.

Preparing to unpack .../10-mime-support_3.62_all.deb ...

Unpacking mime-support (3.62) ...

Selecting previously unselected package libexpat1:amd64.

Preparing to unpack .../11-libexpat1_2.2.6-2_amd64.deb ...

Unpacking libexpat1:amd64 (2.2.6-2) ...

Selecting previously unselected package readline-common.

Preparing to unpack .../12-readline-common_7.0-5_all.deb ...

Unpacking readline-common (7.0-5) ...

Selecting previously unselected package libreadline7:amd64.

Preparing to unpack .../13-libreadline7_7.0-5_amd64.deb ...

Unpacking libreadline7:amd64 (7.0-5) ...

Selecting previously unselected package libsqlite3-0:amd64.

Preparing to unpack .../14-libsqlite3-0_3.27.2-3_amd64.deb ...

Unpacking libsqlite3-0:amd64 (3.27.2-3) ...

Selecting previously unselected package libpython2.7-stdlib:amd64.

Preparing to unpack .../15-libpython2.7-stdlib_2.7.16-2_amd64.deb ...

Unpacking libpython2.7-stdlib:amd64 (2.7.16-2) ...

Selecting previously unselected package python2.7.

Preparing to unpack .../16-python2.7_2.7.16-2_amd64.deb ...

Unpacking python2.7 (2.7.16-2) ...

Selecting previously unselected package libpython2-stdlib:amd64.

Preparing to unpack .../17-libpython2-stdlib_2.7.16-1_amd64.deb ...

Unpacking libpython2-stdlib:amd64 (2.7.16-1) ...

Selecting previously unselected package libpython-stdlib:amd64.

Preparing to unpack .../18-libpython-stdlib_2.7.16-1_amd64.deb ...

Unpacking libpython-stdlib:amd64 (2.7.16-1) ...

Setting up libpython2.7-minimal:amd64 (2.7.16-2) ...

Setting up python2.7-minimal (2.7.16-2) ...

Linking and byte-compiling packages for runtime python2.7...

Setting up python2-minimal (2.7.16-1) ...

Selecting previously unselected package python2.

(Reading database ... 
(Reading database ... 5%
(Reading database ... 10%
(Reading database ... 15%
(Reading database ... 20%
(Reading database ... 25%
(Reading database ... 30%
(Reading database ... 35%
(Reading database ... 40%
(Reading database ... 45%
(Reading database ... 50%
(Reading database ... 55%
(Reading database ... 60%
(Reading database ... 65%
(Reading database ... 70%
(Reading database ... 75%
(Reading database ... 80%
(Reading database ... 85%
(Reading database ... 90%
(Reading database ... 95%
(Reading database ... 100%
(Reading database ... 9457 files and directories currently installed.)

Preparing to unpack .../python2_2.7.16-1_amd64.deb ...

Unpacking python2 (2.7.16-1) ...

Setting up python-minimal (2.7.16-1) ...

Selecting previously unselected package python.

(Reading database ... 
(Reading database ... 5%
(Reading database ... 10%
(Reading database ... 15%
(Reading database ... 20%
(Reading database ... 25%
(Reading database ... 30%
(Reading database ... 35%
(Reading database ... 40%
(Reading database ... 45%
(Reading database ... 50%
(Reading database ... 55%
(Reading database ... 60%
(Reading database ... 65%
(Reading database ... 70%
(Reading database ... 75%
(Reading database ... 80%
(Reading database ... 85%
(Reading database ... 90%
(Reading database ... 95%
(Reading database ... 100%
(Reading database ... 9490 files and directories currently installed.)

Preparing to unpack .../python_2.7.16-1_amd64.deb ...

Unpacking python (2.7.16-1) ...

Selecting previously unselected package libsigsegv2:amd64.

Preparing to unpack .../libsigsegv2_2.12-2_amd64.deb ...

Unpacking libsigsegv2:amd64 (2.12-2) ...

Selecting previously unselected package m4.

Preparing to unpack .../archives/m4_1.4.18-2_amd64.deb ...

Unpacking m4 (1.4.18-2) ...

Selecting previously unselected package flex.

Preparing to unpack .../flex_2.6.4-6.2_amd64.deb ...

Unpacking flex (2.6.4-6.2) ...

Selecting previously unselected package libmpfr6:amd64.

Preparing to unpack .../libmpfr6_4.0.2-1_amd64.deb ...

Unpacking libmpfr6:amd64 (4.0.2-1) ...

Setting up libmpfr6:amd64 (4.0.2-1) ...

Setting up readline-common (7.0-5) ...

Setting up libreadline7:amd64 (7.0-5) ...

Setting up libsigsegv2:amd64 (2.12-2) ...

Selecting previously unselected package gawk.

(Reading database ... 
(Reading database ... 5%
(Reading database ... 10%
(Reading database ... 15%
(Reading database ... 20%
(Reading database ... 25%
(Reading database ... 30%
(Reading database ... 35%
(Reading database ... 40%
(Reading database ... 45%
(Reading database ... 50%
(Reading database ... 55%
(Reading database ... 60%
(Reading database ... 65%
(Reading database ... 70%
(Reading database ... 75%
(Reading database ... 80%
(Reading database ... 85%
(Reading database ... 90%
(Reading database ... 95%
(Reading database ... 100%
(Reading database ... 9682 files and directories currently installed.)

Preparing to unpack .../gawk_1%3a4.2.1+dfsg-1_amd64.deb ...

Unpacking gawk (1:4.2.1+dfsg-1) ...

Selecting previously unselected package liblocale-gettext-perl.

Preparing to unpack .../liblocale-gettext-perl_1.07-3+b4_amd64.deb ...

Unpacking liblocale-gettext-perl (1.07-3+b4) ...

Selecting previously unselected package libpython3.7-minimal:amd64.

Preparing to unpack .../libpython3.7-minimal_3.7.3-2_amd64.deb ...

Unpacking libpython3.7-minimal:amd64 (3.7.3-2) ...

Selecting previously unselected package python3.7-minimal.

Preparing to unpack .../python3.7-minimal_3.7.3-2_amd64.deb ...

Unpacking python3.7-minimal (3.7.3-2) ...

Setting up libssl1.1:amd64 (1.1.1c-1) ...

debconf: unable to initialize frontend: Dialog

debconf: (TERM is not set, so the dialog frontend is not usable.)

debconf: falling back to frontend: Readline

Setting up libpython3.7-minimal:amd64 (3.7.3-2) ...

Setting up libexpat1:amd64 (2.2.6-2) ...

Setting up python3.7-minimal (3.7.3-2) ...

Selecting previously unselected package python3-minimal.

(Reading database ... 
(Reading database ... 5%
(Reading database ... 10%
(Reading database ... 15%
(Reading database ... 20%
(Reading database ... 25%
(Reading database ... 30%
(Reading database ... 35%
(Reading database ... 40%
(Reading database ... 45%
(Reading database ... 50%
(Reading database ... 55%
(Reading database ... 60%
(Reading database ... 65%
(Reading database ... 70%
(Reading database ... 75%
(Reading database ... 80%
(Reading database ... 85%
(Reading database ... 90%
(Reading database ... 95%
(Reading database ... 100%
(Reading database ... 10106 files and directories currently installed.)

Preparing to unpack .../python3-minimal_3.7.3-1_amd64.deb ...

Unpacking python3-minimal (3.7.3-1) ...

Selecting previously unselected package libmpdec2:amd64.

Preparing to unpack .../libmpdec2_2.4.2-2_amd64.deb ...

Unpacking libmpdec2:amd64 (2.4.2-2) ...

Selecting previously unselected package libpython3.7-stdlib:amd64.

Preparing to unpack .../libpython3.7-stdlib_3.7.3-2_amd64.deb ...

Unpacking libpython3.7-stdlib:amd64 (3.7.3-2) ...

Selecting previously unselected package python3.7.

Preparing to unpack .../python3.7_3.7.3-2_amd64.deb ...

Unpacking python3.7 (3.7.3-2) ...

Selecting previously unselected package libpython3-stdlib:amd64.

Preparing to unpack .../libpython3-stdlib_3.7.3-1_amd64.deb ...

Unpacking libpython3-stdlib:amd64 (3.7.3-1) ...

Setting up python3-minimal (3.7.3-1) ...

Selecting previously unselected package python3.

(Reading database ... 
(Reading database ... 5%
(Reading database ... 10%
(Reading database ... 15%
(Reading database ... 20%
(Reading database ... 25%
(Reading database ... 30%
(Reading database ... 35%
(Reading database ... 40%
(Reading database ... 45%
(Reading database ... 50%
(Reading database ... 55%
(Reading database ... 60%
(Reading database ... 65%
(Reading database ... 70%
(Reading database ... 75%
(Reading database ... 80%
(Reading database ... 85%
(Reading database ... 90%
(Reading database ... 95%
(Reading database ... 100%
(Reading database ... 10518 files and directories currently installed.)

Preparing to unpack .../000-python3_3.7.3-1_amd64.deb ...

Unpacking python3 (3.7.3-1) ...

Selecting previously unselected package less.

Preparing to unpack .../001-less_487-0.1+b1_amd64.deb ...

Unpacking less (487-0.1+b1) ...

Selecting previously unselected package netbase.

Preparing to unpack .../002-netbase_5.6_all.deb ...

Unpacking netbase (5.6) ...

Selecting previously unselected package bzip2.

Preparing to unpack .../003-bzip2_1.0.6-9.2~deb10u1_amd64.deb ...

Unpacking bzip2 (1.0.6-9.2~deb10u1) ...

Selecting previously unselected package libmagic-mgc.

Preparing to unpack .../004-libmagic-mgc_1%3a5.35-4_amd64.deb ...

Unpacking libmagic-mgc (1:5.35-4) ...

Selecting previously unselected package libmagic1:amd64.

Preparing to unpack .../005-libmagic1_1%3a5.35-4_amd64.deb ...

Unpacking libmagic1:amd64 (1:5.35-4) ...

Selecting previously unselected package file.

Preparing to unpack .../006-file_1%3a5.35-4_amd64.deb ...

Unpacking file (1:5.35-4) ...

Selecting previously unselected package gettext-base.

Preparing to unpack .../007-gettext-base_0.19.8.1-9_amd64.deb ...

Unpacking gettext-base (0.19.8.1-9) ...

Selecting previously unselected package krb5-locales.

Preparing to unpack .../008-krb5-locales_1.17-3_all.deb ...

Unpacking krb5-locales (1.17-3) ...

Selecting previously unselected package manpages.

Preparing to unpack .../009-manpages_4.16-2_all.deb ...

Unpacking manpages (4.16-2) ...

Selecting previously unselected package libbsd0:amd64.

Preparing to unpack .../010-libbsd0_0.9.1-2_amd64.deb ...

Unpacking libbsd0:amd64 (0.9.1-2) ...

Selecting previously unselected package libedit2:amd64.

Preparing to unpack .../011-libedit2_3.1-20181209-1_amd64.deb ...

Unpacking libedit2:amd64 (3.1-20181209-1) ...

Selecting previously unselected package libkeyutils1:amd64.

Preparing to unpack .../012-libkeyutils1_1.6-6_amd64.deb ...

Unpacking libkeyutils1:amd64 (1.6-6) ...

Selecting previously unselected package libkrb5support0:amd64.

Preparing to unpack .../013-libkrb5support0_1.17-3_amd64.deb ...

Unpacking libkrb5support0:amd64 (1.17-3) ...

Selecting previously unselected package libk5crypto3:amd64.

Preparing to unpack .../014-libk5crypto3_1.17-3_amd64.deb ...

Unpacking libk5crypto3:amd64 (1.17-3) ...

Selecting previously unselected package libkrb5-3:amd64.

Preparing to unpack .../015-libkrb5-3_1.17-3_amd64.deb ...

Unpacking libkrb5-3:amd64 (1.17-3) ...

Selecting previously unselected package libgssapi-krb5-2:amd64.

Preparing to unpack .../016-libgssapi-krb5-2_1.17-3_amd64.deb ...

Unpacking libgssapi-krb5-2:amd64 (1.17-3) ...

Selecting previously unselected package openssh-client.

Preparing to unpack .../017-openssh-client_1%3a7.9p1-10_amd64.deb ...

Unpacking openssh-client (1:7.9p1-10) ...

Selecting previously unselected package libpcre2-8-0:amd64.

Preparing to unpack .../018-libpcre2-8-0_10.32-5_amd64.deb ...

Unpacking libpcre2-8-0:amd64 (10.32-5) ...

Selecting previously unselected package libpsl5:amd64.

Preparing to unpack .../019-libpsl5_0.20.2-2_amd64.deb ...

Unpacking libpsl5:amd64 (0.20.2-2) ...

Selecting previously unselected package wget.

Preparing to unpack .../020-wget_1.20.1-1.1_amd64.deb ...

Unpacking wget (1.20.1-1.1) ...

Selecting previously unselected package xz-utils.

Preparing to unpack .../021-xz-utils_5.2.4-1_amd64.deb ...

Unpacking xz-utils (5.2.4-1) ...

Selecting previously unselected package autoconf.

Preparing to unpack .../022-autoconf_2.69-11_all.deb ...

Unpacking autoconf (2.69-11) ...

Selecting previously unselected package autotools-dev.

Preparing to unpack .../023-autotools-dev_20180224.1_all.deb ...

Unpacking autotools-dev (20180224.1) ...

Selecting previously unselected package automake.

Preparing to unpack .../024-automake_1%3a1.16.1-4_all.deb ...

Unpacking automake (1:1.16.1-4) ...

Selecting previously unselected package binutils-common:amd64.

Preparing to unpack .../025-binutils-common_2.31.1-16_amd64.deb ...

Unpacking binutils-common:amd64 (2.31.1-16) ...

Selecting previously unselected package libbinutils:amd64.

Preparing to unpack .../026-libbinutils_2.31.1-16_amd64.deb ...

Unpacking libbinutils:amd64 (2.31.1-16) ...

Selecting previously unselected package binutils-x86-64-linux-gnu.

Preparing to unpack .../027-binutils-x86-64-linux-gnu_2.31.1-16_amd64.deb ...

Unpacking binutils-x86-64-linux-gnu (2.31.1-16) ...

Selecting previously unselected package binutils.

Preparing to unpack .../028-binutils_2.31.1-16_amd64.deb ...

Unpacking binutils (2.31.1-16) ...

Selecting previously unselected package libc-dev-bin.

Preparing to unpack .../029-libc-dev-bin_2.28-10_amd64.deb ...

Unpacking libc-dev-bin (2.28-10) ...

Selecting previously unselected package linux-libc-dev:amd64.

Preparing to unpack .../030-linux-libc-dev_4.19.67-2_amd64.deb ...

Unpacking linux-libc-dev:amd64 (4.19.67-2) ...

Selecting previously unselected package libc6-dev:amd64.

Preparing to unpack .../031-libc6-dev_2.28-10_amd64.deb ...

Unpacking libc6-dev:amd64 (2.28-10) ...

Selecting previously unselected package libisl19:amd64.

Preparing to unpack .../032-libisl19_0.20-2_amd64.deb ...

Unpacking libisl19:amd64 (0.20-2) ...

Selecting previously unselected package libmpc3:amd64.

Preparing to unpack .../033-libmpc3_1.1.0-1_amd64.deb ...

Unpacking libmpc3:amd64 (1.1.0-1) ...

Selecting previously unselected package cpp-8.

Preparing to unpack .../034-cpp-8_8.3.0-6_amd64.deb ...

Unpacking cpp-8 (8.3.0-6) ...

Selecting previously unselected package cpp.

Preparing to unpack .../035-cpp_4%3a8.3.0-1_amd64.deb ...

Unpacking cpp (4:8.3.0-1) ...

Selecting previously unselected package libcc1-0:amd64.

Preparing to unpack .../036-libcc1-0_8.3.0-6_amd64.deb ...

Unpacking libcc1-0:amd64 (8.3.0-6) ...

Selecting previously unselected package libgomp1:amd64.

Preparing to unpack .../037-libgomp1_8.3.0-6_amd64.deb ...

Unpacking libgomp1:amd64 (8.3.0-6) ...

Selecting previously unselected package libitm1:amd64.

Preparing to unpack .../038-libitm1_8.3.0-6_amd64.deb ...

Unpacking libitm1:amd64 (8.3.0-6) ...

Selecting previously unselected package libatomic1:amd64.

Preparing to unpack .../039-libatomic1_8.3.0-6_amd64.deb ...

Unpacking libatomic1:amd64 (8.3.0-6) ...

Selecting previously unselected package libasan5:amd64.

Preparing to unpack .../040-libasan5_8.3.0-6_amd64.deb ...

Unpacking libasan5:amd64 (8.3.0-6) ...

Selecting previously unselected package liblsan0:amd64.

Preparing to unpack .../041-liblsan0_8.3.0-6_amd64.deb ...

Unpacking liblsan0:amd64 (8.3.0-6) ...

Selecting previously unselected package libtsan0:amd64.

Preparing to unpack .../042-libtsan0_8.3.0-6_amd64.deb ...

Unpacking libtsan0:amd64 (8.3.0-6) ...

Selecting previously unselected package libubsan1:amd64.

Preparing to unpack .../043-libubsan1_8.3.0-6_amd64.deb ...

Unpacking libubsan1:amd64 (8.3.0-6) ...

Selecting previously unselected package libmpx2:amd64.

Preparing to unpack .../044-libmpx2_8.3.0-6_amd64.deb ...

Unpacking libmpx2:amd64 (8.3.0-6) ...

Selecting previously unselected package libquadmath0:amd64.

Preparing to unpack .../045-libquadmath0_8.3.0-6_amd64.deb ...

Unpacking libquadmath0:amd64 (8.3.0-6) ...

Selecting previously unselected package libgcc-8-dev:amd64.

Preparing to unpack .../046-libgcc-8-dev_8.3.0-6_amd64.deb ...

Unpacking libgcc-8-dev:amd64 (8.3.0-6) ...

Selecting previously unselected package gcc-8.

Preparing to unpack .../047-gcc-8_8.3.0-6_amd64.deb ...

Unpacking gcc-8 (8.3.0-6) ...

Selecting previously unselected package gcc.

Preparing to unpack .../048-gcc_4%3a8.3.0-1_amd64.deb ...

Unpacking gcc (4:8.3.0-1) ...

Selecting previously unselected package libstdc++-8-dev:amd64.

Preparing to unpack .../049-libstdc++-8-dev_8.3.0-6_amd64.deb ...

Unpacking libstdc++-8-dev:amd64 (8.3.0-6) ...

Selecting previously unselected package g++-8.

Preparing to unpack .../050-g++-8_8.3.0-6_amd64.deb ...

Unpacking g++-8 (8.3.0-6) ...

Selecting previously unselected package g++.

Preparing to unpack .../051-g++_4%3a8.3.0-1_amd64.deb ...

Unpacking g++ (4:8.3.0-1) ...

Selecting previously unselected package make.

Preparing to unpack .../052-make_4.2.1-1.2_amd64.deb ...

Unpacking make (4.2.1-1.2) ...

Selecting previously unselected package libdpkg-perl.

Preparing to unpack .../053-libdpkg-perl_1.19.7_all.deb ...

Unpacking libdpkg-perl (1.19.7) ...

Selecting previously unselected package patch.

Preparing to unpack .../054-patch_2.7.6-3+deb10u1_amd64.deb ...

Unpacking patch (2.7.6-3+deb10u1) ...

Selecting previously unselected package dpkg-dev.

Preparing to unpack .../055-dpkg-dev_1.19.7_all.deb ...

Unpacking dpkg-dev (1.19.7) ...

Selecting previously unselected package build-essential.

Preparing to unpack .../056-build-essential_12.6_amd64.deb ...

Unpacking build-essential (12.6) ...

Selecting previously unselected package openssl.

Preparing to unpack .../057-openssl_1.1.1c-1_amd64.deb ...

Unpacking openssl (1.1.1c-1) ...

Selecting previously unselected package ca-certificates.

Preparing to unpack .../058-ca-certificates_20190110_all.deb ...

Unpacking ca-certificates (20190110) ...

Selecting previously unselected package libassuan0:amd64.

Preparing to unpack .../059-libassuan0_2.5.2-1_amd64.deb ...

Unpacking libassuan0:amd64 (2.5.2-1) ...

Selecting previously unselected package gpgconf.

Preparing to unpack .../060-gpgconf_2.2.12-1+deb10u1_amd64.deb ...

Unpacking gpgconf (2.2.12-1+deb10u1) ...

Selecting previously unselected package lsb-base.

Preparing to unpack .../061-lsb-base_10.2019051400_all.deb ...

Unpacking lsb-base (10.2019051400) ...

Selecting previously unselected package libksba8:amd64.

Preparing to unpack .../062-libksba8_1.3.5-2_amd64.deb ...

Unpacking libksba8:amd64 (1.3.5-2) ...

Selecting previously unselected package libsasl2-modules-db:amd64.

Preparing to unpack .../063-libsasl2-modules-db_2.1.27+dfsg-1_amd64.deb ...

Unpacking libsasl2-modules-db:amd64 (2.1.27+dfsg-1) ...

Selecting previously unselected package libsasl2-2:amd64.

Preparing to unpack .../064-libsasl2-2_2.1.27+dfsg-1_amd64.deb ...

Unpacking libsasl2-2:amd64 (2.1.27+dfsg-1) ...

Selecting previously unselected package libldap-common.

Preparing to unpack .../065-libldap-common_2.4.47+dfsg-3+deb10u1_all.deb ...

Unpacking libldap-common (2.4.47+dfsg-3+deb10u1) ...

Selecting previously unselected package libldap-2.4-2:amd64.

Preparing to unpack .../066-libldap-2.4-2_2.4.47+dfsg-3+deb10u1_amd64.deb ...

Unpacking libldap-2.4-2:amd64 (2.4.47+dfsg-3+deb10u1) ...

Selecting previously unselected package libnpth0:amd64.

Preparing to unpack .../067-libnpth0_1.6-1_amd64.deb ...

Unpacking libnpth0:amd64 (1.6-1) ...

Selecting previously unselected package dirmngr.

Preparing to unpack .../068-dirmngr_2.2.12-1+deb10u1_amd64.deb ...

Unpacking dirmngr (2.2.12-1+deb10u1) ...

Selecting previously unselected package libfakeroot:amd64.

Preparing to unpack .../069-libfakeroot_1.23-1_amd64.deb ...

Unpacking libfakeroot:amd64 (1.23-1) ...

Selecting previously unselected package fakeroot.

Preparing to unpack .../070-fakeroot_1.23-1_amd64.deb ...

Unpacking fakeroot (1.23-1) ...

Selecting previously unselected package libglib2.0-0:amd64.

Preparing to unpack .../071-libglib2.0-0_2.58.3-2+deb10u1_amd64.deb ...

Unpacking libglib2.0-0:amd64 (2.58.3-2+deb10u1) ...

Selecting previously unselected package libicu63:amd64.

Preparing to unpack .../072-libicu63_63.1-6_amd64.deb ...

Unpacking libicu63:amd64 (63.1-6) ...

Selecting previously unselected package libxml2:amd64.

Preparing to unpack .../073-libxml2_2.9.4+dfsg1-7+b3_amd64.deb ...

Unpacking libxml2:amd64 (2.9.4+dfsg1-7+b3) ...

Selecting previously unselected package libcroco3:amd64.

Preparing to unpack .../074-libcroco3_0.6.12-3_amd64.deb ...

Unpacking libcroco3:amd64 (0.6.12-3) ...

Selecting previously unselected package libncurses6:amd64.

Preparing to unpack .../075-libncurses6_6.1+20181013-2+deb10u1_amd64.deb ...

Unpacking libncurses6:amd64 (6.1+20181013-2+deb10u1) ...

Selecting previously unselected package gettext.

Preparing to unpack .../076-gettext_0.19.8.1-9_amd64.deb ...

Unpacking gettext (0.19.8.1-9) ...

Selecting previously unselected package libnghttp2-14:amd64.

Preparing to unpack .../077-libnghttp2-14_1.36.0-2+deb10u1_amd64.deb ...

Unpacking libnghttp2-14:amd64 (1.36.0-2+deb10u1) ...

Selecting previously unselected package librtmp1:amd64.

Preparing to unpack .../078-librtmp1_2.4+20151223.gitfa8646d.1-2_amd64.deb ...

Unpacking librtmp1:amd64 (2.4+20151223.gitfa8646d.1-2) ...

Selecting previously unselected package libssh2-1:amd64.

Preparing to unpack .../079-libssh2-1_1.8.0-2.1_amd64.deb ...

Unpacking libssh2-1:amd64 (1.8.0-2.1) ...

Selecting previously unselected package libcurl3-gnutls:amd64.

Preparing to unpack .../080-libcurl3-gnutls_7.64.0-4_amd64.deb ...

Unpacking libcurl3-gnutls:amd64 (7.64.0-4) ...

Selecting previously unselected package liberror-perl.

Preparing to unpack .../081-liberror-perl_0.17027-2_all.deb ...

Unpacking liberror-perl (0.17027-2) ...

Selecting previously unselected package git-man.

Preparing to unpack .../082-git-man_1%3a2.20.1-2_all.deb ...

Unpacking git-man (1:2.20.1-2) ...

Selecting previously unselected package git.

Preparing to unpack .../083-git_1%3a2.20.1-2_amd64.deb ...

Unpacking git (1:2.20.1-2) ...

Selecting previously unselected package gnupg-l10n.

Preparing to unpack .../084-gnupg-l10n_2.2.12-1+deb10u1_all.deb ...

Unpacking gnupg-l10n (2.2.12-1+deb10u1) ...

Selecting previously unselected package gnupg-utils.

Preparing to unpack .../085-gnupg-utils_2.2.12-1+deb10u1_amd64.deb ...

Unpacking gnupg-utils (2.2.12-1+deb10u1) ...

Selecting previously unselected package gpg.

Preparing to unpack .../086-gpg_2.2.12-1+deb10u1_amd64.deb ...

Unpacking gpg (2.2.12-1+deb10u1) ...

Selecting previously unselected package pinentry-curses.

Preparing to unpack .../087-pinentry-curses_1.1.0-2_amd64.deb ...

Unpacking pinentry-curses (1.1.0-2) ...

Selecting previously unselected package gpg-agent.

Preparing to unpack .../088-gpg-agent_2.2.12-1+deb10u1_amd64.deb ...

Unpacking gpg-agent (2.2.12-1+deb10u1) ...

Selecting previously unselected package gpg-wks-client.

Preparing to unpack .../089-gpg-wks-client_2.2.12-1+deb10u1_amd64.deb ...

Unpacking gpg-wks-client (2.2.12-1+deb10u1) ...

Selecting previously unselected package gpg-wks-server.

Preparing to unpack .../090-gpg-wks-server_2.2.12-1+deb10u1_amd64.deb ...

Unpacking gpg-wks-server (2.2.12-1+deb10u1) ...

Selecting previously unselected package gpgsm.

Preparing to unpack .../091-gpgsm_2.2.12-1+deb10u1_amd64.deb ...

Unpacking gpgsm (2.2.12-1+deb10u1) ...

Selecting previously unselected package gnupg.

Preparing to unpack .../092-gnupg_2.2.12-1+deb10u1_all.deb ...

Unpacking gnupg (2.2.12-1+deb10u1) ...

Selecting previously unselected package liburi-perl.

Preparing to unpack .../093-liburi-perl_1.76-1_all.deb ...

Unpacking liburi-perl (1.76-1) ...

Selecting previously unselected package libencode-locale-perl.

Preparing to unpack .../094-libencode-locale-perl_1.05-1_all.deb ...

Unpacking libencode-locale-perl (1.05-1) ...

Selecting previously unselected package libtimedate-perl.

Preparing to unpack .../095-libtimedate-perl_2.3000-2_all.deb ...

Unpacking libtimedate-perl (2.3000-2) ...

Selecting previously unselected package libhttp-date-perl.

Preparing to unpack .../096-libhttp-date-perl_6.02-1_all.deb ...

Unpacking libhttp-date-perl (6.02-1) ...

Selecting previously unselected package libfile-listing-perl.

Preparing to unpack .../097-libfile-listing-perl_6.04-1_all.deb ...

Unpacking libfile-listing-perl (6.04-1) ...

Selecting previously unselected package libhtml-tagset-perl.

Preparing to unpack .../098-libhtml-tagset-perl_3.20-3_all.deb ...

Unpacking libhtml-tagset-perl (3.20-3) ...

Selecting previously unselected package libhtml-parser-perl.

Preparing to unpack .../099-libhtml-parser-perl_3.72-3+b3_amd64.deb ...

Unpacking libhtml-parser-perl (3.72-3+b3) ...

Selecting previously unselected package libhtml-tree-perl.

Preparing to unpack .../100-libhtml-tree-perl_5.07-2_all.deb ...

Unpacking libhtml-tree-perl (5.07-2) ...

Selecting previously unselected package libio-html-perl.

Preparing to unpack .../101-libio-html-perl_1.001-1_all.deb ...

Unpacking libio-html-perl (1.001-1) ...

Selecting previously unselected package liblwp-mediatypes-perl.

Preparing to unpack .../102-liblwp-mediatypes-perl_6.02-1_all.deb ...

Unpacking liblwp-mediatypes-perl (6.02-1) ...

Selecting previously unselected package libhttp-message-perl.

Preparing to unpack .../103-libhttp-message-perl_6.18-1_all.deb ...

Unpacking libhttp-message-perl (6.18-1) ...

Selecting previously unselected package libhttp-cookies-perl.

Preparing to unpack .../104-libhttp-cookies-perl_6.04-1_all.deb ...

Unpacking libhttp-cookies-perl (6.04-1) ...

Selecting previously unselected package libhttp-negotiate-perl.

Preparing to unpack .../105-libhttp-negotiate-perl_6.01-1_all.deb ...

Unpacking libhttp-negotiate-perl (6.01-1) ...

Selecting previously unselected package perl-openssl-defaults:amd64.

Preparing to unpack .../106-perl-openssl-defaults_3_amd64.deb ...

Unpacking perl-openssl-defaults:amd64 (3) ...

Selecting previously unselected package libnet-ssleay-perl.

Preparing to unpack .../107-libnet-ssleay-perl_1.85-2+b1_amd64.deb ...

Unpacking libnet-ssleay-perl (1.85-2+b1) ...

Selecting previously unselected package libio-socket-ssl-perl.

Preparing to unpack .../108-libio-socket-ssl-perl_2.060-3_all.deb ...

Unpacking libio-socket-ssl-perl (2.060-3) ...

Selecting previously unselected package libnet-http-perl.

Preparing to unpack .../109-libnet-http-perl_6.18-1_all.deb ...

Unpacking libnet-http-perl (6.18-1) ...

Selecting previously unselected package liblwp-protocol-https-perl.

Preparing to unpack .../110-liblwp-protocol-https-perl_6.07-2_all.deb ...

Unpacking liblwp-protocol-https-perl (6.07-2) ...

Selecting previously unselected package libtry-tiny-perl.

Preparing to unpack .../111-libtry-tiny-perl_0.30-1_all.deb ...

Unpacking libtry-tiny-perl (0.30-1) ...

Selecting previously unselected package libwww-robotrules-perl.

Preparing to unpack .../112-libwww-robotrules-perl_6.02-1_all.deb ...

Unpacking libwww-robotrules-perl (6.02-1) ...

Selecting previously unselected package libwww-perl.

Preparing to unpack .../113-libwww-perl_6.36-2_all.deb ...

Unpacking libwww-perl (6.36-2) ...

Selecting previously unselected package libxml-parser-perl.

Preparing to unpack .../114-libxml-parser-perl_2.44-4_amd64.deb ...

Unpacking libxml-parser-perl (2.44-4) ...

Selecting previously unselected package intltool.

Preparing to unpack .../115-intltool_0.51.0-5_all.deb ...

Unpacking intltool (0.51.0-5) ...

Selecting previously unselected package libalgorithm-diff-perl.

Preparing to unpack .../116-libalgorithm-diff-perl_1.19.03-2_all.deb ...

Unpacking libalgorithm-diff-perl (1.19.03-2) ...

Selecting previously unselected package libalgorithm-diff-xs-perl.

Preparing to unpack .../117-libalgorithm-diff-xs-perl_0.04-5+b1_amd64.deb ...

Unpacking libalgorithm-diff-xs-perl (0.04-5+b1) ...

Selecting previously unselected package libalgorithm-merge-perl.

Preparing to unpack .../118-libalgorithm-merge-perl_0.08-3_all.deb ...

Unpacking libalgorithm-merge-perl (0.08-3) ...

Selecting previously unselected package libapr1:amd64.

Preparing to unpack .../119-libapr1_1.6.5-1+b1_amd64.deb ...

Unpacking libapr1:amd64 (1.6.5-1+b1) ...

Selecting previously unselected package libaprutil1:amd64.

Preparing to unpack .../120-libaprutil1_1.6.1-4_amd64.deb ...

Unpacking libaprutil1:amd64 (1.6.1-4) ...

Selecting previously unselected package libauthen-sasl-perl.

Preparing to unpack .../121-libauthen-sasl-perl_2.1600-1_all.deb ...

Unpacking libauthen-sasl-perl (2.1600-1) ...

Selecting previously unselected package libdata-dump-perl.

Preparing to unpack .../122-libdata-dump-perl_1.23-1_all.deb ...

Unpacking libdata-dump-perl (1.23-1) ...

Selecting previously unselected package libfile-fcntllock-perl.

Preparing to unpack .../123-libfile-fcntllock-perl_0.22-3+b5_amd64.deb ...

Unpacking libfile-fcntllock-perl (0.22-3+b5) ...

Selecting previously unselected package libfl2:amd64.

Preparing to unpack .../124-libfl2_2.6.4-6.2_amd64.deb ...

Unpacking libfl2:amd64 (2.6.4-6.2) ...

Selecting previously unselected package libfl-dev:amd64.

Preparing to unpack .../125-libfl-dev_2.6.4-6.2_amd64.deb ...

Unpacking libfl-dev:amd64 (2.6.4-6.2) ...

Selecting previously unselected package libfont-afm-perl.

Preparing to unpack .../126-libfont-afm-perl_1.20-2_all.deb ...

Unpacking libfont-afm-perl (1.20-2) ...

Selecting previously unselected package libglib2.0-data.

Preparing to unpack .../127-libglib2.0-data_2.58.3-2+deb10u1_all.deb ...

Unpacking libglib2.0-data (2.58.3-2+deb10u1) ...

Selecting previously unselected package libgpm2:amd64.

Preparing to unpack .../128-libgpm2_1.20.7-5_amd64.deb ...

Unpacking libgpm2:amd64 (1.20.7-5) ...

Selecting previously unselected package libhtml-form-perl.

Preparing to unpack .../129-libhtml-form-perl_6.03-1_all.deb ...

Unpacking libhtml-form-perl (6.03-1) ...

Selecting previously unselected package libhtml-format-perl.

Preparing to unpack .../130-libhtml-format-perl_2.12-1_all.deb ...

Unpacking libhtml-format-perl (2.12-1) ...

Selecting previously unselected package libhttp-daemon-perl.

Preparing to unpack .../131-libhttp-daemon-perl_6.01-3_all.deb ...

Unpacking libhttp-daemon-perl (6.01-3) ...

Selecting previously unselected package libnet-smtp-ssl-perl.

Preparing to unpack .../132-libnet-smtp-ssl-perl_1.04-1_all.deb ...

Unpacking libnet-smtp-ssl-perl (1.04-1) ...

Selecting previously unselected package libmailtools-perl.

Preparing to unpack .../133-libmailtools-perl_2.18-1_all.deb ...

Unpacking libmailtools-perl (2.18-1) ...

Selecting previously unselected package libncurses-dev:amd64.

Preparing to unpack .../134-libncurses-dev_6.1+20181013-2+deb10u1_amd64.deb ...

Unpacking libncurses-dev:amd64 (6.1+20181013-2+deb10u1) ...

Selecting previously unselected package libtinfo5:amd64.

Preparing to unpack .../135-libtinfo5_6.1+20181013-2+deb10u1_amd64.deb ...

Unpacking libtinfo5:amd64 (6.1+20181013-2+deb10u1) ...

Selecting previously unselected package libncurses5:amd64.

Preparing to unpack .../136-libncurses5_6.1+20181013-2+deb10u1_amd64.deb ...

Unpacking libncurses5:amd64 (6.1+20181013-2+deb10u1) ...

Selecting previously unselected package libncurses5-dev:amd64.

Preparing to unpack .../137-libncurses5-dev_6.1+20181013-2+deb10u1_amd64.deb ...

Unpacking libncurses5-dev:amd64 (6.1+20181013-2+deb10u1) ...

Selecting previously unselected package libsasl2-modules:amd64.

Preparing to unpack .../138-libsasl2-modules_2.1.27+dfsg-1_amd64.deb ...

Unpacking libsasl2-modules:amd64 (2.1.27+dfsg-1) ...

Selecting previously unselected package libserf-1-1:amd64.

Preparing to unpack .../139-libserf-1-1_1.3.9-7+b10_amd64.deb ...

Unpacking libserf-1-1:amd64 (1.3.9-7+b10) ...

Selecting previously unselected package libssl-dev:amd64.

Preparing to unpack .../140-libssl-dev_1.1.1c-1_amd64.deb ...

Unpacking libssl-dev:amd64 (1.1.1c-1) ...

Selecting previously unselected package libutf8proc2:amd64.

Preparing to unpack .../141-libutf8proc2_2.3.0-1_amd64.deb ...

Unpacking libutf8proc2:amd64 (2.3.0-1) ...

Selecting previously unselected package libsvn1:amd64.

Preparing to unpack .../142-libsvn1_1.10.4-1+deb10u1_amd64.deb ...

Unpacking libsvn1:amd64 (1.10.4-1+deb10u1) ...

Selecting previously unselected package libxau6:amd64.

Preparing to unpack .../143-libxau6_1%3a1.0.8-1+b2_amd64.deb ...

Unpacking libxau6:amd64 (1:1.0.8-1+b2) ...

Selecting previously unselected package libxdmcp6:amd64.

Preparing to unpack .../144-libxdmcp6_1%3a1.1.2-3_amd64.deb ...

Unpacking libxdmcp6:amd64 (1:1.1.2-3) ...

Selecting previously unselected package libxcb1:amd64.

Preparing to unpack .../145-libxcb1_1.13.1-2_amd64.deb ...

Unpacking libxcb1:amd64 (1.13.1-2) ...

Selecting previously unselected package libx11-data.

Preparing to unpack .../146-libx11-data_2%3a1.6.7-1_all.deb ...

Unpacking libx11-data (2:1.6.7-1) ...

Selecting previously unselected package libx11-6:amd64.

Preparing to unpack .../147-libx11-6_2%3a1.6.7-1_amd64.deb ...

Unpacking libx11-6:amd64 (2:1.6.7-1) ...

Selecting previously unselected package libxext6:amd64.

Preparing to unpack .../148-libxext6_2%3a1.3.3-1+b2_amd64.deb ...

Unpacking libxext6:amd64 (2:1.3.3-1+b2) ...

Selecting previously unselected package libxmuu1:amd64.

Preparing to unpack .../149-libxmuu1_2%3a1.1.2-2+b3_amd64.deb ...

Unpacking libxmuu1:amd64 (2:1.1.2-2+b3) ...

Selecting previously unselected package manpages-dev.

Preparing to unpack .../150-manpages-dev_4.16-2_all.deb ...

Unpacking manpages-dev (4.16-2) ...

Selecting previously unselected package publicsuffix.

Preparing to unpack .../151-publicsuffix_20190415.1030-1_all.deb ...

Unpacking publicsuffix (20190415.1030-1) ...

Selecting previously unselected package python-pkg-resources.

Preparing to unpack .../152-python-pkg-resources_40.8.0-1_all.deb ...

Unpacking python-pkg-resources (40.8.0-1) ...

Selecting previously unselected package python-distutils-extra.

Preparing to unpack .../153-python-distutils-extra_2.42_all.deb ...

Unpacking python-distutils-extra (2.42) ...

Selecting previously unselected package python3-lib2to3.

Preparing to unpack .../154-python3-lib2to3_3.7.3-1_all.deb ...

Unpacking python3-lib2to3 (3.7.3-1) ...

Selecting previously unselected package python3-distutils.

Preparing to unpack .../155-python3-distutils_3.7.3-1_all.deb ...

Unpacking python3-distutils (3.7.3-1) ...

Selecting previously unselected package python3-pkg-resources.

Preparing to unpack .../156-python3-pkg-resources_40.8.0-1_all.deb ...

Unpacking python3-pkg-resources (40.8.0-1) ...

Selecting previously unselected package python3-distutils-extra.

Preparing to unpack .../157-python3-distutils-extra_2.42_all.deb ...

Unpacking python3-distutils-extra (2.42) ...

Selecting previously unselected package shared-mime-info.

Preparing to unpack .../158-shared-mime-info_1.10-1_amd64.deb ...

Unpacking shared-mime-info (1.10-1) ...

Selecting previously unselected package subversion.

Preparing to unpack .../159-subversion_1.10.4-1+deb10u1_amd64.deb ...

Unpacking subversion (1.10.4-1+deb10u1) ...

Selecting previously unselected package sudo.

Preparing to unpack .../160-sudo_1.8.27-1_amd64.deb ...

Unpacking sudo (1.8.27-1) ...

Selecting previously unselected package time.

Preparing to unpack .../161-time_1.7-25.1+b1_amd64.deb ...

Unpacking time (1.7-25.1+b1) ...

Selecting previously unselected package unzip.

Preparing to unpack .../162-unzip_6.0-23+deb10u1_amd64.deb ...

Unpacking unzip (6.0-23+deb10u1) ...

Selecting previously unselected package xauth.

Preparing to unpack .../163-xauth_1%3a1.0.10-1_amd64.deb ...

Unpacking xauth (1:1.0.10-1) ...

Selecting previously unselected package xdg-user-dirs.

Preparing to unpack .../164-xdg-user-dirs_0.17-2_amd64.deb ...

Unpacking xdg-user-dirs (0.17-2) ...

Selecting previously unselected package zlib1g-dev:amd64.

Preparing to unpack .../165-zlib1g-dev_1%3a1.2.11.dfsg-1_amd64.deb ...

Unpacking zlib1g-dev:amd64 (1:1.2.11.dfsg-1) ...

Setting up perl-modules-5.28 (5.28.1-6) ...

Setting up libksba8:amd64 (1.3.5-2) ...

Setting up lsb-base (10.2019051400) ...

Setting up libxau6:amd64 (1:1.0.8-1+b2) ...

Setting up time (1.7-25.1+b1) ...

Setting up libkeyutils1:amd64 (1.6-6) ...

Setting up libpsl5:amd64 (0.20.2-2) ...

Setting up libgpm2:amd64 (1.20.7-5) ...

Setting up mime-support (3.62) ...

Setting up xdg-user-dirs (0.17-2) ...

Setting up libmagic-mgc (1:5.35-4) ...

Setting up gawk (1:4.2.1+dfsg-1) ...

Setting up libglib2.0-0:amd64 (2.58.3-2+deb10u1) ...

No schema files found: doing nothing.

Setting up manpages (4.16-2) ...

Setting up unzip (6.0-23+deb10u1) ...

Setting up libutf8proc2:amd64 (2.3.0-1) ...

Setting up libsqlite3-0:amd64 (3.27.2-3) ...

Setting up libsasl2-modules:amd64 (2.1.27+dfsg-1) ...

Setting up binutils-common:amd64 (2.31.1-16) ...

Setting up libnghttp2-14:amd64 (1.36.0-2+deb10u1) ...

Setting up libmagic1:amd64 (1:5.35-4) ...

Setting up libapr1:amd64 (1.6.5-1+b1) ...

Setting up less (487-0.1+b1) ...

debconf: unable to initialize frontend: Dialog

debconf: (TERM is not set, so the dialog frontend is not usable.)

debconf: falling back to frontend: Readline

Setting up perl-openssl-defaults:amd64 (3) ...

Setting up linux-libc-dev:amd64 (4.19.67-2) ...

Setting up gettext-base (0.19.8.1-9) ...

Setting up m4 (1.4.18-2) ...

Setting up libnpth0:amd64 (1.6-1) ...

Setting up krb5-locales (1.17-3) ...

Setting up file (1:5.35-4) ...

Setting up libassuan0:amd64 (2.5.2-1) ...

Setting up libgomp1:amd64 (8.3.0-6) ...

Setting up bzip2 (1.0.6-9.2~deb10u1) ...

Setting up libldap-common (2.4.47+dfsg-3+deb10u1) ...

Setting up libicu63:amd64 (63.1-6) ...

Setting up libfakeroot:amd64 (1.23-1) ...

Setting up libkrb5support0:amd64 (1.17-3) ...

Setting up libsasl2-modules-db:amd64 (2.1.27+dfsg-1) ...

Setting up libpython2.7-stdlib:amd64 (2.7.16-2) ...

Setting up fakeroot (1.23-1) ...

update-alternatives: using /usr/bin/fakeroot-sysv to provide /usr/bin/fakeroot (fakeroot) in auto mode

Setting up libasan5:amd64 (8.3.0-6) ...

Setting up autotools-dev (20180224.1) ...

Setting up libglib2.0-data (2.58.3-2+deb10u1) ...

Setting up libx11-data (2:1.6.7-1) ...

Setting up make (4.2.1-1.2) ...

Setting up gnupg-l10n (2.2.12-1+deb10u1) ...

Setting up librtmp1:amd64 (2.4+20151223.gitfa8646d.1-2) ...

Setting up libncurses6:amd64 (6.1+20181013-2+deb10u1) ...

Setting up xz-utils (5.2.4-1) ...

update-alternatives: using /usr/bin/xz to provide /usr/bin/lzma (lzma) in auto mode

Setting up libquadmath0:amd64 (8.3.0-6) ...

Setting up libssl-dev:amd64 (1.1.1c-1) ...

Setting up libmpc3:amd64 (1.1.0-1) ...

Setting up libatomic1:amd64 (8.3.0-6) ...

Setting up patch (2.7.6-3+deb10u1) ...

Setting up sudo (1.8.27-1) ...

invoke-rc.d: could not determine current runlevel

invoke-rc.d: policy-rc.d denied execution of start.

Setting up libfl2:amd64 (2.6.4-6.2) ...

Setting up libpcre2-8-0:amd64 (10.32-5) ...

Setting up libk5crypto3:amd64 (1.17-3) ...

Setting up libsasl2-2:amd64 (2.1.27+dfsg-1) ...

Setting up libmpx2:amd64 (8.3.0-6) ...

Setting up libubsan1:amd64 (8.3.0-6) ...

Setting up libisl19:amd64 (0.20-2) ...

Setting up gpgconf (2.2.12-1+deb10u1) ...

Setting up git-man (1:2.20.1-2) ...

Setting up libssh2-1:amd64 (1.8.0-2.1) ...

Setting up netbase (5.6) ...

Setting up libkrb5-3:amd64 (1.17-3) ...

Setting up libmpdec2:amd64 (2.4.2-2) ...

Setting up libbinutils:amd64 (2.31.1-16) ...

Setting up cpp-8 (8.3.0-6) ...

Setting up libc-dev-bin (2.28-10) ...

Setting up openssl (1.1.1c-1) ...

Setting up libbsd0:amd64 (0.9.1-2) ...

Setting up libtinfo5:amd64 (6.1+20181013-2+deb10u1) ...

Setting up publicsuffix (20190415.1030-1) ...

Setting up libxml2:amd64 (2.9.4+dfsg1-7+b3) ...

Setting up libcc1-0:amd64 (8.3.0-6) ...

Setting up liblocale-gettext-perl (1.07-3+b4) ...

Setting up gpg (2.2.12-1+deb10u1) ...

Setting up liblsan0:amd64 (8.3.0-6) ...

Setting up libitm1:amd64 (8.3.0-6) ...

Setting up libgdbm6:amd64 (1.18.1-4) ...

Setting up gnupg-utils (2.2.12-1+deb10u1) ...

Setting up binutils-x86-64-linux-gnu (2.31.1-16) ...

Setting up libaprutil1:amd64 (1.6.1-4) ...

Setting up libtsan0:amd64 (8.3.0-6) ...

Setting up pinentry-curses (1.1.0-2) ...

Setting up manpages-dev (4.16-2) ...

Setting up libxdmcp6:amd64 (1:1.1.2-3) ...

Setting up libpython3.7-stdlib:amd64 (3.7.3-2) ...

Setting up flex (2.6.4-6.2) ...

Setting up libxcb1:amd64 (1.13.1-2) ...

Setting up gpg-agent (2.2.12-1+deb10u1) ...

Setting up wget (1.20.1-1.1) ...

Setting up python2.7 (2.7.16-2) ...

Setting up libpython2-stdlib:amd64 (2.7.16-1) ...

Setting up libedit2:amd64 (3.1-20181209-1) ...

Setting up gpgsm (2.2.12-1+deb10u1) ...

Setting up libldap-2.4-2:amd64 (2.4.47+dfsg-3+deb10u1) ...

Setting up binutils (2.31.1-16) ...

Setting up libncurses5:amd64 (6.1+20181013-2+deb10u1) ...

Setting up python2 (2.7.16-1) ...

Setting up libfl-dev:amd64 (2.6.4-6.2) ...

Setting up dirmngr (2.2.12-1+deb10u1) ...

Setting up ca-certificates (20190110) ...

debconf: unable to initialize frontend: Dialog

debconf: (TERM is not set, so the dialog frontend is not usable.)

debconf: falling back to frontend: Readline

Updating certificates in /etc/ssl/certs...

128 added, 0 removed; done.

Setting up libpython-stdlib:amd64 (2.7.16-1) ...

Setting up shared-mime-info (1.10-1) ...

Setting up libgssapi-krb5-2:amd64 (1.17-3) ...

Setting up libcroco3:amd64 (0.6.12-3) ...

Setting up libgdbm-compat4:amd64 (1.18.1-4) ...

Setting up libgcc-8-dev:amd64 (8.3.0-6) ...

Setting up libperl5.28:amd64 (5.28.1-6) ...

Setting up gpg-wks-server (2.2.12-1+deb10u1) ...

Setting up cpp (4:8.3.0-1) ...

Setting up libc6-dev:amd64 (2.28-10) ...

Setting up libx11-6:amd64 (2:1.6.7-1) ...

Setting up python (2.7.16-1) ...

Setting up libxmuu1:amd64 (2:1.1.2-2+b3) ...

Setting up libpython3-stdlib:amd64 (3.7.3-1) ...

Setting up libstdc++-8-dev:amd64 (8.3.0-6) ...

Setting up python3.7 (3.7.3-2) ...

Setting up libncurses-dev:amd64 (6.1+20181013-2+deb10u1) ...

Setting up gettext (0.19.8.1-9) ...

Setting up gcc-8 (8.3.0-6) ...

Setting up gpg-wks-client (2.2.12-1+deb10u1) ...

Setting up python-pkg-resources (40.8.0-1) ...

Setting up openssh-client (1:7.9p1-10) ...

Setting up libserf-1-1:amd64 (1.3.9-7+b10) ...

Setting up libxext6:amd64 (2:1.3.3-1+b2) ...

Setting up libcurl3-gnutls:amd64 (7.64.0-4) ...

Setting up python3 (3.7.3-1) ...

running python rtupdate hooks for python3.7...

running python post-rtupdate hooks for python3.7...

Setting up gcc (4:8.3.0-1) ...

Setting up perl (5.28.1-6) ...

Setting up libdata-dump-perl (1.23-1) ...

Setting up libio-html-perl (1.001-1) ...

Setting up libdpkg-perl (1.19.7) ...

Setting up autoconf (2.69-11) ...

Setting up libtimedate-perl (2.3000-2) ...

Setting up zlib1g-dev:amd64 (1:1.2.11.dfsg-1) ...

Setting up g++-8 (8.3.0-6) ...

Setting up xauth (1:1.0.10-1) ...

Setting up libncurses5-dev:amd64 (6.1+20181013-2+deb10u1) ...

Setting up gnupg (2.2.12-1+deb10u1) ...

Setting up libsvn1:amd64 (1.10.4-1+deb10u1) ...

Setting up python3-lib2to3 (3.7.3-1) ...

Setting up liburi-perl (1.76-1) ...

Setting up libnet-ssleay-perl (1.85-2+b1) ...

Setting up python3-pkg-resources (40.8.0-1) ...

Setting up automake (1:1.16.1-4) ...

update-alternatives: using /usr/bin/automake-1.16 to provide /usr/bin/automake (automake) in auto mode

Setting up python3-distutils (3.7.3-1) ...

Setting up libhttp-date-perl (6.02-1) ...

Setting up libfile-listing-perl (6.04-1) ...

Setting up libfont-afm-perl (1.20-2) ...

Setting up libfile-fcntllock-perl (0.22-3+b5) ...

Setting up libalgorithm-diff-perl (1.19.03-2) ...

Setting up libhtml-tagset-perl (3.20-3) ...

Setting up libauthen-sasl-perl (2.1600-1) ...

Setting up liblwp-mediatypes-perl (6.02-1) ...

Setting up subversion (1.10.4-1+deb10u1) ...

Setting up libtry-tiny-perl (0.30-1) ...

Setting up libnet-http-perl (6.18-1) ...

Setting up libencode-locale-perl (1.05-1) ...

Setting up dpkg-dev (1.19.7) ...

Setting up liberror-perl (0.17027-2) ...

Setting up git (1:2.20.1-2) ...

Setting up libwww-robotrules-perl (6.02-1) ...

Setting up g++ (4:8.3.0-1) ...

update-alternatives: using /usr/bin/g++ to provide /usr/bin/c++ (c++) in auto mode

Setting up libhtml-parser-perl (3.72-3+b3) ...

Setting up build-essential (12.6) ...

Setting up libalgorithm-diff-xs-perl (0.04-5+b1) ...

Setting up libio-socket-ssl-perl (2.060-3) ...

Setting up libalgorithm-merge-perl (0.08-3) ...

Setting up libhttp-message-perl (6.18-1) ...

Setting up libhtml-form-perl (6.03-1) ...

Setting up libhttp-negotiate-perl (6.01-1) ...

Setting up libhttp-cookies-perl (6.04-1) ...

Setting up libhtml-tree-perl (5.07-2) ...

Setting up libhtml-format-perl (2.12-1) ...

Setting up libnet-smtp-ssl-perl (1.04-1) ...

Setting up libmailtools-perl (2.18-1) ...

Setting up libhttp-daemon-perl (6.01-3) ...

Setting up libwww-perl (6.36-2) ...

Setting up liblwp-protocol-https-perl (6.07-2) ...

Setting up libxml-parser-perl (2.44-4) ...

Setting up intltool (0.51.0-5) ...

Setting up python-distutils-extra (2.42) ...

Setting up python3-distutils-extra (2.42) ...

Processing triggers for libc-bin (2.28-10) ...

Processing triggers for ca-certificates (20190110) ...

Updating certificates in /etc/ssl/certs...

0 added, 0 removed; done.

Running hooks in /etc/ca-certificates/update.d...

done.

Removing intermediate container 0e3ad8d1e3d1
 ---> e032dccf7e07
Step 3/5 : USER user
 ---> Running in 48f15afcbadb
Removing intermediate container 48f15afcbadb
 ---> 0b502e6d748b
Step 4/5 : WORKDIR /home/user
 ---> Running in 9635cd5ec249
Removing intermediate container 9635cd5ec249
 ---> f9b3f55ffb00
Step 5/5 : RUN git config --global user.name "user" && git config --global user.email "user@example.com"
 ---> Running in f0fa4a0e74f3
Removing intermediate container f0fa4a0e74f3
 ---> f596b8fafa5a
Successfully built f596b8fafa5a
Successfully tagged openwrt-builder:latest
build_openwrt_image


1
2
3
4
5
6
7
8
9
10
11
12
13
14
15
16
17
18
19
20
21
22
23
24
25
26
27
28
29
30
31
32
33
34
35
36
37
38
39
40
41
42
43
44
45
46
47
48
49
50
51
52
53
54
55
56
57
58
59
60
61
62
63
64
65
66
67
68
69
70
71
72
73
74
75
76
77
78
79
80
81
82
83
84
85
86
87
88
89
90
91
92
93
94
95
96
97
98
99
100
101
102
103
104
105
106
107
108
109
110
111
112
113
114
115
116
117
118
119
120
121
122
123
124
125
126
127
128
129
130
131
132
133
134
135
136
137
138
139
140
141
142
143
144
145
146
147
148
149
150
151
152
153
154
155
156
157
158
159
160
161
162
163
164
165
166
167
168
169
170
171
172
173
174
175
176
177
178
179
180
181
182
183
184
185
186
187
188
189
190
191
192
193
194
195
196
197
198
199
200
201
202
203
204
205
206
207
208
209
210
211
212
213
214
215
216
217
218
219
220
221
222
223
224
225
226
227
228
229
230
231
232
233
234
235
236
237
238
239
240
241
242
243
244
245
246
247
248
249
250
251
252
253
254
255
256
257
258
259
260
261
262
263
264
265
266
267
268
269
270
271
272
273
274
275
276
277
278
279
280
281
282
283
284
285
286
287
288
289
290
291
292
293
294
295
296
297
298
299
300
301
302
303
304
305
306
307
308
309
310
311
312
313
314
315
316
317
318
319
320
321
322
323
324
325
326
327
328
329
330
331
332
333
334
335
336
337
338
339
340
341
342
343
344
345
346
347
348
349
350
351
352
353
354
355
356
357
358
359
360
361
362
363
364
365
366
367
368
369
370
371
372
373
374
375
376
377
378
379
380
381
382
383
384
385
386
387
388
389
390
391
392
393
394
395
396
397
398
399
400
401
402
403
404
405
406
407
408
409
410
411
412
413
414
415
416
417
418
419
420
421
422
423
424
425
426
427
428
429
430
431
432
433
434
435
436
437
438
439
440
441
442
443
444
445
446
447
448
449
450
451
452
453
454
455
456
457
458
459
460
461
462
463
464
465
466
467
468
469
470
471
472
473
474
475
476
477
478
479
480
481
482
483
484
485
486
487
488
489
490
491
492
493
494
495
496
497
498
499
500
501
502
503
504
505
506
507
508
509
510
511
512
513
514
515
516
517
518
519
520
521
522
523
524
525
526
527
528
529
530
531
532
533
534
535
536
537
538
539
540
541
542
543
544
545
546
547
548
549
550
551
552
553
554
555
556
557
558
559
560
561
562
563
564
565
566
567
568
569
570
571
572
573
574
575
576
577
578
579
580
581
582
583
584
585
586
587
588
589
590
591
592
593
594
595
596
597
598
599
600
601
602
603
604
605
606
607
608
609
610
611
612
613
614
615
616
617
618
619
620
621
622
623
624
625
626
627
628
629
630
631
632
633
634
635
636
637
638
639
640
641
642
643
644
645
646
647
648
649
650
651
652
653
654
655
656
657
658
659
660
661
662
663
664
665
666
667
668
669
670
671
672
673
674
675
676
677
678
679
680
681
682
683
684
685
686
687
688
689
690
691
692
693
694
695
696
697
698
699
700
701
702
703
704
705
706
707
708
709
710
711
712
713
714
715
716
717
718
719
720
721
722
723
724
725
726
727
728
729
730
731
732
733
734
735
736
737
738
739
740
741
742
743
744
745
746
747
748
749
750
751
752
753
754
755
756
757
758
759
760
761
762
763
764
765
766
767
768
769
770
771
772
773
774
775
776
777
778
779
780
781
782
783
784
785
786
787
788
789
790
791
792
793
794
795
796
797
798
799
800
801
802
803
804
805
806
807
808
809
810
811
812
813
814
815
816
817
818
819
820
821
822
823
824
825
826
827
828
829
830
831
832
833
834
835
836
837
838
839
840
841
842
843
844
845
846
847
848
849
850
851
852
853
854
855
856
857
858
859
860
861
862
863
864
865
866
867
868
869
870
871
872
873
874
875
876
877
878
879
880
881
882
883
884
885
886
887
888
889
890
891
892
893
894
895
896
897
898
899
900
901
902
903
904
905
906
907
908
909
910
911
912
913
914
915
916
917
918
919
920
921
922
923
924
925
926
927
928
929
930
931
932
933
934
935
936
937
938
939
940
941
942
943
944
945
946
947
948
949
950
951
952
953
954
955
956
957
958
959
960
961
962
963
964
965
966
967
968
969
970
971
972
973
974
975
976
977
978
979
980
981
982
983
984
985
986
987
988
989
990
991
992
993
994
995
996
997
998
999
1000
1001
1002
1003
1004
1005
1006
1007
1008
1009
1010
1011
1012
1013
1014
1015
1016
1017
1018
1019
1020
1021
1022
1023
1024
1025
1026
1027
1028
1029
1030
1031
1032
1033
1034
1035
1036
1037
1038
1039
1040
1041
1042
1043
1044
1045
1046
1047
1048
1049
1050
1051
1052
1053
1054
1055
1056
1057
1058
1059
1060
1061
1062
1063
1064
1065
1066
1067
1068
1069
This is a big file! Only the last 128KiB is shown. Click here to download the full log.

CFLAGS="-Os -pipe -fno-caller-saves -fno-plt -fhonour-copts -Wno-error=unused-but-set-variable -Wno-error=unused-result -iremap/home/user/openwrt/build_dir/target-x86_64_glibc/libdaemon-0.14:libdaemon-0.14 -Wformat -Werror=format-security -D_FORTIFY_SOURCE=1 -Wl,-z,now -Wl,-z,relro -fpic  -I/home/user/openwrt/staging_dir/target-x86_64_glibc/usr/include -I/home/user/openwrt/staging_dir/target-x86_64_glibc/include -I/home/user/openwrt/staging_dir/toolchain-x86_64_gcc-7.4.0_glibc/usr/include -I/home/user/openwrt/staging_dir/toolchain-x86_64_gcc-7.4.0_glibc/include " CXXFLAGS="-Os -pipe -fno-caller-saves -fno-plt -fhonour-copts -Wno-error=unused-but-set-variable -Wno-error=unused-result -iremap/home/user/openwrt/build_dir/target-x86_64_glibc/libdaemon-0.14:libdaemon-0.14 -Wformat -Werror=format-security -D_FORTIFY_SOURCE=1 -Wl,-z,now -Wl,-z,relro -fpic  -I/home/user/openwrt/staging_dir/target-x86_64_glibc/usr/include -I/home/user/openwrt/staging_dir/target-x86_64_glibc/include -I/home/user/openwrt/staging_dir/toolchain-x86_64_gcc-7.4.0_glibc/usr/include -I/home/user/openwrt/staging_dir/toolchain-x86_64_gcc-7.4.0_glibc/include " LDFLAGS="-L/home/user/openwrt/staging_dir/target-x86_64_glibc/usr/lib -L/home/user/openwrt/staging_dir/target-x86_64_glibc/lib -L/home/user/openwrt/staging_dir/toolchain-x86_64_gcc-7.4.0_glibc/usr/lib -L/home/user/openwrt/staging_dir/toolchain-x86_64_gcc-7.4.0_glibc/lib -znow -zrelro " make -j1 -C /home/user/openwrt/build_dir/target-x86_64_glibc/libdaemon-0.14/. AR="x86_64-openwrt-linux-gnu-gcc-ar" AS="x86_64-openwrt-linux-gnu-gcc -c -Os -pipe -fno-caller-saves -fno-plt -fhonour-copts -Wno-error=unused-but-set-variable -Wno-error=unused-result -iremap/home/user/openwrt/build_dir/target-x86_64_glibc/libdaemon-0.14:libdaemon-0.14 -Wformat -Werror=format-security -D_FORTIFY_SOURCE=1 -Wl,-z,now -Wl,-z,relro -fpic" LD=x86_64-openwrt-linux-gnu-ld NM="x86_64-openwrt-linux-gnu-gcc-nm" CC="x86_64-openwrt-linux-gnu-gcc" GCC="x86_64-openwrt-linux-gnu-gcc" CXX="x86_64-openwrt-linux-gnu-g++" RANLIB="x86_64-openwrt-linux-gnu-gcc-ranlib" STRIP=x86_64-openwrt-linux-gnu-strip OBJCOPY=x86_64-openwrt-linux-gnu-objcopy OBJDUMP=x86_64-openwrt-linux-gnu-objdump SIZE=x86_64-openwrt-linux-gnu-size CROSS="x86_64-openwrt-linux-gnu-" ARCH="x86_64" ;
mkdir -p /home/user/openwrt/dl
make[4]: Entering directory '/home/user/openwrt/build_dir/target-x86_64_glibc/libdaemon-0.14'
SHELL= flock /home/user/openwrt/tmp/.libcap-2.27.tar.xz.flock -c '  	/home/user/openwrt/scripts/download.pl "/home/user/openwrt/dl" "libcap-2.27.tar.xz" "dac1792d0118bee6aae6ba7fb93ff1602c6a9bda812fd63916eee1435b9c486a" "" "@KERNEL/linux/libs/security/linux-privs/libcap2"    '
make  all-recursive
make[5]: Entering directory '/home/user/openwrt/build_dir/target-x86_64_glibc/libdaemon-0.14'
Making all in libdaemon
make[6]: Entering directory '/home/user/openwrt/build_dir/target-x86_64_glibc/libdaemon-0.14/libdaemon'
  CC       dlog.lo
Can't exec "curl": No such file or directory at /home/user/openwrt/scripts/download.pl line 77.
+ wget --tries=5 --timeout=20 --no-check-certificate --output-document=- https://cdn.kernel.org/pub/linux/libs/security/linux-privs/libcap2/libcap-2.27.tar.xz
--2019-09-20 00:07:32--  https://cdn.kernel.org/pub/linux/libs/security/linux-privs/libcap2/libcap-2.27.tar.xz
Resolving cdn.kernel.org (cdn.kernel.org)... 151.101.1.176, 151.101.65.176, 151.101.129.176, ...
Connecting to cdn.kernel.org (cdn.kernel.org)|151.101.1.176|:443... connected.
HTTP request sent, awaiting response... 200 OK
Length: 67780 (66K) [application/x-xz]
Saving to: 'STDOUT'


-                     0%[                    ]       0  --.-KB/s               
-                   100%[===================>]  66.19K  --.-KB/s    in 0.007s  

2019-09-20 00:07:32 (9.13 MB/s) - written to stdout [67780/67780]

touch /home/user/openwrt/build_dir/target-x86_64_glibc/libcap-2.27/.prepared_fb33d16a5116043d207d77aa557f190d_6664517399ebbbc92a37c5bb081b5c53_check
. /home/user/openwrt/include/shell.sh; xzcat /home/user/openwrt/dl/libcap-2.27.tar.xz | tar -C /home/user/openwrt/build_dir/target-x86_64_glibc/libcap-2.27/.. -xf -
[ ! -d ./src/ ] || cp -fpR ./src/. /home/user/openwrt/build_dir/target-x86_64_glibc/libcap-2.27
  CC       dfork.lo

Applying ./patches/100-portability.patch using plaintext: 
patching file libcap/_makenames.c

Applying ./patches/200-change-hardcoded-shell-to-sh.patch using plaintext: 
patching file progs/capsh.c
touch /home/user/openwrt/build_dir/target-x86_64_glibc/libcap-2.27/.prepared_fb33d16a5116043d207d77aa557f190d_6664517399ebbbc92a37c5bb081b5c53
rm -f /home/user/openwrt/build_dir/target-x86_64_glibc/libcap-2.27/.configured_*
rm -f /home/user/openwrt/staging_dir/target-x86_64_glibc/stamp/.libcap_installed
(cd /home/user/openwrt/build_dir/target-x86_64_glibc/libcap-2.27/./; if [ -x ./configure ]; then find /home/user/openwrt/build_dir/target-x86_64_glibc/libcap-2.27/ -name config.guess | xargs -r chmod u+w; find /home/user/openwrt/build_dir/target-x86_64_glibc/libcap-2.27/ -name config.guess | xargs -r -n1 cp --remove-destination /home/user/openwrt/scripts/config.guess; find /home/user/openwrt/build_dir/target-x86_64_glibc/libcap-2.27/ -name config.sub | xargs -r chmod u+w; find /home/user/openwrt/build_dir/target-x86_64_glibc/libcap-2.27/ -name config.sub | xargs -r -n1 cp --remove-destination /home/user/openwrt/scripts/config.sub; AR="x86_64-openwrt-linux-gnu-gcc-ar" AS="x86_64-openwrt-linux-gnu-gcc -c -Os -pipe -fno-caller-saves -fno-plt -fhonour-copts -Wno-error=unused-but-set-variable -Wno-error=unused-result -iremap/home/user/openwrt/build_dir/target-x86_64_glibc/libcap-2.27:libcap-2.27 -Wformat -Werror=format-security -D_FORTIFY_SOURCE=1 -Wl,-z,now -Wl,-z,relro" LD=x86_64-openwrt-linux-gnu-ld NM="x86_64-openwrt-linux-gnu-gcc-nm" CC="x86_64-openwrt-linux-gnu-gcc" GCC="x86_64-openwrt-linux-gnu-gcc" CXX="x86_64-openwrt-linux-gnu-g++" RANLIB="x86_64-openwrt-linux-gnu-gcc-ranlib" STRIP=x86_64-openwrt-linux-gnu-strip OBJCOPY=x86_64-openwrt-linux-gnu-objcopy OBJDUMP=x86_64-openwrt-linux-gnu-objdump SIZE=x86_64-openwrt-linux-gnu-size CFLAGS="-Os -pipe -fno-caller-saves -fno-plt -fhonour-copts -Wno-error=unused-but-set-variable -Wno-error=unused-result -iremap/home/user/openwrt/build_dir/target-x86_64_glibc/libcap-2.27:libcap-2.27 -Wformat -Werror=format-security -D_FORTIFY_SOURCE=1 -Wl,-z,now -Wl,-z,relro " CXXFLAGS="-Os -pipe -fno-caller-saves -fno-plt -fhonour-copts -Wno-error=unused-but-set-variable -Wno-error=unused-result -iremap/home/user/openwrt/build_dir/target-x86_64_glibc/libcap-2.27:libcap-2.27 -Wformat -Werror=format-security -D_FORTIFY_SOURCE=1 -Wl,-z,now -Wl,-z,relro " CPPFLAGS="-I/home/user/openwrt/staging_dir/target-x86_64_glibc/usr/include -I/home/user/openwrt/staging_dir/target-x86_64_glibc/include -I/home/user/openwrt/staging_dir/toolchain-x86_64_gcc-7.4.0_glibc/usr/include -I/home/user/openwrt/staging_dir/toolchain-x86_64_gcc-7.4.0_glibc/include " LDFLAGS="-L/home/user/openwrt/staging_dir/target-x86_64_glibc/usr/lib -L/home/user/openwrt/staging_dir/target-x86_64_glibc/lib -L/home/user/openwrt/staging_dir/toolchain-x86_64_gcc-7.4.0_glibc/usr/lib -L/home/user/openwrt/staging_dir/toolchain-x86_64_gcc-7.4.0_glibc/lib -znow -zrelro "   ./configure --target=x86_64-openwrt-linux --host=x86_64-openwrt-linux --build=x86_64-pc-linux-gnu --program-prefix="" --program-suffix="" --prefix=/usr --exec-prefix=/usr --bindir=/usr/bin --sbindir=/usr/sbin --libexecdir=/usr/lib --sysconfdir=/etc --datadir=/usr/share --localstatedir=/var --mandir=/usr/man --infodir=/usr/info --disable-nls  ; fi; )
touch /home/user/openwrt/build_dir/target-x86_64_glibc/libcap-2.27/.configured_68b329da9893e34099c7d8ad5cb9c940
rm -f /home/user/openwrt/build_dir/target-x86_64_glibc/libcap-2.27/.built
touch /home/user/openwrt/build_dir/target-x86_64_glibc/libcap-2.27/.built_check
CFLAGS="-Os -pipe -fno-caller-saves -fno-plt -fhonour-copts -Wno-error=unused-but-set-variable -Wno-error=unused-result -iremap/home/user/openwrt/build_dir/target-x86_64_glibc/libcap-2.27:libcap-2.27 -Wformat -Werror=format-security -D_FORTIFY_SOURCE=1 -Wl,-z,now -Wl,-z,relro  -I/home/user/openwrt/staging_dir/target-x86_64_glibc/usr/include -I/home/user/openwrt/staging_dir/target-x86_64_glibc/include -I/home/user/openwrt/staging_dir/toolchain-x86_64_gcc-7.4.0_glibc/usr/include -I/home/user/openwrt/staging_dir/toolchain-x86_64_gcc-7.4.0_glibc/include " CXXFLAGS="-Os -pipe -fno-caller-saves -fno-plt -fhonour-copts -Wno-error=unused-but-set-variable -Wno-error=unused-result -iremap/home/user/openwrt/build_dir/target-x86_64_glibc/libcap-2.27:libcap-2.27 -Wformat -Werror=format-security -D_FORTIFY_SOURCE=1 -Wl,-z,now -Wl,-z,relro  -I/home/user/openwrt/staging_dir/target-x86_64_glibc/usr/include -I/home/user/openwrt/staging_dir/target-x86_64_glibc/include -I/home/user/openwrt/staging_dir/toolchain-x86_64_gcc-7.4.0_glibc/usr/include -I/home/user/openwrt/staging_dir/toolchain-x86_64_gcc-7.4.0_glibc/include " LDFLAGS="-L/home/user/openwrt/staging_dir/target-x86_64_glibc/usr/lib -L/home/user/openwrt/staging_dir/target-x86_64_glibc/lib -L/home/user/openwrt/staging_dir/toolchain-x86_64_gcc-7.4.0_glibc/usr/lib -L/home/user/openwrt/staging_dir/toolchain-x86_64_gcc-7.4.0_glibc/lib -znow -zrelro " make -j1 -C /home/user/openwrt/build_dir/target-x86_64_glibc/libcap-2.27/. AR="x86_64-openwrt-linux-gnu-gcc-ar" AS="x86_64-openwrt-linux-gnu-gcc -c -Os -pipe -fno-caller-saves -fno-plt -fhonour-copts -Wno-error=unused-but-set-variable -Wno-error=unused-result -iremap/home/user/openwrt/build_dir/target-x86_64_glibc/libcap-2.27:libcap-2.27 -Wformat -Werror=format-security -D_FORTIFY_SOURCE=1 -Wl,-z,now -Wl,-z,relro" LD=x86_64-openwrt-linux-gnu-ld NM="x86_64-openwrt-linux-gnu-gcc-nm" CC="x86_64-openwrt-linux-gnu-gcc" GCC="x86_64-openwrt-linux-gnu-gcc" CXX="x86_64-openwrt-linux-gnu-g++" RANLIB="x86_64-openwrt-linux-gnu-gcc-ranlib" STRIP=x86_64-openwrt-linux-gnu-strip OBJCOPY=x86_64-openwrt-linux-gnu-objcopy OBJDUMP=x86_64-openwrt-linux-gnu-objdump SIZE=x86_64-openwrt-linux-gnu-size CROSS="x86_64-openwrt-linux-gnu-" ARCH="x86_64" BUILD_CC="cc" BUILD_CFLAGS="-fpic -I/home/user/openwrt/build_dir/target-x86_64_glibc/libcap-2.27/libcap/include" CFLAGS="-Os -pipe -fno-caller-saves -fno-plt -fhonour-copts -Wno-error=unused-but-set-variable -Wno-error=unused-result -iremap/home/user/openwrt/build_dir/target-x86_64_glibc/libcap-2.27:libcap-2.27 -Wformat -Werror=format-security -D_FORTIFY_SOURCE=1 -Wl,-z,now -Wl,-z,relro" LD="x86_64-openwrt-linux-gnu-gcc -Wl,-x -shared" LDFLAGS="-L/home/user/openwrt/staging_dir/target-x86_64_glibc/usr/lib -L/home/user/openwrt/staging_dir/target-x86_64_glibc/lib -L/home/user/openwrt/staging_dir/toolchain-x86_64_gcc-7.4.0_glibc/usr/lib -L/home/user/openwrt/staging_dir/toolchain-x86_64_gcc-7.4.0_glibc/lib -znow -zrelro" INDENT="| true" PAM_CAP="no" RAISE_SETFCAP="no" DYNAMIC="yes" lib="lib" ;
make[4]: Entering directory '/home/user/openwrt/build_dir/target-x86_64_glibc/libcap-2.27'
make -C libcap all
make[5]: Entering directory '/home/user/openwrt/build_dir/target-x86_64_glibc/libcap-2.27/libcap'
=> making cap_names.list.h from /home/user/openwrt/build_dir/target-x86_64_glibc/libcap-2.27/libcap/../libcap/include/uapi/linux/capability.h
perl -e 'while ($l=<>) { if ($l =~ /^\#define[ \t](CAP[_A-Z]+)[ \t]+([0-9]+)\s+$/) { $tok=$1; $val=$2; $tok =~ tr/A-Z/a-z/; print "{\"$tok\",$val},\n"; } }' /home/user/openwrt/build_dir/target-x86_64_glibc/libcap-2.27/libcap/../libcap/include/uapi/linux/capability.h | fgrep -v 0x > cap_names.list.h
cc -fpic -I/home/user/openwrt/build_dir/target-x86_64_glibc/libcap-2.27/libcap/include _makenames.c -o _makenames
./_makenames > cap_names.h
x86_64-openwrt-linux-gnu-gcc -Os -pipe -fno-caller-saves -fno-plt -fhonour-copts -Wno-error=unused-but-set-variable -Wno-error=unused-result -iremap/home/user/openwrt/build_dir/target-x86_64_glibc/libcap-2.27:libcap-2.27 -Wformat -Werror=format-security -D_FORTIFY_SOURCE=1 -Wl,-z,now -Wl,-z,relro -fPIC -I/home/user/openwrt/build_dir/target-x86_64_glibc/libcap-2.27/libcap/../libcap/include/uapi -I/home/user/openwrt/build_dir/target-x86_64_glibc/libcap-2.27/libcap/../libcap/include -c cap_alloc.c -o cap_alloc.o
x86_64-openwrt-linux-gnu-gcc -Os -pipe -fno-caller-saves -fno-plt -fhonour-copts -Wno-error=unused-but-set-variable -Wno-error=unused-result -iremap/home/user/openwrt/build_dir/target-x86_64_glibc/libcap-2.27:libcap-2.27 -Wformat -Werror=format-security -D_FORTIFY_SOURCE=1 -Wl,-z,now -Wl,-z,relro -fPIC -I/home/user/openwrt/build_dir/target-x86_64_glibc/libcap-2.27/libcap/../libcap/include/uapi -I/home/user/openwrt/build_dir/target-x86_64_glibc/libcap-2.27/libcap/../libcap/include -c cap_proc.c -o cap_proc.o
x86_64-openwrt-linux-gnu-gcc -Os -pipe -fno-caller-saves -fno-plt -fhonour-copts -Wno-error=unused-but-set-variable -Wno-error=unused-result -iremap/home/user/openwrt/build_dir/target-x86_64_glibc/libcap-2.27:libcap-2.27 -Wformat -Werror=format-security -D_FORTIFY_SOURCE=1 -Wl,-z,now -Wl,-z,relro -fPIC -I/home/user/openwrt/build_dir/target-x86_64_glibc/libcap-2.27/libcap/../libcap/include/uapi -I/home/user/openwrt/build_dir/target-x86_64_glibc/libcap-2.27/libcap/../libcap/include -c cap_extint.c -o cap_extint.o
x86_64-openwrt-linux-gnu-gcc -Os -pipe -fno-caller-saves -fno-plt -fhonour-copts -Wno-error=unused-but-set-variable -Wno-error=unused-result -iremap/home/user/openwrt/build_dir/target-x86_64_glibc/libcap-2.27:libcap-2.27 -Wformat -Werror=format-security -D_FORTIFY_SOURCE=1 -Wl,-z,now -Wl,-z,relro -fPIC -I/home/user/openwrt/build_dir/target-x86_64_glibc/libcap-2.27/libcap/../libcap/include/uapi -I/home/user/openwrt/build_dir/target-x86_64_glibc/libcap-2.27/libcap/../libcap/include -c cap_flag.c -o cap_flag.o
x86_64-openwrt-linux-gnu-gcc -Os -pipe -fno-caller-saves -fno-plt -fhonour-copts -Wno-error=unused-but-set-variable -Wno-error=unused-result -iremap/home/user/openwrt/build_dir/target-x86_64_glibc/libcap-2.27:libcap-2.27 -Wformat -Werror=format-security -D_FORTIFY_SOURCE=1 -Wl,-z,now -Wl,-z,relro -fPIC -I/home/user/openwrt/build_dir/target-x86_64_glibc/libcap-2.27/libcap/../libcap/include/uapi -I/home/user/openwrt/build_dir/target-x86_64_glibc/libcap-2.27/libcap/../libcap/include  -c cap_text.c -o cap_text.o
cap_text.c: In function 'cap_to_name':
cap_text.c:296:2: warning: ignoring return value of 'asprintf', declared with attribute warn_unused_result [-Wunused-result]
  asprintf(&tmp, "%u", cap);
  ^~~~~~~~~~~~~~~~~~~~~~~~~
  CC       dsignal.lo
dsignal.c: In function '_sigfunc':
dsignal.c:40:5: warning: ignoring return value of 'write', declared with attribute warn_unused_result [-Wunused-result]
     write(_signal_pipe[1], &s, sizeof(s));
     ^~~~~~~~~~~~~~~~~~~~~~~~~~~~~~~~~~~~~
x86_64-openwrt-linux-gnu-gcc -Os -pipe -fno-caller-saves -fno-plt -fhonour-copts -Wno-error=unused-but-set-variable -Wno-error=unused-result -iremap/home/user/openwrt/build_dir/target-x86_64_glibc/libcap-2.27:libcap-2.27 -Wformat -Werror=format-security -D_FORTIFY_SOURCE=1 -Wl,-z,now -Wl,-z,relro -fPIC -I/home/user/openwrt/build_dir/target-x86_64_glibc/libcap-2.27/libcap/../libcap/include/uapi -I/home/user/openwrt/build_dir/target-x86_64_glibc/libcap-2.27/libcap/../libcap/include -c cap_file.c -o cap_file.o
x86_64-openwrt-linux-gnu-gcc -Wl,-x -shared -Os -pipe -fno-caller-saves -fno-plt -fhonour-copts -Wno-error=unused-but-set-variable -Wno-error=unused-result -iremap/home/user/openwrt/build_dir/target-x86_64_glibc/libcap-2.27:libcap-2.27 -Wformat -Werror=format-security -D_FORTIFY_SOURCE=1 -Wl,-z,now -Wl,-z,relro -L/home/user/openwrt/staging_dir/target-x86_64_glibc/usr/lib -L/home/user/openwrt/staging_dir/target-x86_64_glibc/lib -L/home/user/openwrt/staging_dir/toolchain-x86_64_gcc-7.4.0_glibc/usr/lib -L/home/user/openwrt/staging_dir/toolchain-x86_64_gcc-7.4.0_glibc/lib -znow -zrelro -Wl,-soname,libcap.so.2 -o libcap.so.2.27 cap_alloc.o cap_proc.o cap_extint.o cap_flag.o cap_text.o cap_file.o
  CC       dnonblock.lo
ln -sf libcap.so.2.27 libcap.so.2
ln -sf libcap.so.2 libcap.so
x86_64-openwrt-linux-gnu-gcc-ar rcs libcap.a cap_alloc.o cap_proc.o cap_extint.o cap_flag.o cap_text.o cap_file.o
x86_64-openwrt-linux-gnu-gcc-ranlib libcap.a
sed -e 's,@prefix@,/usr,' \
	-e 's,@exec_prefix@,,' \
	-e 's,@libdir@,/lib,' \
	-e 's,@includedir@,/usr/include,' \
	-e 's,@VERSION@,2.27,' \
	-e 's,@deps@,,' \
	libcap.pc.in >libcap.pc
make[5]: Leaving directory '/home/user/openwrt/build_dir/target-x86_64_glibc/libcap-2.27/libcap'
make -C progs all
make[5]: Entering directory '/home/user/openwrt/build_dir/target-x86_64_glibc/libcap-2.27/progs'
x86_64-openwrt-linux-gnu-gcc -fPIC -I/home/user/openwrt/build_dir/target-x86_64_glibc/libcap-2.27/progs/../libcap/include/uapi -I/home/user/openwrt/build_dir/target-x86_64_glibc/libcap-2.27/progs/../libcap/include -Os -pipe -fno-caller-saves -fno-plt -fhonour-copts -Wno-error=unused-but-set-variable -Wno-error=unused-result -iremap/home/user/openwrt/build_dir/target-x86_64_glibc/libcap-2.27:libcap-2.27 -Wformat -Werror=format-security -D_FORTIFY_SOURCE=1 -Wl,-z,now -Wl,-z,relro -c getpcaps.c -o getpcaps.o
  CC       dpid.lo
x86_64-openwrt-linux-gnu-gcc -Os -pipe -fno-caller-saves -fno-plt -fhonour-copts -Wno-error=unused-but-set-variable -Wno-error=unused-result -iremap/home/user/openwrt/build_dir/target-x86_64_glibc/libcap-2.27:libcap-2.27 -Wformat -Werror=format-security -D_FORTIFY_SOURCE=1 -Wl,-z,now -Wl,-z,relro -L/home/user/openwrt/staging_dir/target-x86_64_glibc/usr/lib -L/home/user/openwrt/staging_dir/target-x86_64_glibc/lib -L/home/user/openwrt/staging_dir/toolchain-x86_64_gcc-7.4.0_glibc/usr/lib -L/home/user/openwrt/staging_dir/toolchain-x86_64_gcc-7.4.0_glibc/lib -znow -zrelro -o getpcaps getpcaps.o -L../libcap -lcap
x86_64-openwrt-linux-gnu-gcc -fPIC -I/home/user/openwrt/build_dir/target-x86_64_glibc/libcap-2.27/progs/../libcap/include/uapi -I/home/user/openwrt/build_dir/target-x86_64_glibc/libcap-2.27/progs/../libcap/include -Os -pipe -fno-caller-saves -fno-plt -fhonour-copts -Wno-error=unused-but-set-variable -Wno-error=unused-result -iremap/home/user/openwrt/build_dir/target-x86_64_glibc/libcap-2.27:libcap-2.27 -Wformat -Werror=format-security -D_FORTIFY_SOURCE=1 -Wl,-z,now -Wl,-z,relro -c capsh.c -o capsh.o
dpid.c: In function 'daemon_pid_file_proc_default':
dpid.c:60:5: warning: ignoring return value of 'asprintf', declared with attribute warn_unused_result [-Wunused-result]
     asprintf(&fn,  "%s/%s.pid", VARRUN, daemon_pid_file_ident ? daemon_pid_file_ident : "unknown");
     ^~~~~~~~~~~~~~~~~~~~~~~~~~~~~~~~~~~~~~~~~~~~~~~~~~~~~~~~~~~~~~~~~~~~~~~~~~~~~~~~~~~~~~~~~~~~~~
x86_64-openwrt-linux-gnu-gcc -Os -pipe -fno-caller-saves -fno-plt -fhonour-copts -Wno-error=unused-but-set-variable -Wno-error=unused-result -iremap/home/user/openwrt/build_dir/target-x86_64_glibc/libcap-2.27:libcap-2.27 -Wformat -Werror=format-security -D_FORTIFY_SOURCE=1 -Wl,-z,now -Wl,-z,relro -L/home/user/openwrt/staging_dir/target-x86_64_glibc/usr/lib -L/home/user/openwrt/staging_dir/target-x86_64_glibc/lib -L/home/user/openwrt/staging_dir/toolchain-x86_64_gcc-7.4.0_glibc/usr/lib -L/home/user/openwrt/staging_dir/toolchain-x86_64_gcc-7.4.0_glibc/lib -znow -zrelro -o capsh capsh.o -L../libcap -lcap
  CC       dexec.lo
x86_64-openwrt-linux-gnu-gcc -fPIC -I/home/user/openwrt/build_dir/target-x86_64_glibc/libcap-2.27/progs/../libcap/include/uapi -I/home/user/openwrt/build_dir/target-x86_64_glibc/libcap-2.27/progs/../libcap/include -Os -pipe -fno-caller-saves -fno-plt -fhonour-copts -Wno-error=unused-but-set-variable -Wno-error=unused-result -iremap/home/user/openwrt/build_dir/target-x86_64_glibc/libcap-2.27:libcap-2.27 -Wformat -Werror=format-security -D_FORTIFY_SOURCE=1 -Wl,-z,now -Wl,-z,relro -c getcap.c -o getcap.o
dexec.c: In function 'daemon_execv':
dexec.c:110:13: warning: ignoring return value of 'chdir', declared with attribute warn_unused_result [-Wunused-result]
             chdir("/");
             ^~~~~~~~~~
x86_64-openwrt-linux-gnu-gcc -Os -pipe -fno-caller-saves -fno-plt -fhonour-copts -Wno-error=unused-but-set-variable -Wno-error=unused-result -iremap/home/user/openwrt/build_dir/target-x86_64_glibc/libcap-2.27:libcap-2.27 -Wformat -Werror=format-security -D_FORTIFY_SOURCE=1 -Wl,-z,now -Wl,-z,relro -L/home/user/openwrt/staging_dir/target-x86_64_glibc/usr/lib -L/home/user/openwrt/staging_dir/target-x86_64_glibc/lib -L/home/user/openwrt/staging_dir/toolchain-x86_64_gcc-7.4.0_glibc/usr/lib -L/home/user/openwrt/staging_dir/toolchain-x86_64_gcc-7.4.0_glibc/lib -znow -zrelro -o getcap getcap.o -L../libcap -lcap
x86_64-openwrt-linux-gnu-gcc -fPIC -I/home/user/openwrt/build_dir/target-x86_64_glibc/libcap-2.27/progs/../libcap/include/uapi -I/home/user/openwrt/build_dir/target-x86_64_glibc/libcap-2.27/progs/../libcap/include -Os -pipe -fno-caller-saves -fno-plt -fhonour-copts -Wno-error=unused-but-set-variable -Wno-error=unused-result -iremap/home/user/openwrt/build_dir/target-x86_64_glibc/libcap-2.27:libcap-2.27 -Wformat -Werror=format-security -D_FORTIFY_SOURCE=1 -Wl,-z,now -Wl,-z,relro -c setcap.c -o setcap.o
x86_64-openwrt-linux-gnu-gcc -Os -pipe -fno-caller-saves -fno-plt -fhonour-copts -Wno-error=unused-but-set-variable -Wno-error=unused-result -iremap/home/user/openwrt/build_dir/target-x86_64_glibc/libcap-2.27:libcap-2.27 -Wformat -Werror=format-security -D_FORTIFY_SOURCE=1 -Wl,-z,now -Wl,-z,relro -L/home/user/openwrt/staging_dir/target-x86_64_glibc/usr/lib -L/home/user/openwrt/staging_dir/target-x86_64_glibc/lib -L/home/user/openwrt/staging_dir/toolchain-x86_64_gcc-7.4.0_glibc/usr/lib -L/home/user/openwrt/staging_dir/toolchain-x86_64_gcc-7.4.0_glibc/lib -znow -zrelro -o setcap setcap.o -L../libcap -lcap
make[5]: Leaving directory '/home/user/openwrt/build_dir/target-x86_64_glibc/libcap-2.27/progs'
make -C doc all
make[5]: Entering directory '/home/user/openwrt/build_dir/target-x86_64_glibc/libcap-2.27/doc'
make[5]: Nothing to be done for 'all'.
make[5]: Leaving directory '/home/user/openwrt/build_dir/target-x86_64_glibc/libcap-2.27/doc'
make -C kdebug all
make[5]: Entering directory '/home/user/openwrt/build_dir/target-x86_64_glibc/libcap-2.27/kdebug'
cd to kdebug to test a kernel build
make[5]: Leaving directory '/home/user/openwrt/build_dir/target-x86_64_glibc/libcap-2.27/kdebug'
make[4]: Leaving directory '/home/user/openwrt/build_dir/target-x86_64_glibc/libcap-2.27'
CFLAGS="-Os -pipe -fno-caller-saves -fno-plt -fhonour-copts -Wno-error=unused-but-set-variable -Wno-error=unused-result -iremap/home/user/openwrt/build_dir/target-x86_64_glibc/libcap-2.27:libcap-2.27 -Wformat -Werror=format-security -D_FORTIFY_SOURCE=1 -Wl,-z,now -Wl,-z,relro  -I/home/user/openwrt/staging_dir/target-x86_64_glibc/usr/include -I/home/user/openwrt/staging_dir/target-x86_64_glibc/include -I/home/user/openwrt/staging_dir/toolchain-x86_64_gcc-7.4.0_glibc/usr/include -I/home/user/openwrt/staging_dir/toolchain-x86_64_gcc-7.4.0_glibc/include " CXXFLAGS="-Os -pipe -fno-caller-saves -fno-plt -fhonour-copts -Wno-error=unused-but-set-variable -Wno-error=unused-result -iremap/home/user/openwrt/build_dir/target-x86_64_glibc/libcap-2.27:libcap-2.27 -Wformat -Werror=format-security -D_FORTIFY_SOURCE=1 -Wl,-z,now -Wl,-z,relro  -I/home/user/openwrt/staging_dir/target-x86_64_glibc/usr/include -I/home/user/openwrt/staging_dir/target-x86_64_glibc/include -I/home/user/openwrt/staging_dir/toolchain-x86_64_gcc-7.4.0_glibc/usr/include -I/home/user/openwrt/staging_dir/toolchain-x86_64_gcc-7.4.0_glibc/include " LDFLAGS="-L/home/user/openwrt/staging_dir/target-x86_64_glibc/usr/lib -L/home/user/openwrt/staging_dir/target-x86_64_glibc/lib -L/home/user/openwrt/staging_dir/toolchain-x86_64_gcc-7.4.0_glibc/usr/lib -L/home/user/openwrt/staging_dir/toolchain-x86_64_gcc-7.4.0_glibc/lib -znow -zrelro " make -C /home/user/openwrt/build_dir/target-x86_64_glibc/libcap-2.27/. AR="x86_64-openwrt-linux-gnu-gcc-ar" AS="x86_64-openwrt-linux-gnu-gcc -c -Os -pipe -fno-caller-saves -fno-plt -fhonour-copts -Wno-error=unused-but-set-variable -Wno-error=unused-result -iremap/home/user/openwrt/build_dir/target-x86_64_glibc/libcap-2.27:libcap-2.27 -Wformat -Werror=format-security -D_FORTIFY_SOURCE=1 -Wl,-z,now -Wl,-z,relro" LD=x86_64-openwrt-linux-gnu-ld NM="x86_64-openwrt-linux-gnu-gcc-nm" CC="x86_64-openwrt-linux-gnu-gcc" GCC="x86_64-openwrt-linux-gnu-gcc" CXX="x86_64-openwrt-linux-gnu-g++" RANLIB="x86_64-openwrt-linux-gnu-gcc-ranlib" STRIP=x86_64-openwrt-linux-gnu-strip OBJCOPY=x86_64-openwrt-linux-gnu-objcopy OBJDUMP=x86_64-openwrt-linux-gnu-objdump SIZE=x86_64-openwrt-linux-gnu-size CROSS="x86_64-openwrt-linux-gnu-" ARCH="x86_64" BUILD_CC="cc" BUILD_CFLAGS="-fpic -I/home/user/openwrt/build_dir/target-x86_64_glibc/libcap-2.27/libcap/include" CFLAGS="-Os -pipe -fno-caller-saves -fno-plt -fhonour-copts -Wno-error=unused-but-set-variable -Wno-error=unused-result -iremap/home/user/openwrt/build_dir/target-x86_64_glibc/libcap-2.27:libcap-2.27 -Wformat -Werror=format-security -D_FORTIFY_SOURCE=1 -Wl,-z,now -Wl,-z,relro" LD="x86_64-openwrt-linux-gnu-gcc -Wl,-x -shared" LDFLAGS="-L/home/user/openwrt/staging_dir/target-x86_64_glibc/usr/lib -L/home/user/openwrt/staging_dir/target-x86_64_glibc/lib -L/home/user/openwrt/staging_dir/toolchain-x86_64_gcc-7.4.0_glibc/usr/lib -L/home/user/openwrt/staging_dir/toolchain-x86_64_gcc-7.4.0_glibc/lib -znow -zrelro" INDENT="| true" PAM_CAP="no" RAISE_SETFCAP="no" DYNAMIC="yes" lib="lib" DESTDIR="/home/user/openwrt/build_dir/target-x86_64_glibc/libcap-2.27/ipkg-install"  install;
  CCLD     libdaemon.la
make[4]: Entering directory '/home/user/openwrt/build_dir/target-x86_64_glibc/libcap-2.27'
make -C libcap install
make[5]: Entering directory '/home/user/openwrt/build_dir/target-x86_64_glibc/libcap-2.27/libcap'
mkdir -p -m 0755 /home/user/openwrt/build_dir/target-x86_64_glibc/libcap-2.27/ipkg-install/usr/include/sys
install -m 0644 include/sys/capability.h /home/user/openwrt/build_dir/target-x86_64_glibc/libcap-2.27/ipkg-install/usr/include/sys
mkdir -p -m 0755 /home/user/openwrt/build_dir/target-x86_64_glibc/libcap-2.27/ipkg-install/lib
install -m 0644 libcap.a /home/user/openwrt/build_dir/target-x86_64_glibc/libcap-2.27/ipkg-install/lib/libcap.a
install -m 0644 libcap.so.2.27 /home/user/openwrt/build_dir/target-x86_64_glibc/libcap-2.27/ipkg-install/lib/libcap.so.2.27
ln -sf libcap.so.2.27 /home/user/openwrt/build_dir/target-x86_64_glibc/libcap-2.27/ipkg-install/lib/libcap.so.2
ln -sf libcap.so.2 /home/user/openwrt/build_dir/target-x86_64_glibc/libcap-2.27/ipkg-install/lib/libcap.so
mkdir -p -m 0755 /home/user/openwrt/build_dir/target-x86_64_glibc/libcap-2.27/ipkg-install/usr/lib/pkgconfig
install -m 0644 libcap.pc /home/user/openwrt/build_dir/target-x86_64_glibc/libcap-2.27/ipkg-install/usr/lib/pkgconfig/libcap.pc
make[5]: Leaving directory '/home/user/openwrt/build_dir/target-x86_64_glibc/libcap-2.27/libcap'
make -C progs install
make[5]: Entering directory '/home/user/openwrt/build_dir/target-x86_64_glibc/libcap-2.27/progs'
mkdir -p -m 0755 /home/user/openwrt/build_dir/target-x86_64_glibc/libcap-2.27/ipkg-install/sbin
for p in getpcaps capsh getcap setcap ; do \
	install -m 0755 $p /home/user/openwrt/build_dir/target-x86_64_glibc/libcap-2.27/ipkg-install/sbin ; \
done
make[5]: Leaving directory '/home/user/openwrt/build_dir/target-x86_64_glibc/libcap-2.27/progs'
make -C doc install
make[5]: Entering directory '/home/user/openwrt/build_dir/target-x86_64_glibc/libcap-2.27/doc'
mkdir -p -m 755 /home/user/openwrt/build_dir/target-x86_64_glibc/libcap-2.27/ipkg-install/usr/share/man/man1 /home/user/openwrt/build_dir/target-x86_64_glibc/libcap-2.27/ipkg-install/usr/share/man/man3 /home/user/openwrt/build_dir/target-x86_64_glibc/libcap-2.27/ipkg-install/usr/share/man/man8
for man in \
	/home/user/openwrt/build_dir/target-x86_64_glibc/libcap-2.27/ipkg-install/usr/share/man/man1 capsh.1 \
	/home/user/openwrt/build_dir/target-x86_64_glibc/libcap-2.27/ipkg-install/usr/share/man/man3 cap_init.3 cap_free.3 cap_dup.3 cap_clear.3 cap_clear_flag.3 cap_get_flag.3 cap_set_flag.3 cap_compare.3 cap_get_proc.3 cap_get_pid.3 cap_set_proc.3 cap_get_file.3 cap_get_fd.3 cap_set_file.3 cap_set_fd.3 cap_copy_ext.3 cap_size.3 cap_copy_int.3 cap_from_text.3 cap_to_text.3 cap_from_name.3 cap_to_name.3 capsetp.3 capgetp.3 libcap.3 cap_get_bound.3 cap_drop_bound.3 \
	/home/user/openwrt/build_dir/target-x86_64_glibc/libcap-2.27/ipkg-install/usr/share/man/man8 getcap.8 setcap.8 \
	; \
do \
	case $man in \
	/*)	sub=$man ; continue ;; \
	esac; \
	install -m 644 $man $sub ; \
done
/home/user/openwrt/staging_dir/toolchain-x86_64_gcc-7.4.0_glibc/lib/gcc/x86_64-openwrt-linux-gnu/7.4.0/../../../../x86_64-openwrt-linux-gnu/bin/ar: `u' modifier ignored since `D' is the default (see `U')
make[5]: Leaving directory '/home/user/openwrt/build_dir/target-x86_64_glibc/libcap-2.27/doc'
make -C kdebug install
make[5]: Entering directory '/home/user/openwrt/build_dir/target-x86_64_glibc/libcap-2.27/kdebug'
make[6]: Leaving directory '/home/user/openwrt/build_dir/target-x86_64_glibc/libdaemon-0.14/libdaemon'
Making all in doc
make[6]: Entering directory '/home/user/openwrt/build_dir/target-x86_64_glibc/libdaemon-0.14/doc'
make[6]: Nothing to be done for 'all'.
make[6]: Leaving directory '/home/user/openwrt/build_dir/target-x86_64_glibc/libdaemon-0.14/doc'
make[5]: Nothing to be done for 'install'.
make[5]: Leaving directory '/home/user/openwrt/build_dir/target-x86_64_glibc/libcap-2.27/kdebug'
make[4]: Leaving directory '/home/user/openwrt/build_dir/target-x86_64_glibc/libcap-2.27'
touch /home/user/openwrt/build_dir/target-x86_64_glibc/libcap-2.27/.built
make[6]: Entering directory '/home/user/openwrt/build_dir/target-x86_64_glibc/libdaemon-0.14'
rm -rf /home/user/openwrt/tmp/stage-libcap
make[6]: Leaving directory '/home/user/openwrt/build_dir/target-x86_64_glibc/libdaemon-0.14'
make[5]: Leaving directory '/home/user/openwrt/build_dir/target-x86_64_glibc/libdaemon-0.14'
make[4]: Leaving directory '/home/user/openwrt/build_dir/target-x86_64_glibc/libdaemon-0.14'
CFLAGS="-Os -pipe -fno-caller-saves -fno-plt -fhonour-copts -Wno-error=unused-but-set-variable -Wno-error=unused-result -iremap/home/user/openwrt/build_dir/target-x86_64_glibc/libdaemon-0.14:libdaemon-0.14 -Wformat -Werror=format-security -D_FORTIFY_SOURCE=1 -Wl,-z,now -Wl,-z,relro -fpic  -I/home/user/openwrt/staging_dir/target-x86_64_glibc/usr/include -I/home/user/openwrt/staging_dir/target-x86_64_glibc/include -I/home/user/openwrt/staging_dir/toolchain-x86_64_gcc-7.4.0_glibc/usr/include -I/home/user/openwrt/staging_dir/toolchain-x86_64_gcc-7.4.0_glibc/include " CXXFLAGS="-Os -pipe -fno-caller-saves -fno-plt -fhonour-copts -Wno-error=unused-but-set-variable -Wno-error=unused-result -iremap/home/user/openwrt/build_dir/target-x86_64_glibc/libdaemon-0.14:libdaemon-0.14 -Wformat -Werror=format-security -D_FORTIFY_SOURCE=1 -Wl,-z,now -Wl,-z,relro -fpic  -I/home/user/openwrt/staging_dir/target-x86_64_glibc/usr/include -I/home/user/openwrt/staging_dir/target-x86_64_glibc/include -I/home/user/openwrt/staging_dir/toolchain-x86_64_gcc-7.4.0_glibc/usr/include -I/home/user/openwrt/staging_dir/toolchain-x86_64_gcc-7.4.0_glibc/include " LDFLAGS="-L/home/user/openwrt/staging_dir/target-x86_64_glibc/usr/lib -L/home/user/openwrt/staging_dir/target-x86_64_glibc/lib -L/home/user/openwrt/staging_dir/toolchain-x86_64_gcc-7.4.0_glibc/usr/lib -L/home/user/openwrt/staging_dir/toolchain-x86_64_gcc-7.4.0_glibc/lib -znow -zrelro " make -C /home/user/openwrt/build_dir/target-x86_64_glibc/libdaemon-0.14/. AR="x86_64-openwrt-linux-gnu-gcc-ar" AS="x86_64-openwrt-linux-gnu-gcc -c -Os -pipe -fno-caller-saves -fno-plt -fhonour-copts -Wno-error=unused-but-set-variable -Wno-error=unused-result -iremap/home/user/openwrt/build_dir/target-x86_64_glibc/libdaemon-0.14:libdaemon-0.14 -Wformat -Werror=format-security -D_FORTIFY_SOURCE=1 -Wl,-z,now -Wl,-z,relro -fpic" LD=x86_64-openwrt-linux-gnu-ld NM="x86_64-openwrt-linux-gnu-gcc-nm" CC="x86_64-openwrt-linux-gnu-gcc" GCC="x86_64-openwrt-linux-gnu-gcc" CXX="x86_64-openwrt-linux-gnu-g++" RANLIB="x86_64-openwrt-linux-gnu-gcc-ranlib" STRIP=x86_64-openwrt-linux-gnu-strip OBJCOPY=x86_64-openwrt-linux-gnu-objcopy OBJDUMP=x86_64-openwrt-linux-gnu-objdump SIZE=x86_64-openwrt-linux-gnu-size CROSS="x86_64-openwrt-linux-gnu-" ARCH="x86_64" DESTDIR="/home/user/openwrt/build_dir/target-x86_64_glibc/libdaemon-0.14/ipkg-install"  install;
mkdir -p /home/user/openwrt/tmp/stage-libcap/host /home/user/openwrt/staging_dir/target-x86_64_glibc/packages /home/user/openwrt/staging_dir/host/packages
install -d -m0755 /home/user/openwrt/tmp/stage-libcap/usr/include/sys
make[4]: Entering directory '/home/user/openwrt/build_dir/target-x86_64_glibc/libdaemon-0.14'
cp -fpR /home/user/openwrt/build_dir/target-x86_64_glibc/libcap-2.27/ipkg-install/usr/include/* /home/user/openwrt/tmp/stage-libcap/usr/include/
install -d -m0755 /home/user/openwrt/tmp/stage-libcap/usr/lib/
cp -fpR /home/user/openwrt/build_dir/target-x86_64_glibc/libcap-2.27/ipkg-install/lib/* /home/user/openwrt/tmp/stage-libcap/usr/lib/
cp -fpR /home/user/openwrt/build_dir/target-x86_64_glibc/libcap-2.27/ipkg-install/usr/lib/* /home/user/openwrt/tmp/stage-libcap/usr/lib/
find /home/user/openwrt/tmp/stage-libcap -name '*.la' | xargs -r rm -f; 
Making install in libdaemon
if [ -f /home/user/openwrt/staging_dir/target-x86_64_glibc/packages/libcap.list ]; then /home/user/openwrt/scripts/clean-package.sh "/home/user/openwrt/staging_dir/target-x86_64_glibc/packages/libcap.list" "/home/user/openwrt/staging_dir/target-x86_64_glibc"; fi
if [ -d /home/user/openwrt/tmp/stage-libcap ]; then (cd /home/user/openwrt/tmp/stage-libcap; find ./ > /home/user/openwrt/tmp/stage-libcap.files); 	SHELL= flock /home/user/openwrt/tmp/.staging-dir.flock -c ' mv /home/user/openwrt/tmp/stage-libcap.files /home/user/openwrt/staging_dir/target-x86_64_glibc/packages/libcap.list && cp -fpR /home/user/openwrt/tmp/stage-libcap/* /home/user/openwrt/staging_dir/target-x86_64_glibc/; '; fi
rm -rf /home/user/openwrt/tmp/stage-libcap
make[5]: Entering directory '/home/user/openwrt/build_dir/target-x86_64_glibc/libdaemon-0.14/libdaemon'
touch /home/user/openwrt/staging_dir/target-x86_64_glibc/stamp/.libcap_installed
make[3]: Leaving directory '/home/user/openwrt/feeds/packages/libs/libcap'
time: package/feeds/packages/libcap/compile#1.18#0.36#1.78
make[3]: Entering directory '/home/user/openwrt/feeds/packages/libs/libsndfile'
make[6]: Entering directory '/home/user/openwrt/build_dir/target-x86_64_glibc/libdaemon-0.14/libdaemon'
 /bin/mkdir -p '/home/user/openwrt/build_dir/target-x86_64_glibc/libdaemon-0.14/ipkg-install/usr/lib'
 /bin/bash ../libtool   --mode=install /usr/bin/install -c   libdaemon.la '/home/user/openwrt/build_dir/target-x86_64_glibc/libdaemon-0.14/ipkg-install/usr/lib'
OpenWrt-libtool: install: /usr/bin/install -c .libs/libdaemon.so.0.5.0 /home/user/openwrt/build_dir/target-x86_64_glibc/libdaemon-0.14/ipkg-install/usr/lib/libdaemon.so.0.5.0
OpenWrt-libtool: install: (cd /home/user/openwrt/build_dir/target-x86_64_glibc/libdaemon-0.14/ipkg-install/usr/lib && { ln -s -f libdaemon.so.0.5.0 libdaemon.so.0 || { rm -f libdaemon.so.0 && ln -s libdaemon.so.0.5.0 libdaemon.so.0; }; })
OpenWrt-libtool: install: (cd /home/user/openwrt/build_dir/target-x86_64_glibc/libdaemon-0.14/ipkg-install/usr/lib && { ln -s -f libdaemon.so.0.5.0 libdaemon.so || { rm -f libdaemon.so && ln -s libdaemon.so.0.5.0 libdaemon.so; }; })
OpenWrt-libtool: install: /usr/bin/install -c .libs/libdaemon.lai /home/user/openwrt/build_dir/target-x86_64_glibc/libdaemon-0.14/ipkg-install/usr/lib/libdaemon.la
OpenWrt-libtool: install: /usr/bin/install -c .libs/libdaemon.a /home/user/openwrt/build_dir/target-x86_64_glibc/libdaemon-0.14/ipkg-install/usr/lib/libdaemon.a
OpenWrt-libtool: install: chmod 644 /home/user/openwrt/build_dir/target-x86_64_glibc/libdaemon-0.14/ipkg-install/usr/lib/libdaemon.a
OpenWrt-libtool: install: x86_64-openwrt-linux-gnu-gcc-ranlib /home/user/openwrt/build_dir/target-x86_64_glibc/libdaemon-0.14/ipkg-install/usr/lib/libdaemon.a
OpenWrt-libtool: install: warning: remember to run `libtool --finish /usr/lib'
 /bin/mkdir -p '/home/user/openwrt/build_dir/target-x86_64_glibc/libdaemon-0.14/ipkg-install/usr/include/libdaemon'
 /usr/bin/install -c -m 644 dlog.h dfork.h dsignal.h dnonblock.h dpid.h dexec.h daemon.h '/home/user/openwrt/build_dir/target-x86_64_glibc/libdaemon-0.14/ipkg-install/usr/include/libdaemon'
make[6]: Leaving directory '/home/user/openwrt/build_dir/target-x86_64_glibc/libdaemon-0.14/libdaemon'
make[5]: Leaving directory '/home/user/openwrt/build_dir/target-x86_64_glibc/libdaemon-0.14/libdaemon'
Making install in doc
make[5]: Entering directory '/home/user/openwrt/build_dir/target-x86_64_glibc/libdaemon-0.14/doc'
make[6]: Entering directory '/home/user/openwrt/build_dir/target-x86_64_glibc/libdaemon-0.14/doc'
make[6]: Nothing to be done for 'install-exec-am'.
 /bin/mkdir -p '/home/user/openwrt/build_dir/target-x86_64_glibc/libdaemon-0.14/ipkg-install/usr/share/doc/libdaemon'
 /usr/bin/install -c -m 644 README.html style.css '/home/user/openwrt/build_dir/target-x86_64_glibc/libdaemon-0.14/ipkg-install/usr/share/doc/libdaemon'
make[6]: Leaving directory '/home/user/openwrt/build_dir/target-x86_64_glibc/libdaemon-0.14/doc'
make[5]: Leaving directory '/home/user/openwrt/build_dir/target-x86_64_glibc/libdaemon-0.14/doc'
make[5]: Entering directory '/home/user/openwrt/build_dir/target-x86_64_glibc/libdaemon-0.14'
make[6]: Entering directory '/home/user/openwrt/build_dir/target-x86_64_glibc/libdaemon-0.14'
make[6]: Nothing to be done for 'install-exec-am'.
 /bin/mkdir -p '/home/user/openwrt/build_dir/target-x86_64_glibc/libdaemon-0.14/ipkg-install/usr/lib/pkgconfig'
 /usr/bin/install -c -m 644 pkgconfig/libdaemon.pc '/home/user/openwrt/build_dir/target-x86_64_glibc/libdaemon-0.14/ipkg-install/usr/lib/pkgconfig'
make[6]: Leaving directory '/home/user/openwrt/build_dir/target-x86_64_glibc/libdaemon-0.14'
make[5]: Leaving directory '/home/user/openwrt/build_dir/target-x86_64_glibc/libdaemon-0.14'
make[4]: Leaving directory '/home/user/openwrt/build_dir/target-x86_64_glibc/libdaemon-0.14'
touch /home/user/openwrt/build_dir/target-x86_64_glibc/libdaemon-0.14/.built
rm -rf /home/user/openwrt/tmp/stage-libdaemon
mkdir -p /home/user/openwrt/tmp/stage-libdaemon/host /home/user/openwrt/staging_dir/target-x86_64_glibc/packages /home/user/openwrt/staging_dir/host/packages
install -d -m0755 /home/user/openwrt/tmp/stage-libdaemon/usr/include
cp -fpR /home/user/openwrt/build_dir/target-x86_64_glibc/libdaemon-0.14/ipkg-install/usr/include/libdaemon /home/user/openwrt/tmp/stage-libdaemon/usr/include/
install -d -m0755 /home/user/openwrt/tmp/stage-libdaemon/usr/lib
cp -fpR /home/user/openwrt/build_dir/target-x86_64_glibc/libdaemon-0.14/ipkg-install/usr/lib/libdaemon.a /home/user/openwrt/tmp/stage-libdaemon/usr/lib/
cp -fpR /home/user/openwrt/build_dir/target-x86_64_glibc/libdaemon-0.14/ipkg-install/usr/lib/libdaemon.so* /home/user/openwrt/tmp/stage-libdaemon/usr/lib/
install -d -m0755 /home/user/openwrt/tmp/stage-libdaemon/usr/lib/pkgconfig
cp -fpR /home/user/openwrt/build_dir/target-x86_64_glibc/libdaemon-0.14/ipkg-install/usr/lib/pkgconfig/libdaemon.pc /home/user/openwrt/tmp/stage-libdaemon/usr/lib/pkgconfig/
find /home/user/openwrt/tmp/stage-libdaemon -name '*.la' | xargs -r rm -f; 
if [ -f /home/user/openwrt/staging_dir/target-x86_64_glibc/packages/libdaemon.list ]; then /home/user/openwrt/scripts/clean-package.sh "/home/user/openwrt/staging_dir/target-x86_64_glibc/packages/libdaemon.list" "/home/user/openwrt/staging_dir/target-x86_64_glibc"; fi
if [ -d /home/user/openwrt/tmp/stage-libdaemon ]; then (cd /home/user/openwrt/tmp/stage-libdaemon; find ./ > /home/user/openwrt/tmp/stage-libdaemon.files); 	SHELL= flock /home/user/openwrt/tmp/.staging-dir.flock -c ' mv /home/user/openwrt/tmp/stage-libdaemon.files /home/user/openwrt/staging_dir/target-x86_64_glibc/packages/libdaemon.list && cp -fpR /home/user/openwrt/tmp/stage-libdaemon/* /home/user/openwrt/staging_dir/target-x86_64_glibc/; '; fi
rm -rf /home/user/openwrt/tmp/stage-libdaemon
touch /home/user/openwrt/staging_dir/target-x86_64_glibc/stamp/.libdaemon_installed
make[3]: Leaving directory '/home/user/openwrt/feeds/packages/libs/libdaemon'
time: package/feeds/packages/libdaemon/compile#10.37#2.64#16.28
make[3]: Entering directory '/home/user/openwrt/feeds/packages/libs/tcp_wrappers'
mkdir -p /home/user/openwrt/dl
SHELL= flock /home/user/openwrt/tmp/.tcp_wrappers_7.6.tar.gz.flock -c '  	/home/user/openwrt/scripts/download.pl "/home/user/openwrt/dl" "tcp_wrappers_7.6.tar.gz" "9543d7adedf78a6de0b221ccbbd1952e08b5138717f4ade814039bb489a4315d" "" "ftp://ftp.porcupine.org/pub/security"    '
Can't exec "curl": No such file or directory at /home/user/openwrt/scripts/download.pl line 77.
+ wget --tries=5 --timeout=20 --no-check-certificate --output-document=- ftp://ftp.porcupine.org/pub/security/tcp_wrappers_7.6.tar.gz
--2019-09-20 00:07:34--  ftp://ftp.porcupine.org/pub/security/tcp_wrappers_7.6.tar.gz
           => '-'
Resolving ftp.porcupine.org (ftp.porcupine.org)... 168.100.185.123
Connecting to ftp.porcupine.org (ftp.porcupine.org)|168.100.185.123|:21... mkdir -p /home/user/openwrt/dl
connected.
SHELL= flock /home/user/openwrt/tmp/.libsndfile-2019-04-21-25824cb9.tar.xz.flock -c '  	/home/user/openwrt/scripts/download.pl "/home/user/openwrt/dl" "libsndfile-2019-04-21-25824cb9.tar.xz" "9b3beef70003456ff297ce50ecd5cb1d066ca98f10f6363562431d773b3fcb3d" "" || (  /home/user/openwrt/scripts/dl_github_archive.py --dl-dir="/home/user/openwrt/dl" --url="https://github.com/erikd/libsndfile.git" --version="25824cb914fb3b79e18f31fb861e218c84be7d34" --subdir="libsndfile-2019-04-21-25824cb9" --source="libsndfile-2019-04-21-25824cb9.tar.xz" --hash="9b3beef70003456ff297ce50ecd5cb1d066ca98f10f6363562431d773b3fcb3d" || ( 	echo "Checking out files from the git repository..."; mkdir -p /home/user/openwrt/tmp/dl && cd /home/user/openwrt/tmp/dl && rm -rf libsndfile-2019-04-21-25824cb9 && [ \! -d libsndfile-2019-04-21-25824cb9 ] && git clone  https://github.com/erikd/libsndfile.git libsndfile-2019-04-21-25824cb9 && (cd libsndfile-2019-04-21-25824cb9 && git checkout 25824cb914fb3b79e18f31fb861e218c84be7d34 && git submodule update --init --recursive) && echo "Packing checkout..." && export TAR_TIMESTAMP=`cd libsndfile-2019-04-21-25824cb9 && git log -1 --format='\''@%ct'\''` && rm -rf libsndfile-2019-04-21-25824cb9/.git && 	tar --numeric-owner --owner=0 --group=0 --mode=a-s --sort=name ${TAR_TIMESTAMP:+--mtime="$TAR_TIMESTAMP"} -c libsndfile-2019-04-21-25824cb9 | 	xz -zc -7e > /home/user/openwrt/tmp/dl/libsndfile-2019-04-21-25824cb9.tar.xz && mv /home/user/openwrt/tmp/dl/libsndfile-2019-04-21-25824cb9.tar.xz /home/user/openwrt/dl/ && rm -rf libsndfile-2019-04-21-25824cb9; );  )    '
Logging in as anonymous ... Can't exec "curl": No such file or directory at /home/user/openwrt/scripts/download.pl line 77.
+ wget --tries=5 --timeout=20 --no-check-certificate --output-document=- https://sources.openwrt.org/libsndfile-2019-04-21-25824cb9.tar.xz
Logged in!
==> SYST ... --2019-09-20 00:07:34--  https://sources.openwrt.org/libsndfile-2019-04-21-25824cb9.tar.xz
done.    ==> PWD ... done.
==> TYPE I ... Resolving sources.openwrt.org (sources.openwrt.org)... done.  ==> CWD (1) /pub/security ... done.
==> SIZE tcp_wrappers_7.6.tar.gz ... 99438
==> PASV ... done.    ==> RETR tcp_wrappers_7.6.tar.gz ... 148.251.151.136, 2a01:4f8:210:5087::2
Connecting to sources.openwrt.org (sources.openwrt.org)|148.251.151.136|:443... done.
Length: 99438 (97K) (unauthoritative)


tcp_wrappers_7.6.ta   0%[                    ]       0  --.-KB/s               
tcp_wrappers_7.6.ta 100%[===================>]  97.11K  --.-KB/s    in 0.02s   

2019-09-20 00:07:34 (4.75 MB/s) - written to stdout [99438]

touch /home/user/openwrt/build_dir/target-x86_64_glibc/tcp_wrappers_7.6/.prepared_cd0b90193a421766049738eb1d00a469_6664517399ebbbc92a37c5bb081b5c53_check
. /home/user/openwrt/include/shell.sh; gzip -dc /home/user/openwrt/dl/tcp_wrappers_7.6.tar.gz | tar -C /home/user/openwrt/build_dir/target-x86_64_glibc/tcp_wrappers_7.6/.. -xf -
[ ! -d ./src/ ] || cp -fpR ./src/. /home/user/openwrt/build_dir/target-x86_64_glibc/tcp_wrappers_7.6

Applying ./patches/001-debian_subset.patch using plaintext: 
File hosts_access.c is read-only; trying to patch anyway
patching file hosts_access.c
connected.
File tcpd.h is read-only; trying to patch anyway
patching file tcpd.h
File Makefile is read-only; trying to patch anyway
patching file Makefile
File hosts_access.5 is read-only; trying to patch anyway
patching file hosts_access.5
File rfc931.c is read-only; trying to patch anyway
patching file rfc931.c
File tcpd.8 is read-only; trying to patch anyway
patching file tcpd.8
File hosts_access.3 is read-only; trying to patch anyway
patching file hosts_access.3
File options.c is read-only; trying to patch anyway
patching file options.c
File fix_options.c is read-only; trying to patch anyway
patching file fix_options.c
File workarounds.c is read-only; trying to patch anyway
patching file workarounds.c
File socket.c is read-only; trying to patch anyway
patching file socket.c
File safe_finger.c is read-only; trying to patch anyway
patching file safe_finger.c
File hosts_options.5 is read-only; trying to patch anyway
patching file hosts_options.5
File tcpdchk.c is read-only; trying to patch anyway
patching file tcpdchk.c
File percent_m.c is read-only; trying to patch anyway
patching file percent_m.c
File scaffold.c is read-only; trying to patch anyway
patching file scaffold.c
patching file weak_symbols.c

Applying ./patches/002-opt_cflags.patch using plaintext: 
File Makefile is read-only; trying to patch anyway
patching file Makefile

Applying ./patches/003-scaffold_malloc.patch using plaintext: 
File scaffold.c is read-only; trying to patch anyway
patching file scaffold.c

Applying ./patches/004-ipv4_prefix.patch using plaintext: 
File hosts_access.5 is read-only; trying to patch anyway
patching file hosts_access.5
File tcpd.h is read-only; trying to patch anyway
patching file tcpd.h
File misc.c is read-only; trying to patch anyway
patching file misc.c
File hosts_access.c is read-only; trying to patch anyway
patching file hosts_access.c

Applying ./patches/005-no--lnsl-on-musl.patch using plaintext: 
File Makefile is read-only; trying to patch anyway
patching file Makefile

Applying ./patches/006-compilation-warnings.patch using plaintext: 
File clean_exit.c is read-only; trying to patch anyway
patching file clean_exit.c
File diag.c is read-only; trying to patch anyway
patching file diag.c
File eval.c is read-only; trying to patch anyway
patching file eval.c
File fakelog.c is read-only; trying to patch anyway
patching file fakelog.c
File fix_options.c is read-only; trying to patch anyway
patching file fix_options.c
File fromhost.c is read-only; trying to patch anyway
patching file fromhost.c
File hosts_access.c is read-only; trying to patch anyway
patching file hosts_access.c
File hosts_ctl.c is read-only; trying to patch anyway
patching file hosts_ctl.c
File inetcf.c is read-only; trying to patch anyway
patching file inetcf.c
File misc.c is read-only; trying to patch anyway
patching file misc.c
File myvsyslog.c is read-only; trying to patch anyway
patching file myvsyslog.c
File options.c is read-only; trying to patch anyway
patching file options.c
File patchlevel.h is read-only; trying to patch anyway
patching file patchlevel.h
File percent_m.c is read-only; trying to patch anyway
patching file percent_m.c
File percent_x.c is read-only; trying to patch anyway
patching file percent_x.c
File refuse.c is read-only; trying to patch anyway
patching file refuse.c
File rfc931.c is read-only; trying to patch anyway
patching file rfc931.c
File safe_finger.c is read-only; trying to patch anyway
patching file safe_finger.c
File scaffold.c is read-only; trying to patch anyway
patching file scaffold.c
File shell_cmd.c is read-only; trying to patch anyway
patching file shell_cmd.c
File socket.c is read-only; trying to patch anyway
patching file socket.c
File tcpd.c is read-only; trying to patch anyway
patching file tcpd.c
File tcpd.h is read-only; trying to patch anyway
patching file tcpd.h
File tcpdchk.c is read-only; trying to patch anyway
patching file tcpdchk.c
File tcpdmatch.c is read-only; trying to patch anyway
patching file tcpdmatch.c
File tli.c is read-only; trying to patch anyway
patching file tli.c
File try-from.c is read-only; trying to patch anyway
patching file try-from.c
File update.c is read-only; trying to patch anyway
patching file update.c
touch /home/user/openwrt/build_dir/target-x86_64_glibc/tcp_wrappers_7.6/.prepared_cd0b90193a421766049738eb1d00a469_6664517399ebbbc92a37c5bb081b5c53
rm -f /home/user/openwrt/build_dir/target-x86_64_glibc/tcp_wrappers_7.6/.configured_*
rm -f /home/user/openwrt/staging_dir/target-x86_64_glibc/stamp/.tcp_wrappers_installed
(cd /home/user/openwrt/build_dir/target-x86_64_glibc/tcp_wrappers_7.6/./; if [ -x ./configure ]; then find /home/user/openwrt/build_dir/target-x86_64_glibc/tcp_wrappers_7.6/ -name config.guess | xargs -r chmod u+w; find /home/user/openwrt/build_dir/target-x86_64_glibc/tcp_wrappers_7.6/ -name config.guess | xargs -r -n1 cp --remove-destination /home/user/openwrt/scripts/config.guess; find /home/user/openwrt/build_dir/target-x86_64_glibc/tcp_wrappers_7.6/ -name config.sub | xargs -r chmod u+w; find /home/user/openwrt/build_dir/target-x86_64_glibc/tcp_wrappers_7.6/ -name config.sub | xargs -r -n1 cp --remove-destination /home/user/openwrt/scripts/config.sub; AR="x86_64-openwrt-linux-gnu-gcc-ar" AS="x86_64-openwrt-linux-gnu-gcc -c -Os -pipe -fno-caller-saves -fno-plt -fhonour-copts -Wno-error=unused-but-set-variable -Wno-error=unused-result -iremap/home/user/openwrt/build_dir/target-x86_64_glibc/tcp_wrappers_7.6:tcp_wrappers_7.6 -Wformat -Werror=format-security -D_FORTIFY_SOURCE=1 -Wl,-z,now -Wl,-z,relro -fpic -Wall" LD=x86_64-openwrt-linux-gnu-ld NM="x86_64-openwrt-linux-gnu-gcc-nm" CC="x86_64-openwrt-linux-gnu-gcc" GCC="x86_64-openwrt-linux-gnu-gcc" CXX="x86_64-openwrt-linux-gnu-g++" RANLIB="x86_64-openwrt-linux-gnu-gcc-ranlib" STRIP=x86_64-openwrt-linux-gnu-strip OBJCOPY=x86_64-openwrt-linux-gnu-objcopy OBJDUMP=x86_64-openwrt-linux-gnu-objdump SIZE=x86_64-openwrt-linux-gnu-size CFLAGS="-Os -pipe -fno-caller-saves -fno-plt -fhonour-copts -Wno-error=unused-but-set-variable -Wno-error=unused-result -iremap/home/user/openwrt/build_dir/target-x86_64_glibc/tcp_wrappers_7.6:tcp_wrappers_7.6 -Wformat -Werror=format-security -D_FORTIFY_SOURCE=1 -Wl,-z,now -Wl,-z,relro -fpic -Wall " CXXFLAGS="-Os -pipe -fno-caller-saves -fno-plt -fhonour-copts -Wno-error=unused-but-set-variable -Wno-error=unused-result -iremap/home/user/openwrt/build_dir/target-x86_64_glibc/tcp_wrappers_7.6:tcp_wrappers_7.6 -Wformat -Werror=format-security -D_FORTIFY_SOURCE=1 -Wl,-z,now -Wl,-z,relro -fpic -Wall " CPPFLAGS="-I/home/user/openwrt/staging_dir/target-x86_64_glibc/usr/include -I/home/user/openwrt/staging_dir/target-x86_64_glibc/include -I/home/user/openwrt/staging_dir/toolchain-x86_64_gcc-7.4.0_glibc/usr/include -I/home/user/openwrt/staging_dir/toolchain-x86_64_gcc-7.4.0_glibc/include " LDFLAGS="-L/home/user/openwrt/staging_dir/target-x86_64_glibc/usr/lib -L/home/user/openwrt/staging_dir/target-x86_64_glibc/lib -L/home/user/openwrt/staging_dir/toolchain-x86_64_gcc-7.4.0_glibc/usr/lib -L/home/user/openwrt/staging_dir/toolchain-x86_64_gcc-7.4.0_glibc/lib -znow -zrelro "   ./configure --target=x86_64-openwrt-linux --host=x86_64-openwrt-linux --build=x86_64-pc-linux-gnu --program-prefix="" --program-suffix="" --prefix=/usr --exec-prefix=/usr --bindir=/usr/bin --sbindir=/usr/sbin --libexecdir=/usr/lib --sysconfdir=/etc --datadir=/usr/share --localstatedir=/var --mandir=/usr/man --infodir=/usr/info --disable-nls  ; fi; )
touch /home/user/openwrt/build_dir/target-x86_64_glibc/tcp_wrappers_7.6/.configured_68b329da9893e34099c7d8ad5cb9c940
rm -f /home/user/openwrt/build_dir/target-x86_64_glibc/tcp_wrappers_7.6/.built
touch /home/user/openwrt/build_dir/target-x86_64_glibc/tcp_wrappers_7.6/.built_check
make -C /home/user/openwrt/build_dir/target-x86_64_glibc/tcp_wrappers_7.6 AR="x86_64-openwrt-linux-gnu-gcc-ar" AS="x86_64-openwrt-linux-gnu-gcc -c -Os -pipe -fno-caller-saves -fno-plt -fhonour-copts -Wno-error=unused-but-set-variable -Wno-error=unused-result -iremap/home/user/openwrt/build_dir/target-x86_64_glibc/tcp_wrappers_7.6:tcp_wrappers_7.6 -Wformat -Werror=format-security -D_FORTIFY_SOURCE=1 -Wl,-z,now -Wl,-z,relro -fpic -Wall" LD=x86_64-openwrt-linux-gnu-ld NM="x86_64-openwrt-linux-gnu-gcc-nm" CC="x86_64-openwrt-linux-gnu-gcc" GCC="x86_64-openwrt-linux-gnu-gcc" CXX="x86_64-openwrt-linux-gnu-g++" RANLIB="x86_64-openwrt-linux-gnu-gcc-ranlib" STRIP=x86_64-openwrt-linux-gnu-strip OBJCOPY=x86_64-openwrt-linux-gnu-objcopy OBJDUMP=x86_64-openwrt-linux-gnu-objdump SIZE=x86_64-openwrt-linux-gnu-size OPT_CFLAGS="-Os -pipe -fno-caller-saves -fno-plt -fhonour-copts -Wno-error=unused-but-set-variable -Wno-error=unused-result -iremap/home/user/openwrt/build_dir/target-x86_64_glibc/tcp_wrappers_7.6:tcp_wrappers_7.6 -Wformat -Werror=format-security -D_FORTIFY_SOURCE=1 -Wl,-z,now -Wl,-z,relro -fpic -Wall" LIBS=-lnsl NETGROUP= VSYSLOG= BUGS= EXTRA_CFLAGS="-DSYS_ERRLIST_DEFINED -DHAVE_STRERROR -DHAVE_WEAKSYMS -D_REENTRANT -DINET6=1 -Dss_family=__ss_family -Dss_len=__ss_len" FACILITY=LOG_DAEMON SEVERITY=LOG_INFO REAL_DAEMON_DIR=/usr/sbin STYLE="-DPROCESS_OPTIONS" tidy all
make[4]: Entering directory '/home/user/openwrt/build_dir/target-x86_64_glibc/tcp_wrappers_7.6'
rm -f tcpd miscd safe_finger tcpdmatch tcpdchk try-from *.[oa] core \
cflags libwrap*.so*
rm -rf shared
chmod -R a+r .
chmod 755 .
x86_64-openwrt-linux-gnu-gcc -Os -pipe -fno-caller-saves -fno-plt -fhonour-copts -Wno-error=unused-but-set-variable -Wno-error=unused-result -iremap/home/user/openwrt/build_dir/target-x86_64_glibc/tcp_wrappers_7.6:tcp_wrappers_7.6 -Wformat -Werror=format-security -D_FORTIFY_SOURCE=1 -Wl,-z,now -Wl,-z,relro -fpic -Wall -DFACILITY=LOG_DAEMON -DHOSTS_ACCESS      -DDAEMON_UMASK=022 -DREAL_DAEMON_DIR=\"/usr/sbin\" -DPROCESS_OPTIONS -DKILL_IP_OPTIONS -DSEVERITY=LOG_INFO -DRFC931_TIMEOUT=10  -DHOSTS_DENY=\"/etc/hosts.deny\" -DHOSTS_ALLOW=\"/etc/hosts.allow\"   -DSYS_ERRLIST_DEFINED -DHAVE_STRERROR -DHAVE_WEAKSYMS -D_REENTRANT -DINET6=1 -Dss_family=__ss_family -Dss_len=__ss_len    -o tcpd.o -c tcpd.c
x86_64-openwrt-linux-gnu-gcc -Os -pipe -fno-caller-saves -fno-plt -fhonour-copts -Wno-error=unused-but-set-variable -Wno-error=unused-result -iremap/home/user/openwrt/build_dir/target-x86_64_glibc/tcp_wrappers_7.6:tcp_wrappers_7.6 -Wformat -Werror=format-security -D_FORTIFY_SOURCE=1 -Wl,-z,now -Wl,-z,relro -fpic -Wall -DFACILITY=LOG_DAEMON -DHOSTS_ACCESS      -DDAEMON_UMASK=022 -DREAL_DAEMON_DIR=\"/usr/sbin\" -DPROCESS_OPTIONS -DKILL_IP_OPTIONS -DSEVERITY=LOG_INFO -DRFC931_TIMEOUT=10  -DHOSTS_DENY=\"/etc/hosts.deny\" -DHOSTS_ALLOW=\"/etc/hosts.allow\"   -DSYS_ERRLIST_DEFINED -DHAVE_STRERROR -DHAVE_WEAKSYMS -D_REENTRANT -DINET6=1 -Dss_family=__ss_family -Dss_len=__ss_len    -fPIC -shared -D_REENTRANT -c hosts_access.c -o shared/hosts_access.o
HTTP request sent, awaiting response... x86_64-openwrt-linux-gnu-gcc -Os -pipe -fno-caller-saves -fno-plt -fhonour-copts -Wno-error=unused-but-set-variable -Wno-error=unused-result -iremap/home/user/openwrt/build_dir/target-x86_64_glibc/tcp_wrappers_7.6:tcp_wrappers_7.6 -Wformat -Werror=format-security -D_FORTIFY_SOURCE=1 -Wl,-z,now -Wl,-z,relro -fpic -Wall -DFACILITY=LOG_DAEMON -DHOSTS_ACCESS      -DDAEMON_UMASK=022 -DREAL_DAEMON_DIR=\"/usr/sbin\" -DPROCESS_OPTIONS -DKILL_IP_OPTIONS -DSEVERITY=LOG_INFO -DRFC931_TIMEOUT=10  -DHOSTS_DENY=\"/etc/hosts.deny\" -DHOSTS_ALLOW=\"/etc/hosts.allow\"   -DSYS_ERRLIST_DEFINED -DHAVE_STRERROR -DHAVE_WEAKSYMS -D_REENTRANT -DINET6=1 -Dss_family=__ss_family -Dss_len=__ss_len    -fPIC -shared -D_REENTRANT -c options.c -o shared/options.o
options.c: In function 'banners_option':
options.c:232:6: warning: ignoring return value of 'write', declared with attribute warn_unused_result [-Wunused-result]
      write(request->fd, "", 1);
      ^~~~~~~~~~~~~~~~~~~~~~~~~
options.c:238:6: warning: ignoring return value of 'write', declared with attribute warn_unused_result [-Wunused-result]
      write(request->fd, obuf, strlen(obuf));
      ^~~~~~~~~~~~~~~~~~~~~~~~~~~~~~~~~~~~~~
x86_64-openwrt-linux-gnu-gcc -Os -pipe -fno-caller-saves -fno-plt -fhonour-copts -Wno-error=unused-but-set-variable -Wno-error=unused-result -iremap/home/user/openwrt/build_dir/target-x86_64_glibc/tcp_wrappers_7.6:tcp_wrappers_7.6 -Wformat -Werror=format-security -D_FORTIFY_SOURCE=1 -Wl,-z,now -Wl,-z,relro -fpic -Wall -DFACILITY=LOG_DAEMON -DHOSTS_ACCESS      -DDAEMON_UMASK=022 -DREAL_DAEMON_DIR=\"/usr/sbin\" -DPROCESS_OPTIONS -DKILL_IP_OPTIONS -DSEVERITY=LOG_INFO -DRFC931_TIMEOUT=10  -DHOSTS_DENY=\"/etc/hosts.deny\" -DHOSTS_ALLOW=\"/etc/hosts.allow\"   -DSYS_ERRLIST_DEFINED -DHAVE_STRERROR -DHAVE_WEAKSYMS -D_REENTRANT -DINET6=1 -Dss_family=__ss_family -Dss_len=__ss_len    -fPIC -shared -D_REENTRANT -c shell_cmd.c -o shared/shell_cmd.o
200 OK
Length: 517312 (505K) [application/octet-stream]
Saving to: 'STDOUT'


-                     0%[                    ]       0  --.-KB/s               x86_64-openwrt-linux-gnu-gcc -Os -pipe -fno-caller-saves -fno-plt -fhonour-copts -Wno-error=unused-but-set-variable -Wno-error=unused-result -iremap/home/user/openwrt/build_dir/target-x86_64_glibc/tcp_wrappers_7.6:tcp_wrappers_7.6 -Wformat -Werror=format-security -D_FORTIFY_SOURCE=1 -Wl,-z,now -Wl,-z,relro -fpic -Wall -DFACILITY=LOG_DAEMON -DHOSTS_ACCESS      -DDAEMON_UMASK=022 -DREAL_DAEMON_DIR=\"/usr/sbin\" -DPROCESS_OPTIONS -DKILL_IP_OPTIONS -DSEVERITY=LOG_INFO -DRFC931_TIMEOUT=10  -DHOSTS_DENY=\"/etc/hosts.deny\" -DHOSTS_ALLOW=\"/etc/hosts.allow\"   -DSYS_ERRLIST_DEFINED -DHAVE_STRERROR -DHAVE_WEAKSYMS -D_REENTRANT -DINET6=1 -Dss_family=__ss_family -Dss_len=__ss_len    -fPIC -shared -D_REENTRANT -c rfc931.c -o shared/rfc931.o
x86_64-openwrt-linux-gnu-gcc -Os -pipe -fno-caller-saves -fno-plt -fhonour-copts -Wno-error=unused-but-set-variable -Wno-error=unused-result -iremap/home/user/openwrt/build_dir/target-x86_64_glibc/tcp_wrappers_7.6:tcp_wrappers_7.6 -Wformat -Werror=format-security -D_FORTIFY_SOURCE=1 -Wl,-z,now -Wl,-z,relro -fpic -Wall -DFACILITY=LOG_DAEMON -DHOSTS_ACCESS      -DDAEMON_UMASK=022 -DREAL_DAEMON_DIR=\"/usr/sbin\" -DPROCESS_OPTIONS -DKILL_IP_OPTIONS -DSEVERITY=LOG_INFO -DRFC931_TIMEOUT=10  -DHOSTS_DENY=\"/etc/hosts.deny\" -DHOSTS_ALLOW=\"/etc/hosts.allow\"   -DSYS_ERRLIST_DEFINED -DHAVE_STRERROR -DHAVE_WEAKSYMS -D_REENTRANT -DINET6=1 -Dss_family=__ss_family -Dss_len=__ss_len    -fPIC -shared -D_REENTRANT -c eval.c -o shared/eval.o
x86_64-openwrt-linux-gnu-gcc -Os -pipe -fno-caller-saves -fno-plt -fhonour-copts -Wno-error=unused-but-set-variable -Wno-error=unused-result -iremap/home/user/openwrt/build_dir/target-x86_64_glibc/tcp_wrappers_7.6:tcp_wrappers_7.6 -Wformat -Werror=format-security -D_FORTIFY_SOURCE=1 -Wl,-z,now -Wl,-z,relro -fpic -Wall -DFACILITY=LOG_DAEMON -DHOSTS_ACCESS      -DDAEMON_UMASK=022 -DREAL_DAEMON_DIR=\"/usr/sbin\" -DPROCESS_OPTIONS -DKILL_IP_OPTIONS -DSEVERITY=LOG_INFO -DRFC931_TIMEOUT=10  -DHOSTS_DENY=\"/etc/hosts.deny\" -DHOSTS_ALLOW=\"/etc/hosts.allow\"   -DSYS_ERRLIST_DEFINED -DHAVE_STRERROR -DHAVE_WEAKSYMS -D_REENTRANT -DINET6=1 -Dss_family=__ss_family -Dss_len=__ss_len    -fPIC -shared -D_REENTRANT -c hosts_ctl.c -o shared/hosts_ctl.o
x86_64-openwrt-linux-gnu-gcc -Os -pipe -fno-caller-saves -fno-plt -fhonour-copts -Wno-error=unused-but-set-variable -Wno-error=unused-result -iremap/home/user/openwrt/build_dir/target-x86_64_glibc/tcp_wrappers_7.6:tcp_wrappers_7.6 -Wformat -Werror=format-security -D_FORTIFY_SOURCE=1 -Wl,-z,now -Wl,-z,relro -fpic -Wall -DFACILITY=LOG_DAEMON -DHOSTS_ACCESS      -DDAEMON_UMASK=022 -DREAL_DAEMON_DIR=\"/usr/sbin\" -DPROCESS_OPTIONS -DKILL_IP_OPTIONS -DSEVERITY=LOG_INFO -DRFC931_TIMEOUT=10  -DHOSTS_DENY=\"/etc/hosts.deny\" -DHOSTS_ALLOW=\"/etc/hosts.allow\"   -DSYS_ERRLIST_DEFINED -DHAVE_STRERROR -DHAVE_WEAKSYMS -D_REENTRANT -DINET6=1 -Dss_family=__ss_family -Dss_len=__ss_len    -fPIC -shared -D_REENTRANT -c refuse.c -o shared/refuse.o

-                    39%[======>             ] 199.75K   871KB/s               x86_64-openwrt-linux-gnu-gcc -Os -pipe -fno-caller-saves -fno-plt -fhonour-copts -Wno-error=unused-but-set-variable -Wno-error=unused-result -iremap/home/user/openwrt/build_dir/target-x86_64_glibc/tcp_wrappers_7.6:tcp_wrappers_7.6 -Wformat -Werror=format-security -D_FORTIFY_SOURCE=1 -Wl,-z,now -Wl,-z,relro -fpic -Wall -DFACILITY=LOG_DAEMON -DHOSTS_ACCESS      -DDAEMON_UMASK=022 -DREAL_DAEMON_DIR=\"/usr/sbin\" -DPROCESS_OPTIONS -DKILL_IP_OPTIONS -DSEVERITY=LOG_INFO -DRFC931_TIMEOUT=10  -DHOSTS_DENY=\"/etc/hosts.deny\" -DHOSTS_ALLOW=\"/etc/hosts.allow\"   -DSYS_ERRLIST_DEFINED -DHAVE_STRERROR -DHAVE_WEAKSYMS -D_REENTRANT -DINET6=1 -Dss_family=__ss_family -Dss_len=__ss_len    -fPIC -shared -D_REENTRANT -c percent_x.c -o shared/percent_x.o
x86_64-openwrt-linux-gnu-gcc -Os -pipe -fno-caller-saves -fno-plt -fhonour-copts -Wno-error=unused-but-set-variable -Wno-error=unused-result -iremap/home/user/openwrt/build_dir/target-x86_64_glibc/tcp_wrappers_7.6:tcp_wrappers_7.6 -Wformat -Werror=format-security -D_FORTIFY_SOURCE=1 -Wl,-z,now -Wl,-z,relro -fpic -Wall -DFACILITY=LOG_DAEMON -DHOSTS_ACCESS      -DDAEMON_UMASK=022 -DREAL_DAEMON_DIR=\"/usr/sbin\" -DPROCESS_OPTIONS -DKILL_IP_OPTIONS -DSEVERITY=LOG_INFO -DRFC931_TIMEOUT=10  -DHOSTS_DENY=\"/etc/hosts.deny\" -DHOSTS_ALLOW=\"/etc/hosts.allow\"   -DSYS_ERRLIST_DEFINED -DHAVE_STRERROR -DHAVE_WEAKSYMS -D_REENTRANT -DINET6=1 -Dss_family=__ss_family -Dss_len=__ss_len    -fPIC -shared -D_REENTRANT -c clean_exit.c -o shared/clean_exit.o
x86_64-openwrt-linux-gnu-gcc -Os -pipe -fno-caller-saves -fno-plt -fhonour-copts -Wno-error=unused-but-set-variable -Wno-error=unused-result -iremap/home/user/openwrt/build_dir/target-x86_64_glibc/tcp_wrappers_7.6:tcp_wrappers_7.6 -Wformat -Werror=format-security -D_FORTIFY_SOURCE=1 -Wl,-z,now -Wl,-z,relro -fpic -Wall -DFACILITY=LOG_DAEMON -DHOSTS_ACCESS      -DDAEMON_UMASK=022 -DREAL_DAEMON_DIR=\"/usr/sbin\" -DPROCESS_OPTIONS -DKILL_IP_OPTIONS -DSEVERITY=LOG_INFO -DRFC931_TIMEOUT=10  -DHOSTS_DENY=\"/etc/hosts.deny\" -DHOSTS_ALLOW=\"/etc/hosts.allow\"   -DSYS_ERRLIST_DEFINED -DHAVE_STRERROR -DHAVE_WEAKSYMS -D_REENTRANT -DINET6=1 -Dss_family=__ss_family -Dss_len=__ss_len    -fPIC -shared -D_REENTRANT -c fromhost.c -o shared/fromhost.o
x86_64-openwrt-linux-gnu-gcc -Os -pipe -fno-caller-saves -fno-plt -fhonour-copts -Wno-error=unused-but-set-variable -Wno-error=unused-result -iremap/home/user/openwrt/build_dir/target-x86_64_glibc/tcp_wrappers_7.6:tcp_wrappers_7.6 -Wformat -Werror=format-security -D_FORTIFY_SOURCE=1 -Wl,-z,now -Wl,-z,relro -fpic -Wall -DFACILITY=LOG_DAEMON -DHOSTS_ACCESS      -DDAEMON_UMASK=022 -DREAL_DAEMON_DIR=\"/usr/sbin\" -DPROCESS_OPTIONS -DKILL_IP_OPTIONS -DSEVERITY=LOG_INFO -DRFC931_TIMEOUT=10  -DHOSTS_DENY=\"/etc/hosts.deny\" -DHOSTS_ALLOW=\"/etc/hosts.allow\"   -DSYS_ERRLIST_DEFINED -DHAVE_STRERROR -DHAVE_WEAKSYMS -D_REENTRANT -DINET6=1 -Dss_family=__ss_family -Dss_len=__ss_len    -fPIC -shared -D_REENTRANT -c fix_options.c -o shared/fix_options.o

-                   100%[===================>] 505.19K  1.33MB/s    in 0.4s    

2019-09-20 00:07:35 (1.33 MB/s) - written to stdout [517312/517312]

touch /home/user/openwrt/build_dir/target-x86_64_glibc/libsndfile-2019-04-21-25824cb9/.prepared_417bfb0627eff5f2f99fdf8c208ceaad_6664517399ebbbc92a37c5bb081b5c53_check
. /home/user/openwrt/include/shell.sh; xzcat /home/user/openwrt/dl/libsndfile-2019-04-21-25824cb9.tar.xz | tar -C /home/user/openwrt/build_dir/target-x86_64_glibc/libsndfile-2019-04-21-25824cb9/.. -xf -
fix_options.c: In function 'fix_options':
fix_options.c:55:62: warning: passing argument 5 of 'getsockopt' from incompatible pointer type [-Wincompatible-pointer-types]
     if (getsockopt(fd, ipproto, IP_OPTIONS, (char *) optbuf, &optsize) == 0
                                                              ^
In file included from /home/user/openwrt/staging_dir/toolchain-x86_64_gcc-7.4.0_glibc/include/netinet/in.h:23:0,
                 from fix_options.c:14:
/home/user/openwrt/staging_dir/toolchain-x86_64_gcc-7.4.0_glibc/include/sys/socket.h:208:12: note: expected 'socklen_t * restrict {aka unsigned int * restrict}' but argument is of type 'size_t * {aka long unsigned int *}'
 extern int getsockopt (int __fd, int __level, int __optname,
            ^~~~~~~~~~
x86_64-openwrt-linux-gnu-gcc -Os -pipe -fno-caller-saves -fno-plt -fhonour-copts -Wno-error=unused-but-set-variable -Wno-error=unused-result -iremap/home/user/openwrt/build_dir/target-x86_64_glibc/tcp_wrappers_7.6:tcp_wrappers_7.6 -Wformat -Werror=format-security -D_FORTIFY_SOURCE=1 -Wl,-z,now -Wl,-z,relro -fpic -Wall -DFACILITY=LOG_DAEMON -DHOSTS_ACCESS      -DDAEMON_UMASK=022 -DREAL_DAEMON_DIR=\"/usr/sbin\" -DPROCESS_OPTIONS -DKILL_IP_OPTIONS -DSEVERITY=LOG_INFO -DRFC931_TIMEOUT=10  -DHOSTS_DENY=\"/etc/hosts.deny\" -DHOSTS_ALLOW=\"/etc/hosts.allow\"   -DSYS_ERRLIST_DEFINED -DHAVE_STRERROR -DHAVE_WEAKSYMS -D_REENTRANT -DINET6=1 -Dss_family=__ss_family -Dss_len=__ss_len    -fPIC -shared -D_REENTRANT -c socket.c -o shared/socket.o
[ ! -d ./src/ ] || cp -fpR ./src/. /home/user/openwrt/build_dir/target-x86_64_glibc/libsndfile-2019-04-21-25824cb9
touch /home/user/openwrt/build_dir/target-x86_64_glibc/libsndfile-2019-04-21-25824cb9/.prepared_417bfb0627eff5f2f99fdf8c208ceaad_6664517399ebbbc92a37c5bb081b5c53
rm -f /home/user/openwrt/build_dir/target-x86_64_glibc/libsndfile-2019-04-21-25824cb9/.configured_*
rm -f /home/user/openwrt/staging_dir/target-x86_64_glibc/stamp/.libsndfile_installed
mkdir -p /home/user/openwrt/build_dir/target-x86_64_glibc/libsndfile-2019-04-21-25824cb9
(cd /home/user/openwrt/build_dir/target-x86_64_glibc/libsndfile-2019-04-21-25824cb9; CFLAGS="-Os -pipe -fno-caller-saves -fno-plt -fhonour-copts -Wno-error=unused-but-set-variable -Wno-error=unused-result -iremap/home/user/openwrt/build_dir/target-x86_64_glibc/libsndfile-2019-04-21-25824cb9:libsndfile-2019-04-21-25824cb9 -Wformat -Werror=format-security -D_FORTIFY_SOURCE=1 -Wl,-z,now -Wl,-z,relro -fpic " CXXFLAGS="-Os -pipe -fno-caller-saves -fno-plt -fhonour-copts -Wno-error=unused-but-set-variable -Wno-error=unused-result -iremap/home/user/openwrt/build_dir/target-x86_64_glibc/libsndfile-2019-04-21-25824cb9:libsndfile-2019-04-21-25824cb9 -Wformat -Werror=format-security -D_FORTIFY_SOURCE=1 -Wl,-z,now -Wl,-z,relro -fpic " LDFLAGS="-L/home/user/openwrt/staging_dir/target-x86_64_glibc/usr/lib -L/home/user/openwrt/staging_dir/target-x86_64_glibc/lib -L/home/user/openwrt/staging_dir/toolchain-x86_64_gcc-7.4.0_glibc/usr/lib -L/home/user/openwrt/staging_dir/toolchain-x86_64_gcc-7.4.0_glibc/lib -znow -zrelro " cmake -DCMAKE_SYSTEM_NAME=Linux -DCMAKE_SYSTEM_VERSION=1 -DCMAKE_SYSTEM_PROCESSOR=x86_64 -DCMAKE_BUILD_TYPE=Release -DCMAKE_C_FLAGS_RELEASE="-DNDEBUG" -DCMAKE_CXX_FLAGS_RELEASE="-DNDEBUG" -DCMAKE_C_COMPILER="/home/user/openwrt/staging_dir/toolchain-x86_64_gcc-7.4.0_glibc/bin/x86_64-openwrt-linux-gnu-gcc" -DCMAKE_C_COMPILER_ARG1="" -DCMAKE_CXX_COMPILER="/home/user/openwrt/staging_dir/toolchain-x86_64_gcc-7.4.0_glibc/bin/x86_64-openwrt-linux-gnu-g++" -DCMAKE_CXX_COMPILER_ARG1="" -DCMAKE_ASM_COMPILER="/home/user/openwrt/staging_dir/toolchain-x86_64_gcc-7.4.0_glibc/bin/x86_64-openwrt-linux-gnu-gcc" -DCMAKE_ASM_COMPILER_ARG1="" -DCMAKE_EXE_LINKER_FLAGS:STRING="-L/home/user/openwrt/staging_dir/target-x86_64_glibc/usr/lib -L/home/user/openwrt/staging_dir/target-x86_64_glibc/lib -L/home/user/openwrt/staging_dir/toolchain-x86_64_gcc-7.4.0_glibc/usr/lib -L/home/user/openwrt/staging_dir/toolchain-x86_64_gcc-7.4.0_glibc/lib -znow -zrelro" -DCMAKE_MODULE_LINKER_FLAGS:STRING="-L/home/user/openwrt/staging_dir/target-x86_64_glibc/usr/lib -L/home/user/openwrt/staging_dir/target-x86_64_glibc/lib -L/home/user/openwrt/staging_dir/toolchain-x86_64_gcc-7.4.0_glibc/usr/lib -L/home/user/openwrt/staging_dir/toolchain-x86_64_gcc-7.4.0_glibc/lib -znow -zrelro -Wl,-Bsymbolic-functions" -DCMAKE_SHARED_LINKER_FLAGS:STRING="-L/home/user/openwrt/staging_dir/target-x86_64_glibc/usr/lib -L/home/user/openwrt/staging_dir/target-x86_64_glibc/lib -L/home/user/openwrt/staging_dir/toolchain-x86_64_gcc-7.4.0_glibc/usr/lib -L/home/user/openwrt/staging_dir/toolchain-x86_64_gcc-7.4.0_glibc/lib -znow -zrelro -Wl,-Bsymbolic-functions" -DCMAKE_AR="/home/user/openwrt/staging_dir/toolchain-x86_64_gcc-7.4.0_glibc/bin/x86_64-openwrt-linux-gnu-gcc-ar" -DCMAKE_NM="/home/user/openwrt/staging_dir/toolchain-x86_64_gcc-7.4.0_glibc/bin/x86_64-openwrt-linux-gnu-gcc-nm" -DCMAKE_RANLIB="/home/user/openwrt/staging_dir/toolchain-x86_64_gcc-7.4.0_glibc/bin/x86_64-openwrt-linux-gnu-gcc-ranlib" -DCMAKE_FIND_ROOT_PATH="/home/user/openwrt/staging_dir/target-x86_64_glibc/usr;/home/user/openwrt/staging_dir/toolchain-x86_64_gcc-7.4.0_glibc" -DCMAKE_FIND_ROOT_PATH_MODE_PROGRAM=BOTH -DCMAKE_FIND_ROOT_PATH_MODE_LIBRARY=ONLY -DCMAKE_FIND_ROOT_PATH_MODE_INCLUDE=ONLY -DCMAKE_STRIP=: -DCMAKE_INSTALL_PREFIX=/usr -DDL_LIBRARY=/home/user/openwrt/staging_dir/target-x86_64_glibc -DCMAKE_PREFIX_PATH=/home/user/openwrt/staging_dir/target-x86_64_glibc -DCMAKE_SKIP_RPATH=TRUE -DBUILD_SHARED_LIBS:BOOL=ON -DENABLE_EXTERNAL_LIBS:BOOL=FALSE -DBUILD_REGTEST:BOOL=FALSE /home/user/openwrt/build_dir/target-x86_64_glibc/libsndfile-2019-04-21-25824cb9 )
socket.c: In function 'sock_host':
socket.c:99:55: warning: passing argument 3 of 'getpeername' from incompatible pointer type [-Wincompatible-pointer-types]
     if (getpeername(fd, (struct sockaddr *) & client, &len) < 0) {
                                                       ^
In file included from socket.c:26:0:
/home/user/openwrt/staging_dir/toolchain-x86_64_gcc-7.4.0_glibc/include/sys/socket.h:130:12: note: expected 'socklen_t * restrict {aka unsigned int * restrict}' but argument is of type 'size_t * {aka long unsigned int *}'
 extern int getpeername (int __fd, __SOCKADDR_ARG __addr,
            ^~~~~~~~~~~
socket.c:103:38: warning: passing argument 6 of 'recvfrom' from incompatible pointer type [-Wincompatible-pointer-types]
        (struct sockaddr *) & client, &len) < 0) {
                                      ^
In file included from /home/user/openwrt/staging_dir/toolchain-x86_64_gcc-7.4.0_glibc/include/sys/socket.h:269:0,
                 from socket.c:26:
/home/user/openwrt/staging_dir/toolchain-x86_64_gcc-7.4.0_glibc/include/bits/socket2.h:64:1: note: expected 'socklen_t * restrict {aka unsigned int * restrict}' but argument is of type 'size_t * {aka long unsigned int *}'
 recvfrom (int __fd, void *__restrict __buf, size_t __n, int __flags,
 ^~~~~~~~
socket.c:120:55: warning: passing argument 3 of 'getsockname' from incompatible pointer type [-Wincompatible-pointer-types]
     if (getsockname(fd, (struct sockaddr *) & server, &len) < 0) {
                                                       ^
In file included from socket.c:26:0:
/home/user/openwrt/staging_dir/toolchain-x86_64_gcc-7.4.0_glibc/include/sys/socket.h:116:12: note: expected 'socklen_t * restrict {aka unsigned int * restrict}' but argument is of type 'size_t * {aka long unsigned int *}'
 extern int getsockname (int __fd, __SOCKADDR_ARG __addr,
            ^~~~~~~~~~~
socket.c: In function 'sock_sink':
socket.c:242:73: warning: passing argument 6 of 'recvfrom' from incompatible pointer type [-Wincompatible-pointer-types]
     (void) recvfrom(fd, buf, sizeof(buf), 0, (struct sockaddr *) & sin, &size);
                                                                         ^
In file included from /home/user/openwrt/staging_dir/toolchain-x86_64_gcc-7.4.0_glibc/include/sys/socket.h:269:0,
                 from socket.c:26:
/home/user/openwrt/staging_dir/toolchain-x86_64_gcc-7.4.0_glibc/include/bits/socket2.h:64:1: note: expected 'socklen_t * restrict {aka unsigned int * restrict}' but argument is of type 'size_t * {aka long unsigned int *}'
 recvfrom (int __fd, void *__restrict __buf, size_t __n, int __flags,
 ^~~~~~~~
x86_64-openwrt-linux-gnu-gcc -Os -pipe -fno-caller-saves -fno-plt -fhonour-copts -Wno-error=unused-but-set-variable -Wno-error=unused-result -iremap/home/user/openwrt/build_dir/target-x86_64_glibc/tcp_wrappers_7.6:tcp_wrappers_7.6 -Wformat -Werror=format-security -D_FORTIFY_SOURCE=1 -Wl,-z,now -Wl,-z,relro -fpic -Wall -DFACILITY=LOG_DAEMON -DHOSTS_ACCESS      -DDAEMON_UMASK=022 -DREAL_DAEMON_DIR=\"/usr/sbin\" -DPROCESS_OPTIONS -DKILL_IP_OPTIONS -DSEVERITY=LOG_INFO -DRFC931_TIMEOUT=10  -DHOSTS_DENY=\"/etc/hosts.deny\" -DHOSTS_ALLOW=\"/etc/hosts.allow\"   -DSYS_ERRLIST_DEFINED -DHAVE_STRERROR -DHAVE_WEAKSYMS -D_REENTRANT -DINET6=1 -Dss_family=__ss_family -Dss_len=__ss_len    -fPIC -shared -D_REENTRANT -c tli.c -o shared/tli.o
x86_64-openwrt-linux-gnu-gcc -Os -pipe -fno-caller-saves -fno-plt -fhonour-copts -Wno-error=unused-but-set-variable -Wno-error=unused-result -iremap/home/user/openwrt/build_dir/target-x86_64_glibc/tcp_wrappers_7.6:tcp_wrappers_7.6 -Wformat -Werror=format-security -D_FORTIFY_SOURCE=1 -Wl,-z,now -Wl,-z,relro -fpic -Wall -DFACILITY=LOG_DAEMON -DHOSTS_ACCESS      -DDAEMON_UMASK=022 -DREAL_DAEMON_DIR=\"/usr/sbin\" -DPROCESS_OPTIONS -DKILL_IP_OPTIONS -DSEVERITY=LOG_INFO -DRFC931_TIMEOUT=10  -DHOSTS_DENY=\"/etc/hosts.deny\" -DHOSTS_ALLOW=\"/etc/hosts.allow\"   -DSYS_ERRLIST_DEFINED -DHAVE_STRERROR -DHAVE_WEAKSYMS -D_REENTRANT -DINET6=1 -Dss_family=__ss_family -Dss_len=__ss_len    -fPIC -shared -D_REENTRANT -c workarounds.c -o shared/workarounds.o
-- The C compiler identification is GNU 7.4.0
x86_64-openwrt-linux-gnu-gcc -Os -pipe -fno-caller-saves -fno-plt -fhonour-copts -Wno-error=unused-but-set-variable -Wno-error=unused-result -iremap/home/user/openwrt/build_dir/target-x86_64_glibc/tcp_wrappers_7.6:tcp_wrappers_7.6 -Wformat -Werror=format-security -D_FORTIFY_SOURCE=1 -Wl,-z,now -Wl,-z,relro -fpic -Wall -DFACILITY=LOG_DAEMON -DHOSTS_ACCESS      -DDAEMON_UMASK=022 -DREAL_DAEMON_DIR=\"/usr/sbin\" -DPROCESS_OPTIONS -DKILL_IP_OPTIONS -DSEVERITY=LOG_INFO -DRFC931_TIMEOUT=10  -DHOSTS_DENY=\"/etc/hosts.deny\" -DHOSTS_ALLOW=\"/etc/hosts.allow\"   -DSYS_ERRLIST_DEFINED -DHAVE_STRERROR -DHAVE_WEAKSYMS -D_REENTRANT -DINET6=1 -Dss_family=__ss_family -Dss_len=__ss_len    -fPIC -shared -D_REENTRANT -c update.c -o shared/update.o
x86_64-openwrt-linux-gnu-gcc -Os -pipe -fno-caller-saves -fno-plt -fhonour-copts -Wno-error=unused-but-set-variable -Wno-error=unused-result -iremap/home/user/openwrt/build_dir/target-x86_64_glibc/tcp_wrappers_7.6:tcp_wrappers_7.6 -Wformat -Werror=format-security -D_FORTIFY_SOURCE=1 -Wl,-z,now -Wl,-z,relro -fpic -Wall -DFACILITY=LOG_DAEMON -DHOSTS_ACCESS      -DDAEMON_UMASK=022 -DREAL_DAEMON_DIR=\"/usr/sbin\" -DPROCESS_OPTIONS -DKILL_IP_OPTIONS -DSEVERITY=LOG_INFO -DRFC931_TIMEOUT=10  -DHOSTS_DENY=\"/etc/hosts.deny\" -DHOSTS_ALLOW=\"/etc/hosts.allow\"   -DSYS_ERRLIST_DEFINED -DHAVE_STRERROR -DHAVE_WEAKSYMS -D_REENTRANT -DINET6=1 -Dss_family=__ss_family -Dss_len=__ss_len    -fPIC -shared -D_REENTRANT -c misc.c -o shared/misc.o
-- The CXX compiler identification is GNU 7.4.0
-- Check for working C compiler: /home/user/openwrt/staging_dir/toolchain-x86_64_gcc-7.4.0_glibc/bin/x86_64-openwrt-linux-gnu-gcc
x86_64-openwrt-linux-gnu-gcc -Os -pipe -fno-caller-saves -fno-plt -fhonour-copts -Wno-error=unused-but-set-variable -Wno-error=unused-result -iremap/home/user/openwrt/build_dir/target-x86_64_glibc/tcp_wrappers_7.6:tcp_wrappers_7.6 -Wformat -Werror=format-security -D_FORTIFY_SOURCE=1 -Wl,-z,now -Wl,-z,relro -fpic -Wall -DFACILITY=LOG_DAEMON -DHOSTS_ACCESS      -DDAEMON_UMASK=022 -DREAL_DAEMON_DIR=\"/usr/sbin\" -DPROCESS_OPTIONS -DKILL_IP_OPTIONS -DSEVERITY=LOG_INFO -DRFC931_TIMEOUT=10  -DHOSTS_DENY=\"/etc/hosts.deny\" -DHOSTS_ALLOW=\"/etc/hosts.allow\"   -DSYS_ERRLIST_DEFINED -DHAVE_STRERROR -DHAVE_WEAKSYMS -D_REENTRANT -DINET6=1 -Dss_family=__ss_family -Dss_len=__ss_len    -fPIC -shared -D_REENTRANT -c diag.c -o shared/diag.o
-- Check for working C compiler: /home/user/openwrt/staging_dir/toolchain-x86_64_gcc-7.4.0_glibc/bin/x86_64-openwrt-linux-gnu-gcc -- works
-- Detecting C compiler ABI info
x86_64-openwrt-linux-gnu-gcc -Os -pipe -fno-caller-saves -fno-plt -fhonour-copts -Wno-error=unused-but-set-variable -Wno-error=unused-result -iremap/home/user/openwrt/build_dir/target-x86_64_glibc/tcp_wrappers_7.6:tcp_wrappers_7.6 -Wformat -Werror=format-security -D_FORTIFY_SOURCE=1 -Wl,-z,now -Wl,-z,relro -fpic -Wall -DFACILITY=LOG_DAEMON -DHOSTS_ACCESS      -DDAEMON_UMASK=022 -DREAL_DAEMON_DIR=\"/usr/sbin\" -DPROCESS_OPTIONS -DKILL_IP_OPTIONS -DSEVERITY=LOG_INFO -DRFC931_TIMEOUT=10  -DHOSTS_DENY=\"/etc/hosts.deny\" -DHOSTS_ALLOW=\"/etc/hosts.allow\"   -DSYS_ERRLIST_DEFINED -DHAVE_STRERROR -DHAVE_WEAKSYMS -D_REENTRANT -DINET6=1 -Dss_family=__ss_family -Dss_len=__ss_len    -fPIC -shared -D_REENTRANT -c percent_m.c -o shared/percent_m.o
x86_64-openwrt-linux-gnu-gcc -Os -pipe -fno-caller-saves -fno-plt -fhonour-copts -Wno-error=unused-but-set-variable -Wno-error=unused-result -iremap/home/user/openwrt/build_dir/target-x86_64_glibc/tcp_wrappers_7.6:tcp_wrappers_7.6 -Wformat -Werror=format-security -D_FORTIFY_SOURCE=1 -Wl,-z,now -Wl,-z,relro -fpic -Wall -DFACILITY=LOG_DAEMON -DHOSTS_ACCESS      -DDAEMON_UMASK=022 -DREAL_DAEMON_DIR=\"/usr/sbin\" -DPROCESS_OPTIONS -DKILL_IP_OPTIONS -DSEVERITY=LOG_INFO -DRFC931_TIMEOUT=10  -DHOSTS_DENY=\"/etc/hosts.deny\" -DHOSTS_ALLOW=\"/etc/hosts.allow\"   -DSYS_ERRLIST_DEFINED -DHAVE_STRERROR -DHAVE_WEAKSYMS -D_REENTRANT -DINET6=1 -Dss_family=__ss_family -Dss_len=__ss_len    -fPIC -shared -D_REENTRANT -c myvsyslog.c -o shared/myvsyslog.o
-- Detecting C compiler ABI info - done
rm -f shared/libwrap.so.0.7.6
-- Detecting C compile features
x86_64-openwrt-linux-gnu-gcc -o shared/libwrap.so.0.7.6 -shared -Xlinker -soname -Xlinker libwrap.so.0 -lc -lnsl shared/hosts_access.o shared/options.o shared/shell_cmd.o shared/rfc931.o shared/eval.o shared/hosts_ctl.o shared/refuse.o shared/percent_x.o shared/clean_exit.o shared/fromhost.o shared/fix_options.o shared/socket.o shared/tli.o shared/workarounds.o shared/update.o shared/misc.o shared/diag.o shared/percent_m.o shared/myvsyslog.o;
-- Detecting C compile features - done
-- Check for working CXX compiler: /home/user/openwrt/staging_dir/toolchain-x86_64_gcc-7.4.0_glibc/bin/x86_64-openwrt-linux-gnu-g++
/home/user/openwrt/staging_dir/toolchain-x86_64_gcc-7.4.0_glibc/lib/gcc/x86_64-openwrt-linux-gnu/7.4.0/../../../../x86_64-openwrt-linux-gnu/bin/ld: cannot find -lnsl
collect2: error: ld returned 1 exit status
make[4]: *** [Makefile:745: shared/libwrap.so.0.7.6] Error 1
make[4]: Leaving directory '/home/user/openwrt/build_dir/target-x86_64_glibc/tcp_wrappers_7.6'
make[3]: *** [Makefile:72: /home/user/openwrt/build_dir/target-x86_64_glibc/tcp_wrappers_7.6/.built] Error 2
make[3]: Leaving directory '/home/user/openwrt/feeds/packages/libs/tcp_wrappers'
time: package/feeds/packages/tcp_wrappers/compile#1.03#0.38#1.62
make[2]: *** [package/Makefile:113: package/feeds/packages/tcp_wrappers/compile] Error 2
make[2]: *** Waiting for unfinished jobs....
-- Check for working CXX compiler: /home/user/openwrt/staging_dir/toolchain-x86_64_gcc-7.4.0_glibc/bin/x86_64-openwrt-linux-gnu-g++ -- works
-- Detecting CXX compiler ABI info
-- Detecting CXX compiler ABI info - done
-- Detecting CXX compile features
-- Detecting CXX compile features - done
Build testing required static libraries. To prevent build errors BUILD_TESTING disabled.
-- 
-- 
-- Checking large files support...
-- 
-- Looking for sys/types.h
-- Looking for sys/types.h - found
-- Looking for stdint.h
-- Looking for stdint.h - found
-- Looking for stddef.h
-- Looking for stddef.h - found
-- 
-- Checking size of off_t without any definitions:
-- Check size of off_t
-- Check size of off_t - done
-- Checking of off_t without any definitions: 8
-- 
-- Result of checking large files support: supported


-- Could NOT find ALSA (missing: ALSA_LIBRARY ALSA_INCLUDE_DIR) 
-- Could NOT find Sndio (missing: SNDIO_LIBRARY SNDIO_INCLUDE_DIR) 
-- Found VorbisEnc: /home/user/openwrt/staging_dir/target-x86_64_glibc/usr/lib/libvorbisenc.so (found version "1.3.6") 
-- Found FLAC: /home/user/openwrt/staging_dir/target-x86_64_glibc/usr/lib/libFLAC.so (found version "1.3.3") 
-- Found Opus: /home/user/openwrt/staging_dir/target-x86_64_glibc/usr/lib/libopus.so (found version "1.3.1") 
-- Could NOT find Speex (missing: SPEEX_LIBRARY SPEEX_INCLUDE_DIR) 
-- Could NOT find SQLITE3 (missing: SQLITE3_LIBRARY SQLITE3_INCLUDE_DIR) 
-- Looking for byteswap.h
-- Looking for byteswap.h - found
-- Looking for dlfcn.h
-- Looking for dlfcn.h - found
-- Looking for direct.h
-- Looking for direct.h - not found
-- Looking for endian.h
-- Looking for endian.h - found
-- Looking for inttypes.h
-- Looking for inttypes.h - found
-- Looking for io.h
-- Looking for io.h - not found
-- Looking for sys/time.h
-- Looking for sys/time.h - found
-- Looking for unistd.h
-- Looking for unistd.h - found
-- Check size of int64_t
-- Check size of int64_t - done
-- Check size of long
-- Check size of long - done
-- Check size of long long
-- Check size of long long - done
-- Check size of ssize_t
-- Check size of ssize_t - done
-- Check size of wchar_t
-- Check size of wchar_t - done
-- Check size of int64_t
-- Check size of int64_t - done
-- Looking for floor in m
-- Looking for floor in m - found
-- Looking for sqlite3_close in sqlite3
-- Looking for sqlite3_close in sqlite3 - not found
-- Looking for fstat
-- Looking for fstat - found
-- Looking for fstat64
-- Looking for fstat64 - found
-- Looking for gettimeofday
-- Looking for gettimeofday - found
-- Looking for gmtime
-- Looking for gmtime - found
-- Looking for gmtime_r
-- Looking for gmtime_r - found
-- Looking for localtime
-- Looking for localtime - found
-- Looking for localtime_r
-- Looking for localtime_r - found
-- Looking for lseek
-- Looking for lseek - found
-- Looking for open
-- Looking for open - found
-- Looking for read
-- Looking for read - found
-- Looking for write
-- Looking for write - found
-- Looking for lrint
-- Looking for lrint - found
-- Looking for lrintf
-- Looking for lrintf - found
-- Looking for ftruncate
-- Looking for ftruncate - found
-- Looking for fsync
-- Looking for fsync - found
-- Looking for S_IRGRP
-- Looking for S_IRGRP - found
-- Check if the system is big endian
-- Searching 16 bit integer
-- Check size of unsigned short
-- Check size of unsigned short - done
-- Using unsigned short
-- Check if the system is big endian - little endian
-- Checking for inline...
-- Checking for inline... supported
-- Checking processor clipping capabilities...
-- Checking processor clipping capabilities... disabled
-- Found PythonInterp: /home/user/openwrt/staging_dir/host/bin/python (found version "3.7.3") 
-- The following features have been enabled:

 * BUILD_SHARED_LIBS, build shared libraries
 * ENABLE_CPACK, enable CPack support
 * ENABLE_PACKAGE_CONFIG, generate and install package config file

-- The following RECOMMENDED packages have been found:

 * VorbisEnc, open source lossy audio codec, <www.vorbis.com/>
   Enables Vorbis support
 * FLAC, Free Lossless Audio Codec Library, <www.xiph.org/flac/>
   Enables FLAC support
 * Opus, Standardized open source low-latency fullband codec, <www.opus-codec.org/>
   Enables experimental Opus support

-- The following REQUIRED packages have been found:

 * PythonInterp, Python is a widely used high-level programming language., <www.python.org/>
   Required to build shared libraries

-- The following features have been disabled:

 * ENABLE_EXTERNAL_LIBS, enable FLAC, Vorbis, and Opus codecs
 * ENABLE_EXPERIMENTAL, enable experimental code
 * BUILD_TESTING, build tests
 * BUILD_REGTEST, build regtest
 * ENABLE_CPU_CLIP, Enable tricky cpu specific clipper
 * ENABLE_BOW_DOCS, enable black-on-white html docs

-- The following OPTIONAL packages have not been found:

 * ALSA
 * Sndio
 * Speex, an audio codec tuned for speech, <www.speex.org/>
   Enables experemental Speex support
 * SQLite3, light weight SQL database engine., <www.sqlite.org/>
   Enables regtest

-- Configuring done
-- Generating done
CMake Warning:
  Manually-specified variables were not used by the project:

    CMAKE_ASM_COMPILER
    CMAKE_ASM_COMPILER_ARG1
    CMAKE_MODULE_LINKER_FLAGS
    DL_LIBRARY


-- Build files have been written to: /home/user/openwrt/build_dir/target-x86_64_glibc/libsndfile-2019-04-21-25824cb9
touch /home/user/openwrt/build_dir/target-x86_64_glibc/libsndfile-2019-04-21-25824cb9/.configured_68b329da9893e34099c7d8ad5cb9c940
rm -f /home/user/openwrt/build_dir/target-x86_64_glibc/libsndfile-2019-04-21-25824cb9/.built
touch /home/user/openwrt/build_dir/target-x86_64_glibc/libsndfile-2019-04-21-25824cb9/.built_check
CFLAGS="-Os -pipe -fno-caller-saves -fno-plt -fhonour-copts -Wno-error=unused-but-set-variable -Wno-error=unused-result -iremap/home/user/openwrt/build_dir/target-x86_64_glibc/libsndfile-2019-04-21-25824cb9:libsndfile-2019-04-21-25824cb9 -Wformat -Werror=format-security -D_FORTIFY_SOURCE=1 -Wl,-z,now -Wl,-z,relro -fpic  -I/home/user/openwrt/staging_dir/target-x86_64_glibc/usr/include -I/home/user/openwrt/staging_dir/target-x86_64_glibc/include -I/home/user/openwrt/staging_dir/toolchain-x86_64_gcc-7.4.0_glibc/usr/include -I/home/user/openwrt/staging_dir/toolchain-x86_64_gcc-7.4.0_glibc/include " CXXFLAGS="-Os -pipe -fno-caller-saves -fno-plt -fhonour-copts -Wno-error=unused-but-set-variable -Wno-error=unused-result -iremap/home/user/openwrt/build_dir/target-x86_64_glibc/libsndfile-2019-04-21-25824cb9:libsndfile-2019-04-21-25824cb9 -Wformat -Werror=format-security -D_FORTIFY_SOURCE=1 -Wl,-z,now -Wl,-z,relro -fpic  -I/home/user/openwrt/staging_dir/target-x86_64_glibc/usr/include -I/home/user/openwrt/staging_dir/target-x86_64_glibc/include -I/home/user/openwrt/staging_dir/toolchain-x86_64_gcc-7.4.0_glibc/usr/include -I/home/user/openwrt/staging_dir/toolchain-x86_64_gcc-7.4.0_glibc/include " LDFLAGS="-L/home/user/openwrt/staging_dir/target-x86_64_glibc/usr/lib -L/home/user/openwrt/staging_dir/target-x86_64_glibc/lib -L/home/user/openwrt/staging_dir/toolchain-x86_64_gcc-7.4.0_glibc/usr/lib -L/home/user/openwrt/staging_dir/toolchain-x86_64_gcc-7.4.0_glibc/lib -znow -zrelro " make -j1 -C /home/user/openwrt/build_dir/target-x86_64_glibc/libsndfile-2019-04-21-25824cb9/. AR="x86_64-openwrt-linux-gnu-gcc-ar" AS="x86_64-openwrt-linux-gnu-gcc -c -Os -pipe -fno-caller-saves -fno-plt -fhonour-copts -Wno-error=unused-but-set-variable -Wno-error=unused-result -iremap/home/user/openwrt/build_dir/target-x86_64_glibc/libsndfile-2019-04-21-25824cb9:libsndfile-2019-04-21-25824cb9 -Wformat -Werror=format-security -D_FORTIFY_SOURCE=1 -Wl,-z,now -Wl,-z,relro -fpic" LD=x86_64-openwrt-linux-gnu-ld NM="x86_64-openwrt-linux-gnu-gcc-nm" CC="x86_64-openwrt-linux-gnu-gcc" GCC="x86_64-openwrt-linux-gnu-gcc" CXX="x86_64-openwrt-linux-gnu-g++" RANLIB="x86_64-openwrt-linux-gnu-gcc-ranlib" STRIP=x86_64-openwrt-linux-gnu-strip OBJCOPY=x86_64-openwrt-linux-gnu-objcopy OBJDUMP=x86_64-openwrt-linux-gnu-objdump SIZE=x86_64-openwrt-linux-gnu-size CROSS="x86_64-openwrt-linux-gnu-" ARCH="x86_64" CMAKE_COMMAND='/home/user/openwrt/staging_dir/host/bin/cmake' CMAKE_DISABLE_cmake_check_build_system=1 ;
make[4]: Entering directory '/home/user/openwrt/build_dir/target-x86_64_glibc/libsndfile-2019-04-21-25824cb9'
Build testing required static libraries. To prevent build errors BUILD_TESTING disabled.
-- Could NOT find ALSA (missing: ALSA_LIBRARY ALSA_INCLUDE_DIR) 
-- Could NOT find Sndio (missing: SNDIO_LIBRARY SNDIO_INCLUDE_DIR) 
-- Could NOT find Speex (missing: SPEEX_LIBRARY SPEEX_INCLUDE_DIR) 
-- Could NOT find SQLITE3 (missing: SQLITE3_LIBRARY SQLITE3_INCLUDE_DIR) 
-- Checking processor clipping capabilities...
-- Checking processor clipping capabilities... disabled
-- The following features have been enabled:

 * BUILD_SHARED_LIBS, build shared libraries
 * ENABLE_CPACK, enable CPack support
 * ENABLE_PACKAGE_CONFIG, generate and install package config file

-- The following RECOMMENDED packages have been found:

 * VorbisEnc, open source lossy audio codec, <www.vorbis.com/>
   Enables Vorbis support
 * FLAC, Free Lossless Audio Codec Library, <www.xiph.org/flac/>
   Enables FLAC support
 * Opus, Standardized open source low-latency fullband codec, <www.opus-codec.org/>
   Enables experimental Opus support

-- The following REQUIRED packages have been found:

 * PythonInterp, Python is a widely used high-level programming language., <www.python.org/>
   Required to build shared libraries

-- The following features have been disabled:

 * ENABLE_EXTERNAL_LIBS, enable FLAC, Vorbis, and Opus codecs
 * ENABLE_EXPERIMENTAL, enable experimental code
 * BUILD_TESTING, build tests
 * BUILD_REGTEST, build regtest
 * ENABLE_CPU_CLIP, Enable tricky cpu specific clipper
 * ENABLE_BOW_DOCS, enable black-on-white html docs

-- The following OPTIONAL packages have not been found:

 * ALSA
 * Sndio
 * Speex, an audio codec tuned for speech, <www.speex.org/>
   Enables experemental Speex support
 * SQLite3, light weight SQL database engine., <www.sqlite.org/>
   Enables regtest

-- Configuring done
-- Generating done
-- Build files have been written to: /home/user/openwrt/build_dir/target-x86_64_glibc/libsndfile-2019-04-21-25824cb9
make[5]: Entering directory '/home/user/openwrt/build_dir/target-x86_64_glibc/libsndfile-2019-04-21-25824cb9'
make[6]: Entering directory '/home/user/openwrt/build_dir/target-x86_64_glibc/libsndfile-2019-04-21-25824cb9'
Scanning dependencies of target GENFILES
make[6]: Leaving directory '/home/user/openwrt/build_dir/target-x86_64_glibc/libsndfile-2019-04-21-25824cb9'
make[6]: Entering directory '/home/user/openwrt/build_dir/target-x86_64_glibc/libsndfile-2019-04-21-25824cb9'
[  0%] Generating Symbols.gnu-binutils...
make[6]: Leaving directory '/home/user/openwrt/build_dir/target-x86_64_glibc/libsndfile-2019-04-21-25824cb9'
[  0%] Built target GENFILES
make[6]: Entering directory '/home/user/openwrt/build_dir/target-x86_64_glibc/libsndfile-2019-04-21-25824cb9'
Scanning dependencies of target sndfile
make[6]: Leaving directory '/home/user/openwrt/build_dir/target-x86_64_glibc/libsndfile-2019-04-21-25824cb9'
make[6]: Entering directory '/home/user/openwrt/build_dir/target-x86_64_glibc/libsndfile-2019-04-21-25824cb9'
[  1%] Building C object CMakeFiles/sndfile.dir/src/common.c.o
[  1%] Building C object CMakeFiles/sndfile.dir/src/file_io.c.o
[  2%] Building C object CMakeFiles/sndfile.dir/src/command.c.o
[  3%] Building C object CMakeFiles/sndfile.dir/src/pcm.c.o
[  4%] Building C object CMakeFiles/sndfile.dir/src/ulaw.c.o
[  4%] Building C object CMakeFiles/sndfile.dir/src/alaw.c.o
[  5%] Building C object CMakeFiles/sndfile.dir/src/float32.c.o
[  6%] Building C object CMakeFiles/sndfile.dir/src/double64.c.o
[  7%] Building C object CMakeFiles/sndfile.dir/src/ima_adpcm.c.o
[  7%] Building C object CMakeFiles/sndfile.dir/src/ms_adpcm.c.o
[  8%] Building C object CMakeFiles/sndfile.dir/src/gsm610.c.o
[  9%] Building C object CMakeFiles/sndfile.dir/src/dwvw.c.o
[ 10%] Building C object CMakeFiles/sndfile.dir/src/vox_adpcm.c.o
[ 10%] Building C object CMakeFiles/sndfile.dir/src/interleave.c.o
[ 11%] Building C object CMakeFiles/sndfile.dir/src/strings.c.o
[ 12%] Building C object CMakeFiles/sndfile.dir/src/dither.c.o
[ 13%] Building C object CMakeFiles/sndfile.dir/src/cart.c.o
[ 13%] Building C object CMakeFiles/sndfile.dir/src/broadcast.c.o
[ 14%] Building C object CMakeFiles/sndfile.dir/src/audio_detect.c.o
[ 15%] Building C object CMakeFiles/sndfile.dir/src/ima_oki_adpcm.c.o
[ 16%] Building C object CMakeFiles/sndfile.dir/src/alac.c.o
[ 16%] Building C object CMakeFiles/sndfile.dir/src/chunk.c.o
[ 17%] Building C object CMakeFiles/sndfile.dir/src/ogg.c.o
[ 18%] Building C object CMakeFiles/sndfile.dir/src/chanmap.c.o
[ 19%] Building C object CMakeFiles/sndfile.dir/src/id3.c.o
[ 19%] Building C object CMakeFiles/sndfile.dir/src/sndfile.c.o
[ 20%] Building C object CMakeFiles/sndfile.dir/src/aiff.c.o
[ 21%] Building C object CMakeFiles/sndfile.dir/src/au.c.o
[ 22%] Building C object CMakeFiles/sndfile.dir/src/avr.c.o
[ 22%] Building C object CMakeFiles/sndfile.dir/src/caf.c.o
[ 23%] Building C object CMakeFiles/sndfile.dir/src/dwd.c.o
[ 24%] Building C object CMakeFiles/sndfile.dir/src/flac.c.o
[ 25%] Building C object CMakeFiles/sndfile.dir/src/g72x.c.o
[ 25%] Building C object CMakeFiles/sndfile.dir/src/htk.c.o
[ 26%] Building C object CMakeFiles/sndfile.dir/src/ircam.c.o
[ 27%] Building C object CMakeFiles/sndfile.dir/src/macos.c.o
[ 28%] Building C object CMakeFiles/sndfile.dir/src/mat4.c.o
[ 28%] Building C object CMakeFiles/sndfile.dir/src/mat5.c.o
[ 29%] Building C object CMakeFiles/sndfile.dir/src/nist.c.o
[ 30%] Building C object CMakeFiles/sndfile.dir/src/paf.c.o
[ 31%] Building C object CMakeFiles/sndfile.dir/src/pvf.c.o
[ 31%] Building C object CMakeFiles/sndfile.dir/src/raw.c.o
[ 32%] Building C object CMakeFiles/sndfile.dir/src/rx2.c.o
[ 33%] Building C object CMakeFiles/sndfile.dir/src/sd2.c.o
[ 34%] Building C object CMakeFiles/sndfile.dir/src/sds.c.o
[ 34%] Building C object CMakeFiles/sndfile.dir/src/svx.c.o
[ 35%] Building C object CMakeFiles/sndfile.dir/src/txw.c.o
[ 36%] Building C object CMakeFiles/sndfile.dir/src/voc.c.o
[ 37%] Building C object CMakeFiles/sndfile.dir/src/wve.c.o
[ 37%] Building C object CMakeFiles/sndfile.dir/src/w64.c.o
[ 38%] Building C object CMakeFiles/sndfile.dir/src/wavlike.c.o
[ 39%] Building C object CMakeFiles/sndfile.dir/src/wav.c.o
[ 40%] Building C object CMakeFiles/sndfile.dir/src/xi.c.o
[ 40%] Building C object CMakeFiles/sndfile.dir/src/mpc2k.c.o
[ 41%] Building C object CMakeFiles/sndfile.dir/src/rf64.c.o
[ 42%] Building C object CMakeFiles/sndfile.dir/src/ogg_vorbis.c.o
[ 43%] Building C object CMakeFiles/sndfile.dir/src/ogg_speex.c.o
[ 43%] Building C object CMakeFiles/sndfile.dir/src/ogg_pcm.c.o
[ 44%] Building C object CMakeFiles/sndfile.dir/src/ogg_opus.c.o
[ 45%] Building C object CMakeFiles/sndfile.dir/src/ogg_vcomment.c.o
[ 46%] Building C object CMakeFiles/sndfile.dir/src/nms_adpcm.c.o
[ 46%] Building C object CMakeFiles/sndfile.dir/src/GSM610/add.c.o
[ 47%] Building C object CMakeFiles/sndfile.dir/src/GSM610/code.c.o
[ 48%] Building C object CMakeFiles/sndfile.dir/src/GSM610/decode.c.o
[ 49%] Building C object CMakeFiles/sndfile.dir/src/GSM610/gsm_create.c.o
[ 49%] Building C object CMakeFiles/sndfile.dir/src/GSM610/gsm_decode.c.o
[ 50%] Building C object CMakeFiles/sndfile.dir/src/GSM610/gsm_destroy.c.o
[ 51%] Building C object CMakeFiles/sndfile.dir/src/GSM610/gsm_encode.c.o
[ 52%] Building C object CMakeFiles/sndfile.dir/src/GSM610/gsm_option.c.o
[ 52%] Building C object CMakeFiles/sndfile.dir/src/GSM610/long_term.c.o
[ 53%] Building C object CMakeFiles/sndfile.dir/src/GSM610/lpc.c.o
[ 54%] Building C object CMakeFiles/sndfile.dir/src/GSM610/preprocess.c.o
[ 55%] Building C object CMakeFiles/sndfile.dir/src/GSM610/rpe.c.o
[ 55%] Building C object CMakeFiles/sndfile.dir/src/GSM610/short_term.c.o
[ 56%] Building C object CMakeFiles/sndfile.dir/src/GSM610/table.c.o
[ 57%] Building C object CMakeFiles/sndfile.dir/src/G72x/g721.c.o
[ 58%] Building C object CMakeFiles/sndfile.dir/src/G72x/g723_16.c.o
[ 58%] Building C object CMakeFiles/sndfile.dir/src/G72x/g723_24.c.o
[ 59%] Building C object CMakeFiles/sndfile.dir/src/G72x/g723_40.c.o
[ 60%] Building C object CMakeFiles/sndfile.dir/src/G72x/g72x.c.o
[ 61%] Building C object CMakeFiles/sndfile.dir/src/ALAC/ALACBitUtilities.c.o
[ 61%] Building C object CMakeFiles/sndfile.dir/src/ALAC/ag_dec.c.o
[ 62%] Building C object CMakeFiles/sndfile.dir/src/ALAC/ag_enc.c.o
[ 63%] Building C object CMakeFiles/sndfile.dir/src/ALAC/dp_dec.c.o
[ 64%] Building C object CMakeFiles/sndfile.dir/src/ALAC/dp_enc.c.o
[ 64%] Building C object CMakeFiles/sndfile.dir/src/ALAC/matrix_dec.c.o
[ 65%] Building C object CMakeFiles/sndfile.dir/src/ALAC/matrix_enc.c.o
[ 66%] Building C object CMakeFiles/sndfile.dir/src/ALAC/alac_decoder.c.o
[ 67%] Building C object CMakeFiles/sndfile.dir/src/ALAC/alac_encoder.c.o
[ 67%] Linking C shared library libsndfile.so
make[6]: Leaving directory '/home/user/openwrt/build_dir/target-x86_64_glibc/libsndfile-2019-04-21-25824cb9'
[ 67%] Built target sndfile
make[6]: Entering directory '/home/user/openwrt/build_dir/target-x86_64_glibc/libsndfile-2019-04-21-25824cb9'
Scanning dependencies of target sndfilehandle
make[6]: Leaving directory '/home/user/openwrt/build_dir/target-x86_64_glibc/libsndfile-2019-04-21-25824cb9'
make[6]: Entering directory '/home/user/openwrt/build_dir/target-x86_64_glibc/libsndfile-2019-04-21-25824cb9'
[ 68%] Building CXX object CMakeFiles/sndfilehandle.dir/examples/sndfilehandle.cc.o
[ 69%] Linking CXX executable sndfilehandle
make[6]: Leaving directory '/home/user/openwrt/build_dir/target-x86_64_glibc/libsndfile-2019-04-21-25824cb9'
[ 69%] Built target sndfilehandle
make[6]: Entering directory '/home/user/openwrt/build_dir/target-x86_64_glibc/libsndfile-2019-04-21-25824cb9'
Scanning dependencies of target list_formats
make[6]: Leaving directory '/home/user/openwrt/build_dir/target-x86_64_glibc/libsndfile-2019-04-21-25824cb9'
make[6]: Entering directory '/home/user/openwrt/build_dir/target-x86_64_glibc/libsndfile-2019-04-21-25824cb9'
[ 70%] Building C object CMakeFiles/list_formats.dir/examples/list_formats.c.o
[ 71%] Linking C executable list_formats
make[6]: Leaving directory '/home/user/openwrt/build_dir/target-x86_64_glibc/libsndfile-2019-04-21-25824cb9'
[ 71%] Built target list_formats
make[6]: Entering directory '/home/user/openwrt/build_dir/target-x86_64_glibc/libsndfile-2019-04-21-25824cb9'
Scanning dependencies of target sfprocess
make[6]: Leaving directory '/home/user/openwrt/build_dir/target-x86_64_glibc/libsndfile-2019-04-21-25824cb9'
make[6]: Entering directory '/home/user/openwrt/build_dir/target-x86_64_glibc/libsndfile-2019-04-21-25824cb9'
[ 72%] Building C object CMakeFiles/sfprocess.dir/examples/sfprocess.c.o
[ 73%] Linking C executable sfprocess
make[6]: Leaving directory '/home/user/openwrt/build_dir/target-x86_64_glibc/libsndfile-2019-04-21-25824cb9'
[ 73%] Built target sfprocess
make[6]: Entering directory '/home/user/openwrt/build_dir/target-x86_64_glibc/libsndfile-2019-04-21-25824cb9'
Scanning dependencies of target sndfile-to-text
make[6]: Leaving directory '/home/user/openwrt/build_dir/target-x86_64_glibc/libsndfile-2019-04-21-25824cb9'
make[6]: Entering directory '/home/user/openwrt/build_dir/target-x86_64_glibc/libsndfile-2019-04-21-25824cb9'
[ 74%] Building C object CMakeFiles/sndfile-to-text.dir/examples/sndfile-to-text.c.o
[ 75%] Linking C executable sndfile-to-text
make[6]: Leaving directory '/home/user/openwrt/build_dir/target-x86_64_glibc/libsndfile-2019-04-21-25824cb9'
[ 75%] Built target sndfile-to-text
make[6]: Entering directory '/home/user/openwrt/build_dir/target-x86_64_glibc/libsndfile-2019-04-21-25824cb9'
Scanning dependencies of target sndfile-salvage
make[6]: Leaving directory '/home/user/openwrt/build_dir/target-x86_64_glibc/libsndfile-2019-04-21-25824cb9'
make[6]: Entering directory '/home/user/openwrt/build_dir/target-x86_64_glibc/libsndfile-2019-04-21-25824cb9'
[ 76%] Building C object CMakeFiles/sndfile-salvage.dir/programs/sndfile-salvage.c.o
[ 77%] Building C object CMakeFiles/sndfile-salvage.dir/programs/common.c.o
[ 77%] Linking C executable sndfile-salvage
make[6]: Leaving directory '/home/user/openwrt/build_dir/target-x86_64_glibc/libsndfile-2019-04-21-25824cb9'
[ 77%] Built target sndfile-salvage
make[6]: Entering directory '/home/user/openwrt/build_dir/target-x86_64_glibc/libsndfile-2019-04-21-25824cb9'
Scanning dependencies of target sndfile-concat
make[6]: Leaving directory '/home/user/openwrt/build_dir/target-x86_64_glibc/libsndfile-2019-04-21-25824cb9'
make[6]: Entering directory '/home/user/openwrt/build_dir/target-x86_64_glibc/libsndfile-2019-04-21-25824cb9'
[ 77%] Building C object CMakeFiles/sndfile-concat.dir/programs/sndfile-concat.c.o
[ 78%] Building C object CMakeFiles/sndfile-concat.dir/programs/common.c.o
[ 79%] Linking C executable sndfile-concat
make[6]: Leaving directory '/home/user/openwrt/build_dir/target-x86_64_glibc/libsndfile-2019-04-21-25824cb9'
[ 79%] Built target sndfile-concat
make[6]: Entering directory '/home/user/openwrt/build_dir/target-x86_64_glibc/libsndfile-2019-04-21-25824cb9'
Scanning dependencies of target sndfile-deinterleave
make[6]: Leaving directory '/home/user/openwrt/build_dir/target-x86_64_glibc/libsndfile-2019-04-21-25824cb9'
make[6]: Entering directory '/home/user/openwrt/build_dir/target-x86_64_glibc/libsndfile-2019-04-21-25824cb9'
[ 80%] Building C object CMakeFiles/sndfile-deinterleave.dir/programs/sndfile-deinterleave.c.o
[ 81%] Building C object CMakeFiles/sndfile-deinterleave.dir/programs/common.c.o
[ 81%] Linking C executable sndfile-deinterleave
make[6]: Leaving directory '/home/user/openwrt/build_dir/target-x86_64_glibc/libsndfile-2019-04-21-25824cb9'
[ 81%] Built target sndfile-deinterleave
make[6]: Entering directory '/home/user/openwrt/build_dir/target-x86_64_glibc/libsndfile-2019-04-21-25824cb9'
Scanning dependencies of target sndfile-loopify
make[6]: Leaving directory '/home/user/openwrt/build_dir/target-x86_64_glibc/libsndfile-2019-04-21-25824cb9'
make[6]: Entering directory '/home/user/openwrt/build_dir/target-x86_64_glibc/libsndfile-2019-04-21-25824cb9'
[ 82%] Building C object CMakeFiles/sndfile-loopify.dir/examples/sndfile-loopify.c.o
[ 82%] Linking C executable sndfile-loopify
make[6]: Leaving directory '/home/user/openwrt/build_dir/target-x86_64_glibc/libsndfile-2019-04-21-25824cb9'
[ 82%] Built target sndfile-loopify
make[6]: Entering directory '/home/user/openwrt/build_dir/target-x86_64_glibc/libsndfile-2019-04-21-25824cb9'
Scanning dependencies of target make_sine
make[6]: Leaving directory '/home/user/openwrt/build_dir/target-x86_64_glibc/libsndfile-2019-04-21-25824cb9'
make[6]: Entering directory '/home/user/openwrt/build_dir/target-x86_64_glibc/libsndfile-2019-04-21-25824cb9'
[ 83%] Building C object CMakeFiles/make_sine.dir/examples/make_sine.c.o
[ 83%] Linking C executable make_sine
make[6]: Leaving directory '/home/user/openwrt/build_dir/target-x86_64_glibc/libsndfile-2019-04-21-25824cb9'
[ 83%] Built target make_sine
make[6]: Entering directory '/home/user/openwrt/build_dir/target-x86_64_glibc/libsndfile-2019-04-21-25824cb9'
Scanning dependencies of target sndfile-interleave
make[6]: Leaving directory '/home/user/openwrt/build_dir/target-x86_64_glibc/libsndfile-2019-04-21-25824cb9'
make[6]: Entering directory '/home/user/openwrt/build_dir/target-x86_64_glibc/libsndfile-2019-04-21-25824cb9'
[ 83%] Building C object CMakeFiles/sndfile-interleave.dir/programs/sndfile-interleave.c.o
[ 84%] Building C object CMakeFiles/sndfile-interleave.dir/programs/common.c.o
[ 85%] Linking C executable sndfile-interleave
make[6]: Leaving directory '/home/user/openwrt/build_dir/target-x86_64_glibc/libsndfile-2019-04-21-25824cb9'
[ 85%] Built target sndfile-interleave
make[6]: Entering directory '/home/user/openwrt/build_dir/target-x86_64_glibc/libsndfile-2019-04-21-25824cb9'
Scanning dependencies of target sndfile-info
make[6]: Leaving directory '/home/user/openwrt/build_dir/target-x86_64_glibc/libsndfile-2019-04-21-25824cb9'
make[6]: Entering directory '/home/user/openwrt/build_dir/target-x86_64_glibc/libsndfile-2019-04-21-25824cb9'
[ 86%] Building C object CMakeFiles/sndfile-info.dir/programs/sndfile-info.c.o
[ 87%] Building C object CMakeFiles/sndfile-info.dir/programs/common.c.o
[ 88%] Linking C executable sndfile-info
make[6]: Leaving directory '/home/user/openwrt/build_dir/target-x86_64_glibc/libsndfile-2019-04-21-25824cb9'
[ 88%] Built target sndfile-info
make[6]: Entering directory '/home/user/openwrt/build_dir/target-x86_64_glibc/libsndfile-2019-04-21-25824cb9'
Scanning dependencies of target sndfile-play
make[6]: Leaving directory '/home/user/openwrt/build_dir/target-x86_64_glibc/libsndfile-2019-04-21-25824cb9'
make[6]: Entering directory '/home/user/openwrt/build_dir/target-x86_64_glibc/libsndfile-2019-04-21-25824cb9'
[ 89%] Building C object CMakeFiles/sndfile-play.dir/programs/sndfile-play.c.o
[ 89%] Building C object CMakeFiles/sndfile-play.dir/programs/common.c.o
[ 90%] Linking C executable sndfile-play
make[6]: Leaving directory '/home/user/openwrt/build_dir/target-x86_64_glibc/libsndfile-2019-04-21-25824cb9'
[ 90%] Built target sndfile-play
make[6]: Entering directory '/home/user/openwrt/build_dir/target-x86_64_glibc/libsndfile-2019-04-21-25824cb9'
Scanning dependencies of target sndfile-convert
make[6]: Leaving directory '/home/user/openwrt/build_dir/target-x86_64_glibc/libsndfile-2019-04-21-25824cb9'
make[6]: Entering directory '/home/user/openwrt/build_dir/target-x86_64_glibc/libsndfile-2019-04-21-25824cb9'
[ 91%] Building C object CMakeFiles/sndfile-convert.dir/programs/sndfile-convert.c.o
[ 91%] Building C object CMakeFiles/sndfile-convert.dir/programs/common.c.o
[ 92%] Linking C executable sndfile-convert
make[6]: Leaving directory '/home/user/openwrt/build_dir/target-x86_64_glibc/libsndfile-2019-04-21-25824cb9'
[ 92%] Built target sndfile-convert
make[6]: Entering directory '/home/user/openwrt/build_dir/target-x86_64_glibc/libsndfile-2019-04-21-25824cb9'
Scanning dependencies of target sndfile-cmp
make[6]: Leaving directory '/home/user/openwrt/build_dir/target-x86_64_glibc/libsndfile-2019-04-21-25824cb9'
make[6]: Entering directory '/home/user/openwrt/build_dir/target-x86_64_glibc/libsndfile-2019-04-21-25824cb9'
[ 93%] Building C object CMakeFiles/sndfile-cmp.dir/programs/sndfile-cmp.c.o
[ 94%] Building C object CMakeFiles/sndfile-cmp.dir/programs/common.c.o
[ 95%] Linking C executable sndfile-cmp
make[6]: Leaving directory '/home/user/openwrt/build_dir/target-x86_64_glibc/libsndfile-2019-04-21-25824cb9'
[ 95%] Built target sndfile-cmp
make[6]: Entering directory '/home/user/openwrt/build_dir/target-x86_64_glibc/libsndfile-2019-04-21-25824cb9'
Scanning dependencies of target sndfile-metadata-set
make[6]: Leaving directory '/home/user/openwrt/build_dir/target-x86_64_glibc/libsndfile-2019-04-21-25824cb9'
make[6]: Entering directory '/home/user/openwrt/build_dir/target-x86_64_glibc/libsndfile-2019-04-21-25824cb9'
[ 95%] Building C object CMakeFiles/sndfile-metadata-set.dir/programs/sndfile-metadata-set.c.o
[ 96%] Building C object CMakeFiles/sndfile-metadata-set.dir/programs/common.c.o
[ 97%] Linking C executable sndfile-metadata-set
make[6]: Leaving directory '/home/user/openwrt/build_dir/target-x86_64_glibc/libsndfile-2019-04-21-25824cb9'
[ 97%] Built target sndfile-metadata-set
make[6]: Entering directory '/home/user/openwrt/build_dir/target-x86_64_glibc/libsndfile-2019-04-21-25824cb9'
Scanning dependencies of target sndfile-metadata-get
make[6]: Leaving directory '/home/user/openwrt/build_dir/target-x86_64_glibc/libsndfile-2019-04-21-25824cb9'
make[6]: Entering directory '/home/user/openwrt/build_dir/target-x86_64_glibc/libsndfile-2019-04-21-25824cb9'
[ 98%] Building C object CMakeFiles/sndfile-metadata-get.dir/programs/sndfile-metadata-get.c.o
[ 99%] Building C object CMakeFiles/sndfile-metadata-get.dir/programs/common.c.o
[100%] Linking C executable sndfile-metadata-get
make[6]: Leaving directory '/home/user/openwrt/build_dir/target-x86_64_glibc/libsndfile-2019-04-21-25824cb9'
[100%] Built target sndfile-metadata-get
make[5]: Leaving directory '/home/user/openwrt/build_dir/target-x86_64_glibc/libsndfile-2019-04-21-25824cb9'
make[4]: Leaving directory '/home/user/openwrt/build_dir/target-x86_64_glibc/libsndfile-2019-04-21-25824cb9'
CFLAGS="-Os -pipe -fno-caller-saves -fno-plt -fhonour-copts -Wno-error=unused-but-set-variable -Wno-error=unused-result -iremap/home/user/openwrt/build_dir/target-x86_64_glibc/libsndfile-2019-04-21-25824cb9:libsndfile-2019-04-21-25824cb9 -Wformat -Werror=format-security -D_FORTIFY_SOURCE=1 -Wl,-z,now -Wl,-z,relro -fpic  -I/home/user/openwrt/staging_dir/target-x86_64_glibc/usr/include -I/home/user/openwrt/staging_dir/target-x86_64_glibc/include -I/home/user/openwrt/staging_dir/toolchain-x86_64_gcc-7.4.0_glibc/usr/include -I/home/user/openwrt/staging_dir/toolchain-x86_64_gcc-7.4.0_glibc/include " CXXFLAGS="-Os -pipe -fno-caller-saves -fno-plt -fhonour-copts -Wno-error=unused-but-set-variable -Wno-error=unused-result -iremap/home/user/openwrt/build_dir/target-x86_64_glibc/libsndfile-2019-04-21-25824cb9:libsndfile-2019-04-21-25824cb9 -Wformat -Werror=format-security -D_FORTIFY_SOURCE=1 -Wl,-z,now -Wl,-z,relro -fpic  -I/home/user/openwrt/staging_dir/target-x86_64_glibc/usr/include -I/home/user/openwrt/staging_dir/target-x86_64_glibc/include -I/home/user/openwrt/staging_dir/toolchain-x86_64_gcc-7.4.0_glibc/usr/include -I/home/user/openwrt/staging_dir/toolchain-x86_64_gcc-7.4.0_glibc/include " LDFLAGS="-L/home/user/openwrt/staging_dir/target-x86_64_glibc/usr/lib -L/home/user/openwrt/staging_dir/target-x86_64_glibc/lib -L/home/user/openwrt/staging_dir/toolchain-x86_64_gcc-7.4.0_glibc/usr/lib -L/home/user/openwrt/staging_dir/toolchain-x86_64_gcc-7.4.0_glibc/lib -znow -zrelro " make -C /home/user/openwrt/build_dir/target-x86_64_glibc/libsndfile-2019-04-21-25824cb9/. AR="x86_64-openwrt-linux-gnu-gcc-ar" AS="x86_64-openwrt-linux-gnu-gcc -c -Os -pipe -fno-caller-saves -fno-plt -fhonour-copts -Wno-error=unused-but-set-variable -Wno-error=unused-result -iremap/home/user/openwrt/build_dir/target-x86_64_glibc/libsndfile-2019-04-21-25824cb9:libsndfile-2019-04-21-25824cb9 -Wformat -Werror=format-security -D_FORTIFY_SOURCE=1 -Wl,-z,now -Wl,-z,relro -fpic" LD=x86_64-openwrt-linux-gnu-ld NM="x86_64-openwrt-linux-gnu-gcc-nm" CC="x86_64-openwrt-linux-gnu-gcc" GCC="x86_64-openwrt-linux-gnu-gcc" CXX="x86_64-openwrt-linux-gnu-g++" RANLIB="x86_64-openwrt-linux-gnu-gcc-ranlib" STRIP=x86_64-openwrt-linux-gnu-strip OBJCOPY=x86_64-openwrt-linux-gnu-objcopy OBJDUMP=x86_64-openwrt-linux-gnu-objdump SIZE=x86_64-openwrt-linux-gnu-size CROSS="x86_64-openwrt-linux-gnu-" ARCH="x86_64" CMAKE_COMMAND='/home/user/openwrt/staging_dir/host/bin/cmake' CMAKE_DISABLE_cmake_check_build_system=1 DESTDIR="/home/user/openwrt/build_dir/target-x86_64_glibc/libsndfile-2019-04-21-25824cb9/ipkg-install"  install;
make[4]: Entering directory '/home/user/openwrt/build_dir/target-x86_64_glibc/libsndfile-2019-04-21-25824cb9'
make[5]: Entering directory '/home/user/openwrt/build_dir/target-x86_64_glibc/libsndfile-2019-04-21-25824cb9'
make[6]: Entering directory '/home/user/openwrt/build_dir/target-x86_64_glibc/libsndfile-2019-04-21-25824cb9'
make[6]: Leaving directory '/home/user/openwrt/build_dir/target-x86_64_glibc/libsndfile-2019-04-21-25824cb9'
[  0%] Built target GENFILES
make[6]: Entering directory '/home/user/openwrt/build_dir/target-x86_64_glibc/libsndfile-2019-04-21-25824cb9'
make[6]: Leaving directory '/home/user/openwrt/build_dir/target-x86_64_glibc/libsndfile-2019-04-21-25824cb9'
[ 67%] Built target sndfile
make[6]: Entering directory '/home/user/openwrt/build_dir/target-x86_64_glibc/libsndfile-2019-04-21-25824cb9'
make[6]: Leaving directory '/home/user/openwrt/build_dir/target-x86_64_glibc/libsndfile-2019-04-21-25824cb9'
[ 69%] Built target sndfilehandle
make[6]: Entering directory '/home/user/openwrt/build_dir/target-x86_64_glibc/libsndfile-2019-04-21-25824cb9'
make[6]: Leaving directory '/home/user/openwrt/build_dir/target-x86_64_glibc/libsndfile-2019-04-21-25824cb9'
[ 71%] Built target list_formats
make[6]: Entering directory '/home/user/openwrt/build_dir/target-x86_64_glibc/libsndfile-2019-04-21-25824cb9'
make[6]: Leaving directory '/home/user/openwrt/build_dir/target-x86_64_glibc/libsndfile-2019-04-21-25824cb9'
[ 73%] Built target sfprocess
make[6]: Entering directory '/home/user/openwrt/build_dir/target-x86_64_glibc/libsndfile-2019-04-21-25824cb9'
make[6]: Leaving directory '/home/user/openwrt/build_dir/target-x86_64_glibc/libsndfile-2019-04-21-25824cb9'
[ 75%] Built target sndfile-to-text
make[6]: Entering directory '/home/user/openwrt/build_dir/target-x86_64_glibc/libsndfile-2019-04-21-25824cb9'
make[6]: Leaving directory '/home/user/openwrt/build_dir/target-x86_64_glibc/libsndfile-2019-04-21-25824cb9'
[ 77%] Built target sndfile-salvage
make[6]: Entering directory '/home/user/openwrt/build_dir/target-x86_64_glibc/libsndfile-2019-04-21-25824cb9'
make[6]: Leaving directory '/home/user/openwrt/build_dir/target-x86_64_glibc/libsndfile-2019-04-21-25824cb9'
[ 79%] Built target sndfile-concat
make[6]: Entering directory '/home/user/openwrt/build_dir/target-x86_64_glibc/libsndfile-2019-04-21-25824cb9'
make[6]: Leaving directory '/home/user/openwrt/build_dir/target-x86_64_glibc/libsndfile-2019-04-21-25824cb9'
[ 81%] Built target sndfile-deinterleave
make[6]: Entering directory '/home/user/openwrt/build_dir/target-x86_64_glibc/libsndfile-2019-04-21-25824cb9'
make[6]: Leaving directory '/home/user/openwrt/build_dir/target-x86_64_glibc/libsndfile-2019-04-21-25824cb9'
[ 82%] Built target sndfile-loopify
make[6]: Entering directory '/home/user/openwrt/build_dir/target-x86_64_glibc/libsndfile-2019-04-21-25824cb9'
make[6]: Leaving directory '/home/user/openwrt/build_dir/target-x86_64_glibc/libsndfile-2019-04-21-25824cb9'
[ 83%] Built target make_sine
make[6]: Entering directory '/home/user/openwrt/build_dir/target-x86_64_glibc/libsndfile-2019-04-21-25824cb9'
make[6]: Leaving directory '/home/user/openwrt/build_dir/target-x86_64_glibc/libsndfile-2019-04-21-25824cb9'
[ 85%] Built target sndfile-interleave
make[6]: Entering directory '/home/user/openwrt/build_dir/target-x86_64_glibc/libsndfile-2019-04-21-25824cb9'
make[6]: Leaving directory '/home/user/openwrt/build_dir/target-x86_64_glibc/libsndfile-2019-04-21-25824cb9'
[ 88%] Built target sndfile-info
make[6]: Entering directory '/home/user/openwrt/build_dir/target-x86_64_glibc/libsndfile-2019-04-21-25824cb9'
make[6]: Leaving directory '/home/user/openwrt/build_dir/target-x86_64_glibc/libsndfile-2019-04-21-25824cb9'
[ 90%] Built target sndfile-play
make[6]: Entering directory '/home/user/openwrt/build_dir/target-x86_64_glibc/libsndfile-2019-04-21-25824cb9'
make[6]: Leaving directory '/home/user/openwrt/build_dir/target-x86_64_glibc/libsndfile-2019-04-21-25824cb9'
[ 92%] Built target sndfile-convert
make[6]: Entering directory '/home/user/openwrt/build_dir/target-x86_64_glibc/libsndfile-2019-04-21-25824cb9'
make[6]: Leaving directory '/home/user/openwrt/build_dir/target-x86_64_glibc/libsndfile-2019-04-21-25824cb9'
[ 95%] Built target sndfile-cmp
make[6]: Entering directory '/home/user/openwrt/build_dir/target-x86_64_glibc/libsndfile-2019-04-21-25824cb9'
make[6]: Leaving directory '/home/user/openwrt/build_dir/target-x86_64_glibc/libsndfile-2019-04-21-25824cb9'
[ 97%] Built target sndfile-metadata-set
make[6]: Entering directory '/home/user/openwrt/build_dir/target-x86_64_glibc/libsndfile-2019-04-21-25824cb9'
make[6]: Leaving directory '/home/user/openwrt/build_dir/target-x86_64_glibc/libsndfile-2019-04-21-25824cb9'
[100%] Built target sndfile-metadata-get
make[5]: Leaving directory '/home/user/openwrt/build_dir/target-x86_64_glibc/libsndfile-2019-04-21-25824cb9'
Install the project...
-- Install configuration: "Release"
-- Installing: /home/user/openwrt/build_dir/target-x86_64_glibc/libsndfile-2019-04-21-25824cb9/ipkg-install/usr/lib/libsndfile.so.1.0.29
-- Installing: /home/user/openwrt/build_dir/target-x86_64_glibc/libsndfile-2019-04-21-25824cb9/ipkg-install/usr/lib/libsndfile.so.1
-- Installing: /home/user/openwrt/build_dir/target-x86_64_glibc/libsndfile-2019-04-21-25824cb9/ipkg-install/usr/lib/libsndfile.so
-- Installing: /home/user/openwrt/build_dir/target-x86_64_glibc/libsndfile-2019-04-21-25824cb9/ipkg-install/usr/include/sndfile.hh
-- Installing: /home/user/openwrt/build_dir/target-x86_64_glibc/libsndfile-2019-04-21-25824cb9/ipkg-install/usr/include/sndfile.h
-- Installing: /home/user/openwrt/build_dir/target-x86_64_glibc/libsndfile-2019-04-21-25824cb9/ipkg-install/usr/bin/sndfile-info
-- Installing: /home/user/openwrt/build_dir/target-x86_64_glibc/libsndfile-2019-04-21-25824cb9/ipkg-install/usr/bin/sndfile-play
-- Installing: /home/user/openwrt/build_dir/target-x86_64_glibc/libsndfile-2019-04-21-25824cb9/ipkg-install/usr/bin/sndfile-convert
-- Installing: /home/user/openwrt/build_dir/target-x86_64_glibc/libsndfile-2019-04-21-25824cb9/ipkg-install/usr/bin/sndfile-cmp
-- Installing: /home/user/openwrt/build_dir/target-x86_64_glibc/libsndfile-2019-04-21-25824cb9/ipkg-install/usr/bin/sndfile-metadata-set
-- Installing: /home/user/openwrt/build_dir/target-x86_64_glibc/libsndfile-2019-04-21-25824cb9/ipkg-install/usr/bin/sndfile-metadata-get
-- Installing: /home/user/openwrt/build_dir/target-x86_64_glibc/libsndfile-2019-04-21-25824cb9/ipkg-install/usr/bin/sndfile-interleave
-- Installing: /home/user/openwrt/build_dir/target-x86_64_glibc/libsndfile-2019-04-21-25824cb9/ipkg-install/usr/bin/sndfile-deinterleave
-- Installing: /home/user/openwrt/build_dir/target-x86_64_glibc/libsndfile-2019-04-21-25824cb9/ipkg-install/usr/bin/sndfile-concat
-- Installing: /home/user/openwrt/build_dir/target-x86_64_glibc/libsndfile-2019-04-21-25824cb9/ipkg-install/usr/bin/sndfile-salvage
-- Installing: /home/user/openwrt/build_dir/target-x86_64_glibc/libsndfile-2019-04-21-25824cb9/ipkg-install/usr/lib/cmake/SndFile/SndFileConfig.cmake
-- Installing: /home/user/openwrt/build_dir/target-x86_64_glibc/libsndfile-2019-04-21-25824cb9/ipkg-install/usr/lib/cmake/SndFile/SndFileConfig-release.cmake
-- Installing: /home/user/openwrt/build_dir/target-x86_64_glibc/libsndfile-2019-04-21-25824cb9/ipkg-install/usr/lib/cmake/SndFile/SndFileConfigVersion.cmake
-- Installing: /home/user/openwrt/build_dir/target-x86_64_glibc/libsndfile-2019-04-21-25824cb9/ipkg-install/usr/share/man/man1/sndfile-info.1
-- Installing: /home/user/openwrt/build_dir/target-x86_64_glibc/libsndfile-2019-04-21-25824cb9/ipkg-install/usr/share/man/man1/sndfile-play.1
-- Installing: /home/user/openwrt/build_dir/target-x86_64_glibc/libsndfile-2019-04-21-25824cb9/ipkg-install/usr/share/man/man1/sndfile-convert.1
-- Installing: /home/user/openwrt/build_dir/target-x86_64_glibc/libsndfile-2019-04-21-25824cb9/ipkg-install/usr/share/man/man1/sndfile-cmp.1
-- Installing: /home/user/openwrt/build_dir/target-x86_64_glibc/libsndfile-2019-04-21-25824cb9/ipkg-install/usr/share/man/man1/sndfile-metadata-get.1
-- Installing: /home/user/openwrt/build_dir/target-x86_64_glibc/libsndfile-2019-04-21-25824cb9/ipkg-install/usr/share/man/man1/sndfile-concat.1
-- Installing: /home/user/openwrt/build_dir/target-x86_64_glibc/libsndfile-2019-04-21-25824cb9/ipkg-install/usr/share/man/man1/sndfile-interleave.1
-- Installing: /home/user/openwrt/build_dir/target-x86_64_glibc/libsndfile-2019-04-21-25824cb9/ipkg-install/usr/share/man/man1/sndfile-salvage.1
-- Installing: /home/user/openwrt/build_dir/target-x86_64_glibc/libsndfile-2019-04-21-25824cb9/ipkg-install/usr/share/doc/libsndfile/index.html
-- Installing: /home/user/openwrt/build_dir/target-x86_64_glibc/libsndfile-2019-04-21-25824cb9/ipkg-install/usr/share/doc/libsndfile/libsndfile.jpg
-- Installing: /home/user/openwrt/build_dir/target-x86_64_glibc/libsndfile-2019-04-21-25824cb9/ipkg-install/usr/share/doc/libsndfile/libsndfile.css
-- Installing: /home/user/openwrt/build_dir/target-x86_64_glibc/libsndfile-2019-04-21-25824cb9/ipkg-install/usr/share/doc/libsndfile/print.css
-- Installing: /home/user/openwrt/build_dir/target-x86_64_glibc/libsndfile-2019-04-21-25824cb9/ipkg-install/usr/share/doc/libsndfile/api.html
-- Installing: /home/user/openwrt/build_dir/target-x86_64_glibc/libsndfile-2019-04-21-25824cb9/ipkg-install/usr/share/doc/libsndfile/command.html
-- Installing: /home/user/openwrt/build_dir/target-x86_64_glibc/libsndfile-2019-04-21-25824cb9/ipkg-install/usr/share/doc/libsndfile/bugs.html
-- Installing: /home/user/openwrt/build_dir/target-x86_64_glibc/libsndfile-2019-04-21-25824cb9/ipkg-install/usr/share/doc/libsndfile/sndfile_info.html
-- Installing: /home/user/openwrt/build_dir/target-x86_64_glibc/libsndfile-2019-04-21-25824cb9/ipkg-install/usr/share/doc/libsndfile/new_file_type.HOWTO
-- Installing: /home/user/openwrt/build_dir/target-x86_64_glibc/libsndfile-2019-04-21-25824cb9/ipkg-install/usr/share/doc/libsndfile/win32.html
-- Installing: /home/user/openwrt/build_dir/target-x86_64_glibc/libsndfile-2019-04-21-25824cb9/ipkg-install/usr/share/doc/libsndfile/FAQ.html
-- Installing: /home/user/openwrt/build_dir/target-x86_64_glibc/libsndfile-2019-04-21-25824cb9/ipkg-install/usr/share/doc/libsndfile/lists.html
-- Installing: /home/user/openwrt/build_dir/target-x86_64_glibc/libsndfile-2019-04-21-25824cb9/ipkg-install/usr/share/doc/libsndfile/embedded_files.html
-- Installing: /home/user/openwrt/build_dir/target-x86_64_glibc/libsndfile-2019-04-21-25824cb9/ipkg-install/usr/share/doc/libsndfile/octave.html
-- Installing: /home/user/openwrt/build_dir/target-x86_64_glibc/libsndfile-2019-04-21-25824cb9/ipkg-install/usr/share/doc/libsndfile/tutorial.html
-- Installing: /home/user/openwrt/build_dir/target-x86_64_glibc/libsndfile-2019-04-21-25824cb9/ipkg-install/usr/lib/pkgconfig/sndfile.pc
make[4]: Leaving directory '/home/user/openwrt/build_dir/target-x86_64_glibc/libsndfile-2019-04-21-25824cb9'
touch /home/user/openwrt/build_dir/target-x86_64_glibc/libsndfile-2019-04-21-25824cb9/.built
rm -rf /home/user/openwrt/tmp/stage-libsndfile
mkdir -p /home/user/openwrt/tmp/stage-libsndfile/host /home/user/openwrt/staging_dir/target-x86_64_glibc/packages /home/user/openwrt/staging_dir/host/packages
install -d -m0755 /home/user/openwrt/tmp/stage-libsndfile
cp -fpR /home/user/openwrt/build_dir/target-x86_64_glibc/libsndfile-2019-04-21-25824cb9/ipkg-install/* /home/user/openwrt/tmp/stage-libsndfile/
find /home/user/openwrt/tmp/stage-libsndfile -name '*.la' | xargs -r rm -f; 
if [ -f /home/user/openwrt/staging_dir/target-x86_64_glibc/packages/libsndfile.list ]; then /home/user/openwrt/scripts/clean-package.sh "/home/user/openwrt/staging_dir/target-x86_64_glibc/packages/libsndfile.list" "/home/user/openwrt/staging_dir/target-x86_64_glibc"; fi
if [ -d /home/user/openwrt/tmp/stage-libsndfile ]; then (cd /home/user/openwrt/tmp/stage-libsndfile; find ./ > /home/user/openwrt/tmp/stage-libsndfile.files); 	SHELL= flock /home/user/openwrt/tmp/.staging-dir.flock -c ' mv /home/user/openwrt/tmp/stage-libsndfile.files /home/user/openwrt/staging_dir/target-x86_64_glibc/packages/libsndfile.list && cp -fpR /home/user/openwrt/tmp/stage-libsndfile/* /home/user/openwrt/staging_dir/target-x86_64_glibc/; '; fi
rm -rf /home/user/openwrt/tmp/stage-libsndfile
touch /home/user/openwrt/staging_dir/target-x86_64_glibc/stamp/.libsndfile_installed
make[3]: Leaving directory '/home/user/openwrt/feeds/packages/libs/libsndfile'
time: package/feeds/packages/libsndfile/compile#18.17#4.39#23.10
make[2]: Leaving directory '/home/user/openwrt'
make[1]: *** [package/Makefile:107: /home/user/openwrt/staging_dir/target-x86_64_glibc/stamp/.package_compile] Error 2
make[1]: Leaving directory '/home/user/openwrt'
make: *** [/home/user/openwrt/include/toplevel.mk:218: world] Error 2
Build complete: failed 1 year, 11 days ago (took an hour)