#85263 success

Note

3c83006axect

Ver 0.15.1 - More BLAS for Vector

Owner
~axect
Created
3 months ago
Updated
3 months ago
Build manifest
view manifest »

Tasks

view log »
setup view log »
nightly view log »
docs view log »
go to bottom »
setup
1
2
3
4
5
6
7
8
9
10
11
12
13
14
15
16
17
18
19
20
21
22
23
24
25
26
27
28
29
30
31
32
33
34
35
36
37
38
39
40
41
42
43
44
45
46
47
48
49
50
51
52
53
54
55
56
57
58
59
60
61
62
63
64
65
66
67
68
69
70
71
72
73
74
75
76
77
78
79
80
81
82
83
84
85
86
87
88
89
90
91
92
93
94
95
96
97
98
99
100
101
102
103
104
105
106
107
108
109
110
111
112
113
[#85263] 2019/08/29 03:16:27 Booting image archlinux (default) on port 22356
[#85263] 2019/08/29 03:16:30 Waiting for guest to settle
[#85263] 2019/08/29 03:17:34 Sending tasks
[#85263] 2019/08/29 03:17:35 Sending build environment
[#85263] 2019/08/29 03:17:35 Installing packages
Warning: Permanently added '[localhost]:22356' (ECDSA) to the list of known hosts.
:: Synchronizing package databases...
 core is up to date
downloading extra.db...
downloading community.db...
:: Starting full system upgrade...
resolving dependencies...
looking for conflicting packages...
warning: dependency cycle detected:
warning: harfbuzz will be installed before its freetype2 dependency

Packages (20) blas-3.8.0-2  cblas-3.8.0-2  freetype2-2.10.1-1  graphite-1:1.3.13-1  harfbuzz-2.6.1-1  lapack-3.8.0-2  libpng-1.6.37-1  python-appdirs-1.4.3-2  python-attrs-19.1.0-1  python-cycler-0.10.0-3  python-dateutil-2.8.0-1  python-kiwisolver-1.1.0-1  python-numpy-1.17.0-1  python-packaging-19.1-2  python-pyparsing-2.4.2-1  python-setuptools-1:41.2.0-1  python-six-1.12.0-1  python-3.7.4-1  python-matplotlib-3.1.1-1  rustup-1.18.3-1

Total Download Size:    50.13 MiB
Total Installed Size:  215.03 MiB

:: Proceed with installation? [Y/n] 
:: Retrieving packages...
downloading python-3.7.4-1-x86_64.pkg.tar.xz...
downloading libpng-1.6.37-1-x86_64.pkg.tar.xz...
downloading graphite-1:1.3.13-1-x86_64.pkg.tar.xz...
downloading harfbuzz-2.6.1-1-x86_64.pkg.tar.xz...
downloading freetype2-2.10.1-1-x86_64.pkg.tar.xz...
downloading blas-3.8.0-2-x86_64.pkg.tar.xz...
downloading cblas-3.8.0-2-x86_64.pkg.tar.xz...
downloading lapack-3.8.0-2-x86_64.pkg.tar.xz...
downloading python-numpy-1.17.0-1-x86_64.pkg.tar.xz...
downloading python-six-1.12.0-1-any.pkg.tar.xz...
downloading python-appdirs-1.4.3-2-any.pkg.tar.xz...
downloading python-attrs-19.1.0-1-any.pkg.tar.xz...
downloading python-pyparsing-2.4.2-1-any.pkg.tar.xz...
downloading python-packaging-19.1-2-any.pkg.tar.xz...
downloading python-setuptools-1:41.2.0-1-any.pkg.tar.xz...
downloading rustup-1.18.3-1-x86_64.pkg.tar.xz...
downloading python-cycler-0.10.0-3-any.pkg.tar.xz...
downloading python-dateutil-2.8.0-1-any.pkg.tar.xz...
downloading python-kiwisolver-1.1.0-1-x86_64.pkg.tar.xz...
downloading python-matplotlib-3.1.1-1-x86_64.pkg.tar.xz...
checking keyring...
checking package integrity...
loading package files...
checking for file conflicts...
checking available disk space...
:: Processing package changes...
installing rustup...
You may need to run rustup update stable
and possibly also rustup self upgrade-data
Optional dependencies for rustup
    lldb: rust-lldb script
    gdb: rust-gdb script
installing python...
Optional dependencies for python
    python-setuptools [pending]
    python-pip
    sqlite [installed]
    mpdecimal: for decimal
    xz: for lzma [installed]
    tk: for tkinter
installing libpng...
installing graphite...
installing harfbuzz...
Optional dependencies for harfbuzz
    cairo: hb-view program
installing freetype2...
installing blas...
installing cblas...
installing lapack...
installing python-numpy...
Optional dependencies for python-numpy
    python-nose: testsuite
    openblas: faster linear algebra
installing python-six...
installing python-cycler...
installing python-dateutil...
installing python-appdirs...
installing python-attrs...
installing python-pyparsing...
installing python-packaging...
installing python-setuptools...
installing python-kiwisolver...
installing python-matplotlib...
Optional dependencies for python-matplotlib
    tk: Tk{Agg,Cairo} backends
    python-pyqt5: Qt5{Agg,Cairo} backends
    python-gobject: for GTK3{Agg,Cairo} backend
    python-wxpython: WX{,Agg,Cairo} backend
    python-cairo: {GTK3,Qt5,Tk,WX}Cairo backends
    python-cairocffi: alternative for Cairo backends
    python-tornado: WebAgg backend
    ffmpeg: for saving movies
    imagemagick: for saving animated gifs
    python-pillow: for reading/saving jpeg/bmp/tiff files
    ghostscript: usetex dependencies
    texlive-bin: usetex dependencies
:: Running post-transaction hooks...
(1/1) Arming ConditionNeedsUpdate...
:: Searching databases for updates...
:: Searching AUR for updates...
 there is nothing to do
[#85263] 2019/08/29 03:17:56 Cloning repositories
Cloning into 'Peroxide'...
+ cd Peroxide
+ git checkout -q 3c83006649f46cdefb037dd38b26d4ee04102ec0
+ cd Peroxide
+ git submodule update --init
[#85263] 2019/08/29 03:17:59 Running task setup
[#85263] 2019/08/29 03:19:25 Running task nightly
[#85263] 2019/08/29 03:21:16 Running task docs
setup
1
2
3
4
5
6
7
8
9
10
11
12
13
14
15
16
17
18
19
20
21
22
23
24
25
26
27
28
29
30
31
32
33
34
35
36
37
38
39
40
41
42
43
44
45
46
47
48
49
50
51
52
53
54
55
56
57
58
59
60
61
62
63
64
65
66
67
68
69
70
71
72
73
74
75
76
77
78
79
80
81
82
83
84
85
86
87
88
89
90
91
92
93
94
95
96
97
98
99
100
101
102
103
104
105
106
107
108
109
110
111
112
113
114
115
116
117
118
119
120
121
122
123
124
125
126
127
128
129
130
131
132
133
134
135
136
137
138
139
140
141
142
143
144
145
146
147
148
149
150
151
152
153
154
155
156
157
158
159
160
161
162
163
164
165
166
167
168
169
170
171
+ rustup toolchain install nightly
info: syncing channel updates for 'nightly-x86_64-unknown-linux-gnu'
info: latest update on 2019-08-29, rust version 1.39.0-nightly (17e73e801 2019-08-28)
info: downloading component 'rustc'

  9.4 MiB /  66.1 MiB ( 14 %)   0 B/s in  1s ETA: Unknown
                                                         
 18.2 MiB /  66.1 MiB ( 28 %)   9.4 MiB/s in  2s ETA:  5s
                                                         
 27.5 MiB /  66.1 MiB ( 42 %)   9.1 MiB/s in  3s ETA:  4s
                                                         
 36.8 MiB /  66.1 MiB ( 56 %)   9.2 MiB/s in  4s ETA:  3s
                                                         
 45.9 MiB /  66.1 MiB ( 69 %)   9.2 MiB/s in  5s ETA:  2s
                                                         
 55.2 MiB /  66.1 MiB ( 84 %)   9.2 MiB/s in  6s ETA:  1s
                                                         
 63.8 MiB /  66.1 MiB ( 96 %)   9.2 MiB/s in  7s ETA:  0s
                                                         
 66.1 MiB /  66.1 MiB (100 %)   9.1 MiB/s in  7s ETA:  0s
info: downloading component 'rust-std'

  9.2 MiB / 174.4 MiB (  5 %)   0 B/s in  1s ETA: Unknown
                                                         
 18.5 MiB / 174.4 MiB ( 11 %)   9.2 MiB/s in  2s ETA: 16s
                                                         
 26.3 MiB / 174.4 MiB ( 15 %)   9.3 MiB/s in  3s ETA: 15s
                                                         
 35.3 MiB / 174.4 MiB ( 20 %)   8.8 MiB/s in  4s ETA: 15s
                                                         
 42.7 MiB / 174.4 MiB ( 24 %)   8.8 MiB/s in  5s ETA: 14s
                                                         
 51.9 MiB / 174.4 MiB ( 30 %)   8.5 MiB/s in  6s ETA: 14s
                                                         
 61.0 MiB / 174.4 MiB ( 35 %)   8.5 MiB/s in  7s ETA: 13s
                                                         
 70.4 MiB / 174.4 MiB ( 40 %)   8.5 MiB/s in  8s ETA: 12s
                                                         
 79.8 MiB / 174.4 MiB ( 46 %)   8.8 MiB/s in  9s ETA: 10s
                                                         
 89.1 MiB / 174.4 MiB ( 51 %)   8.9 MiB/s in 10s ETA:  9s
                                                         
 98.3 MiB / 174.4 MiB ( 56 %)   9.3 MiB/s in 11s ETA:  8s
                                                         
107.6 MiB / 174.4 MiB ( 62 %)   9.3 MiB/s in 12s ETA:  7s
                                                         
114.5 MiB / 174.4 MiB ( 66 %)   9.3 MiB/s in 13s ETA:  6s
                                                         
122.2 MiB / 174.4 MiB ( 70 %)   8.8 MiB/s in 14s ETA:  5s
                                                         
131.2 MiB / 174.4 MiB ( 75 %)   8.5 MiB/s in 15s ETA:  5s
                                                         
140.4 MiB / 174.4 MiB ( 81 %)   8.4 MiB/s in 16s ETA:  4s
                                                         
149.7 MiB / 174.4 MiB ( 86 %)   8.4 MiB/s in 17s ETA:  2s
                                                         
158.8 MiB / 174.4 MiB ( 91 %)   8.4 MiB/s in 18s ETA:  1s
                                                         
167.6 MiB / 174.4 MiB ( 96 %)   8.9 MiB/s in 19s ETA:  0s
                                                         
174.4 MiB / 174.4 MiB (100 %)   9.1 MiB/s in 19s ETA:  0s
info: downloading component 'cargo'
info: downloading component 'rust-docs'

  9.2 MiB /  11.7 MiB ( 79 %)   0 B/s in  1s ETA: Unknown
                                                         
 11.7 MiB /  11.7 MiB (100 %)   9.2 MiB/s in  1s ETA:  0s
info: installing component 'rustc'

 10.3 MiB /  66.1 MiB ( 16 %)   0 B/s in  1s ETA: Unknown
                                                         
 20.7 MiB /  66.1 MiB ( 31 %)  10.3 MiB/s in  2s ETA:  4s
                                                         
 31.4 MiB /  66.1 MiB ( 47 %)  10.3 MiB/s in  3s ETA:  3s
                                                         
 41.4 MiB /  66.1 MiB ( 63 %)  10.5 MiB/s in  4s ETA:  2s
                                                         
 50.4 MiB /  66.1 MiB ( 76 %)  10.4 MiB/s in  5s ETA:  1s
                                                         
 59.8 MiB /  66.1 MiB ( 90 %)  10.1 MiB/s in  6s ETA:  0sinfo: installing component 'rust-std'

                                                         
 70.0 MiB / 174.4 MiB ( 40 %)   9.9 MiB/s in  7s ETA: 10s
                                                         
 86.1 MiB / 174.4 MiB ( 49 %)   9.9 MiB/s in  8s ETA:  8s
                                                         
108.1 MiB / 174.4 MiB ( 62 %)  10.9 MiB/s in  9s ETA:  6s
                                                         
125.0 MiB / 174.4 MiB ( 72 %)  13.3 MiB/s in 10s ETA:  3s
                                                         
158.2 MiB / 174.4 MiB ( 91 %)  14.9 MiB/s in 11s ETA:  1s
                                                         
172.0 MiB / 174.4 MiB ( 99 %)  19.7 MiB/s in 12s ETA:  0s
                                                         
186.3 MiB / 174.4 MiB (107 %)  20.4 MiB/s in 13s ETA:  0s
                                                         
212.7 MiB / 174.4 MiB (122 %)  20.0 MiB/s in 14s ETA: 49710d  6h 28m 15s
                                                                        
228.6 MiB / 174.4 MiB (131 %)  20.9 MiB/s in 15s ETA: 49710d  6h 28m 14s
                                                                        
237.1 MiB / 174.4 MiB (136 %)  20.7 MiB/s in 16s ETA: 49710d  6h 28m 13s
                                                                        
240.5 MiB / 174.4 MiB (138 %)  15.8 MiB/s in 16s ETA: 49710d  6h 28m 12s
info: installing component 'cargo'
info: installing component 'rust-docs'

  4.7 MiB /  11.7 MiB ( 40 %)   0 B/s in  1s ETA: Unknown
                                                         
  8.4 MiB /  11.7 MiB ( 72 %)   4.7 MiB/s in  2s ETA:  0s
                                                         
 11.7 MiB /  11.7 MiB (100 %)   4.2 MiB/s in  2s ETA:  0s

  nightly-x86_64-unknown-linux-gnu installed - rustc 1.39.0-nightly (17e73e801 2019-08-28)

+ cd Peroxide/
+ rustup run nightly cargo fetch
    Updating crates.io index
 Downloading crates ...
  Downloaded rand v0.7.0
  Downloaded wasi v0.5.0
  Downloaded ppv-lite86 v0.2.5
  Downloaded spin v0.5.2
  Downloaded rand_hc v0.2.0
  Downloaded memchr v2.2.1
  Downloaded unicode-xid v0.1.0
  Downloaded num-traits v0.2.8
  Downloaded proc-macro-hack-impl v0.4.2
  Downloaded syn v1.0.5
  Downloaded itoa v0.4.4
  Downloaded serde v1.0.99
  Downloaded libc v0.2.62
  Downloaded byteorder v1.3.2
  Downloaded version_check v0.1.5
  Downloaded lazy_static v1.4.0
  Downloaded aho-corasick v0.7.6
  Downloaded unicode-xid v0.2.0
  Downloaded csv v1.1.1
  Downloaded regex-automata v0.1.8
  Downloaded rand_core v0.5.1
  Downloaded cfg-if v0.1.9
  Downloaded special v0.8.1
  Downloaded c2-chacha v0.2.2
  Downloaded regex-syntax v0.6.11
  Downloaded regex v1.2.1
  Downloaded quote v0.6.13
  Downloaded proc-macro2 v0.4.30
  Downloaded getrandom v0.1.11
  Downloaded ghost v0.1.1
  Downloaded quote v1.0.2
  Downloaded autocfg v0.1.6
  Downloaded blas v0.20.0
  Downloaded pyo3 v0.7.0
  Downloaded lapack v0.16.0
  Downloaded csv-core v0.1.6
  Downloaded mashup v0.1.9
  Downloaded syn v0.15.44
  Downloaded inventory v0.1.4
  Downloaded thread_local v0.3.6
  Downloaded pyo3cls v0.7.0
  Downloaded proc-macro2 v1.0.1
  Downloaded ctor v0.1.10
  Downloaded pyo3-derive-backend v0.7.0
  Downloaded ryu v1.0.0
  Downloaded num-complex v0.2.3
  Downloaded bstr v0.2.7
  Downloaded mashup-impl v0.1.9
  Downloaded inventory-impl v0.1.4
  Downloaded rand_chacha v0.2.1
  Downloaded proc-macro-hack v0.4.2
  Downloaded lapack-sys v0.12.1
  Downloaded blas-sys v0.7.1
nightly
1
2
3
4
5
6
7
8
9
10
11
12
13
14
15
16
17
18
19
20
21
22
23
24
25
26
27
28
29
30
31
32
33
34
35
36
37
38
39
40
41
42
43
44
45
46
47
48
49
50
51
52
53
54
55
56
57
58
59
60
61
62
63
64
65
66
67
68
69
70
71
72
73
74
75
76
77
78
79
80
81
82
83
84
85
86
87
88
89
90
91
92
93
94
95
96
97
98
99
100
101
102
103
104
105
106
107
108
109
110
111
112
113
114
115
116
117
118
119
120
121
122
123
124
125
126
127
128
129
130
131
132
133
134
135
136
137
138
139
140
141
142
143
144
145
146
147
148
149
150
151
152
153
154
155
156
157
158
159
160
161
162
163
164
165
166
167
168
169
170
171
172
173
174
175
176
177
178
179
180
181
182
183
184
185
186
187
188
189
190
191
192
193
194
195
196
197
198
199
200
201
202
203
204
205
206
207
208
209
210
211
212
213
214
215
216
217
218
219
220
221
222
223
224
225
226
227
228
229
230
231
232
233
234
235
236
237
238
239
240
241
242
243
244
245
246
247
248
249
250
251
252
253
254
255
256
257
258
259
260
261
262
263
264
265
266
267
268
269
270
271
272
273
274
275
276
277
278
279
280
281
282
283
284
285
286
287
288
289
290
291
292
293
294
295
296
297
298
299
300
301
302
303
304
305
306
307
308
309
310
311
312
313
314
315
316
317
318
319
320
321
322
323
324
325
326
327
328
329
330
331
332
333
334
335
336
337
338
339
340
341
342
343
344
345
346
347
348
349
350
351
352
353
354
355
356
357
358
359
360
361
362
363
364
365
366
367
368
369
370
371
372
373
374
375
376
377
378
379
380
381
382
383
384
385
386
387
388
389
390
391
392
393
394
395
396
397
398
399
400
401
402
403
404
405
406
407
408
409
410
411
412
413
414
415
416
417
418
419
420
421
422
423
424
425
426
427
428
429
430
431
432
433
434
435
436
437
438
439
440
441
442
443
444
445
446
447
448
449
450
451
452
453
454
+ rustup default nightly
info: using existing install for 'nightly-x86_64-unknown-linux-gnu'
info: default toolchain set to 'nightly-x86_64-unknown-linux-gnu'

  nightly-x86_64-unknown-linux-gnu unchanged - rustc 1.39.0-nightly (17e73e801 2019-08-28)

+ cd Peroxide/
+ cargo build --verbose
   Compiling libc v0.2.62
     Running `rustc --crate-name build_script_build /home/build/.cargo/registry/src/github.com-1ecc6299db9ec823/libc-0.2.62/build.rs --color always --crate-type bin --emit=dep-info,link -C debuginfo=2 --cfg 'feature="default"' --cfg 'feature="std"' -C metadata=6c452620c68d2685 -C extra-filename=-6c452620c68d2685 --out-dir /home/build/Peroxide/target/debug/build/libc-6c452620c68d2685 -L dependency=/home/build/Peroxide/target/debug/deps --cap-lints allow`
   Compiling getrandom v0.1.11
     Running `rustc --edition=2018 --crate-name build_script_build /home/build/.cargo/registry/src/github.com-1ecc6299db9ec823/getrandom-0.1.11/build.rs --color always --crate-type bin --emit=dep-info,link -C debuginfo=2 --cfg 'feature="std"' -C metadata=c2b4f46d48640ec0 -C extra-filename=-c2b4f46d48640ec0 --out-dir /home/build/Peroxide/target/debug/build/getrandom-c2b4f46d48640ec0 -L dependency=/home/build/Peroxide/target/debug/deps --cap-lints allow`
   Compiling byteorder v1.3.2
     Running `rustc --crate-name build_script_build /home/build/.cargo/registry/src/github.com-1ecc6299db9ec823/byteorder-1.3.2/build.rs --color always --crate-type bin --emit=dep-info,link -C debuginfo=2 -C metadata=69806699b484e2ff -C extra-filename=-69806699b484e2ff --out-dir /home/build/Peroxide/target/debug/build/byteorder-69806699b484e2ff -L dependency=/home/build/Peroxide/target/debug/deps --cap-lints allow`
   Compiling serde v1.0.99
     Running `rustc --crate-name build_script_build /home/build/.cargo/registry/src/github.com-1ecc6299db9ec823/serde-1.0.99/build.rs --color always --crate-type bin --emit=dep-info,link -C debuginfo=2 --cfg 'feature="default"' --cfg 'feature="std"' -C metadata=c53e2e0baf904a74 -C extra-filename=-c53e2e0baf904a74 --out-dir /home/build/Peroxide/target/debug/build/serde-c53e2e0baf904a74 -L dependency=/home/build/Peroxide/target/debug/deps --cap-lints allow`
   Compiling memchr v2.2.1
     Running `rustc --crate-name build_script_build /home/build/.cargo/registry/src/github.com-1ecc6299db9ec823/memchr-2.2.1/build.rs --color always --crate-type bin --emit=dep-info,link -C debuginfo=2 --cfg 'feature="libc"' --cfg 'feature="use_std"' -C metadata=ec6bc5463de2ff72 -C extra-filename=-ec6bc5463de2ff72 --out-dir /home/build/Peroxide/target/debug/build/memchr-ec6bc5463de2ff72 -L dependency=/home/build/Peroxide/target/debug/deps --cap-lints allow`
   Compiling cfg-if v0.1.9
     Running `rustc --crate-name cfg_if /home/build/.cargo/registry/src/github.com-1ecc6299db9ec823/cfg-if-0.1.9/src/lib.rs --error-format=json --json=diagnostic-rendered-ansi,artifacts --crate-type lib --emit=dep-info,metadata,link -C debuginfo=2 -C metadata=8912e9b9afce0109 -C extra-filename=-8912e9b9afce0109 --out-dir /home/build/Peroxide/target/debug/deps -L dependency=/home/build/Peroxide/target/debug/deps --cap-lints allow`
   Compiling ppv-lite86 v0.2.5
     Running `rustc --edition=2018 --crate-name ppv_lite86 /home/build/.cargo/registry/src/github.com-1ecc6299db9ec823/ppv-lite86-0.2.5/src/lib.rs --error-format=json --json=diagnostic-rendered-ansi,artifacts --crate-type lib --emit=dep-info,metadata,link -C debuginfo=2 --cfg 'feature="default"' --cfg 'feature="simd"' --cfg 'feature="std"' -C metadata=0141b9912c847b93 -C extra-filename=-0141b9912c847b93 --out-dir /home/build/Peroxide/target/debug/deps -L dependency=/home/build/Peroxide/target/debug/deps --cap-lints allow`
   Compiling ryu v1.0.0
     Running `rustc --crate-name build_script_build /home/build/.cargo/registry/src/github.com-1ecc6299db9ec823/ryu-1.0.0/build.rs --color always --crate-type bin --emit=dep-info,link -C debuginfo=2 -C metadata=d5921fa4dbaa03bd -C extra-filename=-d5921fa4dbaa03bd --out-dir /home/build/Peroxide/target/debug/build/ryu-d5921fa4dbaa03bd -L dependency=/home/build/Peroxide/target/debug/deps --cap-lints allow`
   Compiling lazy_static v1.4.0
     Running `rustc --crate-name lazy_static /home/build/.cargo/registry/src/github.com-1ecc6299db9ec823/lazy_static-1.4.0/src/lib.rs --error-format=json --json=diagnostic-rendered-ansi,artifacts --crate-type lib --emit=dep-info,metadata,link -C debuginfo=2 -C metadata=39ef7c038685ef10 -C extra-filename=-39ef7c038685ef10 --out-dir /home/build/Peroxide/target/debug/deps -L dependency=/home/build/Peroxide/target/debug/deps --cap-lints allow`
   Compiling peroxide v0.15.1 (/home/build/Peroxide)
     Running `rustc --crate-name build_script_build build.rs --color always --crate-type bin --emit=dep-info,link -C debuginfo=2 --cfg 'feature="default"' -C metadata=15478fbb34fa1fe6 -C extra-filename=-15478fbb34fa1fe6 --out-dir /home/build/Peroxide/target/debug/build/peroxide-15478fbb34fa1fe6 -C incremental=/home/build/Peroxide/target/debug/incremental -L dependency=/home/build/Peroxide/target/debug/deps`
   Compiling itoa v0.4.4
     Running `rustc --crate-name itoa /home/build/.cargo/registry/src/github.com-1ecc6299db9ec823/itoa-0.4.4/src/lib.rs --error-format=json --json=diagnostic-rendered-ansi,artifacts --crate-type lib --emit=dep-info,metadata,link -C debuginfo=2 --cfg 'feature="default"' --cfg 'feature="std"' -C metadata=03fdb419ebf31494 -C extra-filename=-03fdb419ebf31494 --out-dir /home/build/Peroxide/target/debug/deps -L dependency=/home/build/Peroxide/target/debug/deps --cap-lints allow`
     Running `/home/build/Peroxide/target/debug/build/libc-6c452620c68d2685/build-script-build`
     Running `/home/build/Peroxide/target/debug/build/getrandom-c2b4f46d48640ec0/build-script-build`
     Running `/home/build/Peroxide/target/debug/build/byteorder-69806699b484e2ff/build-script-build`
     Running `/home/build/Peroxide/target/debug/build/serde-c53e2e0baf904a74/build-script-build`
     Running `/home/build/Peroxide/target/debug/build/memchr-ec6bc5463de2ff72/build-script-build`
     Running `/home/build/Peroxide/target/debug/build/ryu-d5921fa4dbaa03bd/build-script-build`
   Compiling c2-chacha v0.2.2
     Running `rustc --edition=2018 --crate-name c2_chacha /home/build/.cargo/registry/src/github.com-1ecc6299db9ec823/c2-chacha-0.2.2/src/lib.rs --error-format=json --json=diagnostic-rendered-ansi,artifacts --crate-type lib --emit=dep-info,metadata,link -C debuginfo=2 --cfg 'feature="lazy_static"' --cfg 'feature="simd"' --cfg 'feature="std"' -C metadata=77a1ac2d9d6cc5b2 -C extra-filename=-77a1ac2d9d6cc5b2 --out-dir /home/build/Peroxide/target/debug/deps -L dependency=/home/build/Peroxide/target/debug/deps --extern lazy_static=/home/build/Peroxide/target/debug/deps/liblazy_static-39ef7c038685ef10.rmeta --extern ppv_lite86=/home/build/Peroxide/target/debug/deps/libppv_lite86-0141b9912c847b93.rmeta --cap-lints allow`
     Running `/home/build/Peroxide/target/debug/build/peroxide-15478fbb34fa1fe6/build-script-build`
     Running `rustc --crate-name libc /home/build/.cargo/registry/src/github.com-1ecc6299db9ec823/libc-0.2.62/src/lib.rs --error-format=json --json=diagnostic-rendered-ansi,artifacts --crate-type lib --emit=dep-info,metadata,link -C debuginfo=2 --cfg 'feature="default"' --cfg 'feature="std"' -C metadata=066dfea92045aa46 -C extra-filename=-066dfea92045aa46 --out-dir /home/build/Peroxide/target/debug/deps -L dependency=/home/build/Peroxide/target/debug/deps --cap-lints allow --cfg freebsd11 --cfg libc_priv_mod_use --cfg libc_union --cfg libc_const_size_of --cfg libc_align --cfg libc_core_cvoid --cfg libc_packedN`
     Running `rustc --crate-name byteorder /home/build/.cargo/registry/src/github.com-1ecc6299db9ec823/byteorder-1.3.2/src/lib.rs --error-format=json --json=diagnostic-rendered-ansi,artifacts --crate-type lib --emit=dep-info,metadata,link -C debuginfo=2 -C metadata=d1ddfb9cd6307ac7 -C extra-filename=-d1ddfb9cd6307ac7 --out-dir /home/build/Peroxide/target/debug/deps -L dependency=/home/build/Peroxide/target/debug/deps --cap-lints allow --cfg byteorder_i128`
     Running `rustc --crate-name serde /home/build/.cargo/registry/src/github.com-1ecc6299db9ec823/serde-1.0.99/src/lib.rs --error-format=json --json=diagnostic-rendered-ansi,artifacts --crate-type lib --emit=dep-info,metadata,link -C debuginfo=2 --cfg 'feature="default"' --cfg 'feature="std"' -C metadata=a1427d268c48aacd -C extra-filename=-a1427d268c48aacd --out-dir /home/build/Peroxide/target/debug/deps -L dependency=/home/build/Peroxide/target/debug/deps --cap-lints allow --cfg ops_bound --cfg core_reverse --cfg de_boxed_c_str --cfg de_rc_dst --cfg core_duration --cfg integer128 --cfg range_inclusive --cfg num_nonzero --cfg core_try_from --cfg num_nonzero_signed --cfg std_atomic64 --cfg std_atomic`
     Running `rustc --crate-name ryu /home/build/.cargo/registry/src/github.com-1ecc6299db9ec823/ryu-1.0.0/src/lib.rs --error-format=json --json=diagnostic-rendered-ansi,artifacts --crate-type lib --emit=dep-info,metadata,link -C debuginfo=2 -C metadata=ee60c7b076b7202d -C extra-filename=-ee60c7b076b7202d --out-dir /home/build/Peroxide/target/debug/deps -L dependency=/home/build/Peroxide/target/debug/deps --cap-lints allow --cfg integer128 --cfg must_use_return`
     Running `rustc --edition=2018 --crate-name getrandom /home/build/.cargo/registry/src/github.com-1ecc6299db9ec823/getrandom-0.1.11/src/lib.rs --error-format=json --json=diagnostic-rendered-ansi,artifacts --crate-type lib --emit=dep-info,metadata,link -C debuginfo=2 --cfg 'feature="std"' -C metadata=d46d1edc9f5fbb43 -C extra-filename=-d46d1edc9f5fbb43 --out-dir /home/build/Peroxide/target/debug/deps -L dependency=/home/build/Peroxide/target/debug/deps --extern cfg_if=/home/build/Peroxide/target/debug/deps/libcfg_if-8912e9b9afce0109.rmeta --extern libc=/home/build/Peroxide/target/debug/deps/liblibc-066dfea92045aa46.rmeta --cap-lints allow`
     Running `rustc --crate-name memchr /home/build/.cargo/registry/src/github.com-1ecc6299db9ec823/memchr-2.2.1/src/lib.rs --error-format=json --json=diagnostic-rendered-ansi,artifacts --crate-type lib --emit=dep-info,metadata,link -C debuginfo=2 --cfg 'feature="libc"' --cfg 'feature="use_std"' -C metadata=d888be892adec0fb -C extra-filename=-d888be892adec0fb --out-dir /home/build/Peroxide/target/debug/deps -L dependency=/home/build/Peroxide/target/debug/deps --extern libc=/home/build/Peroxide/target/debug/deps/liblibc-066dfea92045aa46.rmeta --cap-lints allow --cfg memchr_runtime_simd --cfg memchr_runtime_sse2 --cfg memchr_runtime_sse42 --cfg memchr_runtime_avx --cfg memchr_libc`
   Compiling special v0.8.1
     Running `rustc --crate-name special /home/build/.cargo/registry/src/github.com-1ecc6299db9ec823/special-0.8.1/src/lib.rs --error-format=json --json=diagnostic-rendered-ansi,artifacts --crate-type lib --emit=dep-info,metadata,link -C debuginfo=2 -C metadata=7c23753ac5142dce -C extra-filename=-7c23753ac5142dce --out-dir /home/build/Peroxide/target/debug/deps -L dependency=/home/build/Peroxide/target/debug/deps --extern libc=/home/build/Peroxide/target/debug/deps/liblibc-066dfea92045aa46.rmeta --cap-lints allow`
   Compiling regex-automata v0.1.8
     Running `rustc --crate-name regex_automata /home/build/.cargo/registry/src/github.com-1ecc6299db9ec823/regex-automata-0.1.8/src/lib.rs --error-format=json --json=diagnostic-rendered-ansi,artifacts --crate-type lib --emit=dep-info,metadata,link -C debuginfo=2 -C metadata=d2d316e2a3f75883 -C extra-filename=-d2d316e2a3f75883 --out-dir /home/build/Peroxide/target/debug/deps -L dependency=/home/build/Peroxide/target/debug/deps --extern byteorder=/home/build/Peroxide/target/debug/deps/libbyteorder-d1ddfb9cd6307ac7.rmeta --cap-lints allow`
   Compiling rand_core v0.5.1
     Running `rustc --edition=2018 --crate-name rand_core /home/build/.cargo/registry/src/github.com-1ecc6299db9ec823/rand_core-0.5.1/src/lib.rs --error-format=json --json=diagnostic-rendered-ansi,artifacts --crate-type lib --emit=dep-info,metadata,link -C debuginfo=2 --cfg 'feature="alloc"' --cfg 'feature="getrandom"' --cfg 'feature="std"' -C metadata=2610893495011d6d -C extra-filename=-2610893495011d6d --out-dir /home/build/Peroxide/target/debug/deps -L dependency=/home/build/Peroxide/target/debug/deps --extern getrandom=/home/build/Peroxide/target/debug/deps/libgetrandom-d46d1edc9f5fbb43.rmeta --cap-lints allow`
   Compiling csv-core v0.1.6
     Running `rustc --edition=2018 --crate-name csv_core /home/build/.cargo/registry/src/github.com-1ecc6299db9ec823/csv-core-0.1.6/src/lib.rs --error-format=json --json=diagnostic-rendered-ansi,artifacts --crate-type lib --emit=dep-info,metadata,link -C debuginfo=2 --cfg 'feature="default"' --cfg 'feature="libc"' -C metadata=39bbe1d09f96ce6d -C extra-filename=-39bbe1d09f96ce6d --out-dir /home/build/Peroxide/target/debug/deps -L dependency=/home/build/Peroxide/target/debug/deps --extern memchr=/home/build/Peroxide/target/debug/deps/libmemchr-d888be892adec0fb.rmeta --cap-lints allow`
   Compiling bstr v0.2.7
     Running `rustc --crate-name bstr /home/build/.cargo/registry/src/github.com-1ecc6299db9ec823/bstr-0.2.7/src/lib.rs --error-format=json --json=diagnostic-rendered-ansi,artifacts --crate-type lib --emit=dep-info,metadata,link -C debuginfo=2 --cfg 'feature="default"' --cfg 'feature="lazy_static"' --cfg 'feature="regex-automata"' --cfg 'feature="serde"' --cfg 'feature="serde1"' --cfg 'feature="serde1-nostd"' --cfg 'feature="std"' --cfg 'feature="unicode"' -C metadata=ffa4622f6351cc88 -C extra-filename=-ffa4622f6351cc88 --out-dir /home/build/Peroxide/target/debug/deps -L dependency=/home/build/Peroxide/target/debug/deps --extern lazy_static=/home/build/Peroxide/target/debug/deps/liblazy_static-39ef7c038685ef10.rmeta --extern memchr=/home/build/Peroxide/target/debug/deps/libmemchr-d888be892adec0fb.rmeta --extern regex_automata=/home/build/Peroxide/target/debug/deps/libregex_automata-d2d316e2a3f75883.rmeta --extern serde=/home/build/Peroxide/target/debug/deps/libserde-a1427d268c48aacd.rmeta --cap-lints allow`
   Compiling rand_chacha v0.2.1
     Running `rustc --edition=2018 --crate-name rand_chacha /home/build/.cargo/registry/src/github.com-1ecc6299db9ec823/rand_chacha-0.2.1/src/lib.rs --error-format=json --json=diagnostic-rendered-ansi,artifacts --crate-type lib --emit=dep-info,metadata,link -C debuginfo=2 --cfg 'feature="default"' --cfg 'feature="simd"' --cfg 'feature="std"' -C metadata=2b4d0b6c333a7c9a -C extra-filename=-2b4d0b6c333a7c9a --out-dir /home/build/Peroxide/target/debug/deps -L dependency=/home/build/Peroxide/target/debug/deps --extern c2_chacha=/home/build/Peroxide/target/debug/deps/libc2_chacha-77a1ac2d9d6cc5b2.rmeta --extern rand_core=/home/build/Peroxide/target/debug/deps/librand_core-2610893495011d6d.rmeta --cap-lints allow`
   Compiling csv v1.1.1
     Running `rustc --edition=2018 --crate-name csv /home/build/.cargo/registry/src/github.com-1ecc6299db9ec823/csv-1.1.1/src/lib.rs --error-format=json --json=diagnostic-rendered-ansi,artifacts --crate-type lib --emit=dep-info,metadata,link -C debuginfo=2 -C metadata=9d79aedddb795234 -C extra-filename=-9d79aedddb795234 --out-dir /home/build/Peroxide/target/debug/deps -L dependency=/home/build/Peroxide/target/debug/deps --extern bstr=/home/build/Peroxide/target/debug/deps/libbstr-ffa4622f6351cc88.rmeta --extern csv_core=/home/build/Peroxide/target/debug/deps/libcsv_core-39bbe1d09f96ce6d.rmeta --extern itoa=/home/build/Peroxide/target/debug/deps/libitoa-03fdb419ebf31494.rmeta --extern ryu=/home/build/Peroxide/target/debug/deps/libryu-ee60c7b076b7202d.rmeta --extern serde=/home/build/Peroxide/target/debug/deps/libserde-a1427d268c48aacd.rmeta --cap-lints allow`
   Compiling rand v0.7.0
     Running `rustc --edition=2018 --crate-name rand /home/build/.cargo/registry/src/github.com-1ecc6299db9ec823/rand-0.7.0/src/lib.rs --error-format=json --json=diagnostic-rendered-ansi,artifacts --crate-type lib --emit=dep-info,metadata,link -C debuginfo=2 --cfg 'feature="alloc"' --cfg 'feature="default"' --cfg 'feature="getrandom"' --cfg 'feature="getrandom_package"' --cfg 'feature="std"' -C metadata=03922ace17b8c1ca -C extra-filename=-03922ace17b8c1ca --out-dir /home/build/Peroxide/target/debug/deps -L dependency=/home/build/Peroxide/target/debug/deps --extern getrandom_package=/home/build/Peroxide/target/debug/deps/libgetrandom-d46d1edc9f5fbb43.rmeta --extern libc=/home/build/Peroxide/target/debug/deps/liblibc-066dfea92045aa46.rmeta --extern rand_chacha=/home/build/Peroxide/target/debug/deps/librand_chacha-2b4d0b6c333a7c9a.rmeta --extern rand_core=/home/build/Peroxide/target/debug/deps/librand_core-2610893495011d6d.rmeta --cap-lints allow`
     Running `rustc --crate-name peroxide src/lib.rs --color always --crate-type lib --emit=dep-info,metadata,link -C debuginfo=2 --cfg 'feature="default"' -C metadata=11181ee15eff285b -C extra-filename=-11181ee15eff285b --out-dir /home/build/Peroxide/target/debug/deps -C incremental=/home/build/Peroxide/target/debug/incremental -L dependency=/home/build/Peroxide/target/debug/deps --extern csv=/home/build/Peroxide/target/debug/deps/libcsv-9d79aedddb795234.rmeta --extern rand=/home/build/Peroxide/target/debug/deps/librand-03922ace17b8c1ca.rmeta --extern special=/home/build/Peroxide/target/debug/deps/libspecial-7c23753ac5142dce.rmeta`
warning: unused import: `std::f64::NAN`
   --> src/structure/matrix.rs:451:5
    |
451 | use std::f64::NAN;
    |     ^^^^^^^^^^^^^
    |
    = note: `#[warn(unused_imports)]` on by default

warning: unused import: `eye_shape`
   --> src/structure/matrix.rs:452:5
    |
452 | use eye_shape;
    |     ^^^^^^^^^

warning: type `LAPACK_STATUS` should have an upper camel case name
    --> src/structure/matrix.rs:2888:10
     |
2888 | pub enum LAPACK_STATUS {
     |          ^^^^^^^^^^^^^ help: convert the identifier to upper camel case: `LapackStatus`
     |
     = note: `#[warn(non_camel_case_types)]` on by default

warning: unused import: `std::fs::File`
 --> src/util/writer.rs:5:5
  |
5 | use std::fs::File;
  |     ^^^^^^^^^^^^^

warning: unused import: `std::io::Write`
 --> src/util/writer.rs:6:5
  |
6 | use std::io::Write;
  |     ^^^^^^^^^^^^^^

warning: unused import: `std::process::exit`
 --> src/util/writer.rs:7:5
  |
7 | use std::process::exit;
  |     ^^^^^^^^^^^^^^^^^^

    Finished dev [unoptimized + debuginfo] target(s) in 35.71s
+ cargo test --verbose
       Fresh cfg-if v0.1.9
       Fresh lazy_static v1.4.0
       Fresh ppv-lite86 v0.2.5
       Fresh itoa v0.4.4
       Fresh c2-chacha v0.2.2
       Fresh libc v0.2.62
       Fresh byteorder v1.3.2
       Fresh serde v1.0.99
       Fresh ryu v1.0.0
       Fresh getrandom v0.1.11
       Fresh memchr v2.2.1
       Fresh special v0.8.1
       Fresh regex-automata v0.1.8
       Fresh rand_core v0.5.1
       Fresh csv-core v0.1.6
       Fresh bstr v0.2.7
       Fresh rand_chacha v0.2.1
       Fresh csv v1.1.1
       Fresh rand v0.7.0
   Compiling peroxide v0.15.1 (/home/build/Peroxide)
     Running `rustc --crate-name peroxide src/lib.rs --color always --emit=dep-info,link -C debuginfo=2 --test --cfg 'feature="default"' -C metadata=031456e4cab462c9 -C extra-filename=-031456e4cab462c9 --out-dir /home/build/Peroxide/target/debug/deps -C incremental=/home/build/Peroxide/target/debug/incremental -L dependency=/home/build/Peroxide/target/debug/deps --extern csv=/home/build/Peroxide/target/debug/deps/libcsv-9d79aedddb795234.rlib --extern rand=/home/build/Peroxide/target/debug/deps/librand-03922ace17b8c1ca.rlib --extern special=/home/build/Peroxide/target/debug/deps/libspecial-7c23753ac5142dce.rlib`
warning: unused import: `std::f64::NAN`
   --> src/structure/matrix.rs:451:5
    |
451 | use std::f64::NAN;
    |     ^^^^^^^^^^^^^
    |
    = note: `#[warn(unused_imports)]` on by default

warning: unused import: `eye_shape`
   --> src/structure/matrix.rs:452:5
    |
452 | use eye_shape;
    |     ^^^^^^^^^

warning: type `LAPACK_STATUS` should have an upper camel case name
    --> src/structure/matrix.rs:2888:10
     |
2888 | pub enum LAPACK_STATUS {
     |          ^^^^^^^^^^^^^ help: convert the identifier to upper camel case: `LapackStatus`
     |
     = note: `#[warn(non_camel_case_types)]` on by default

warning: unused import: `std::fs::File`
 --> src/util/writer.rs:5:5
  |
5 | use std::fs::File;
  |     ^^^^^^^^^^^^^

warning: unused import: `std::io::Write`
 --> src/util/writer.rs:6:5
  |
6 | use std::io::Write;
  |     ^^^^^^^^^^^^^^

warning: unused import: `std::process::exit`
 --> src/util/writer.rs:7:5
  |
7 | use std::process::exit;
  |     ^^^^^^^^^^^^^^^^^^

     Running `rustc --crate-name det tests/det.rs --color always --emit=dep-info,link -C debuginfo=2 --test --cfg 'feature="default"' -C metadata=9a6d36b8396cbb76 -C extra-filename=-9a6d36b8396cbb76 --out-dir /home/build/Peroxide/target/debug/deps -C incremental=/home/build/Peroxide/target/debug/incremental -L dependency=/home/build/Peroxide/target/debug/deps --extern csv=/home/build/Peroxide/target/debug/deps/libcsv-9d79aedddb795234.rlib --extern peroxide=/home/build/Peroxide/target/debug/deps/libperoxide-11181ee15eff285b.rlib --extern rand=/home/build/Peroxide/target/debug/deps/librand-03922ace17b8c1ca.rlib --extern special=/home/build/Peroxide/target/debug/deps/libspecial-7c23753ac5142dce.rlib`
     Running `rustc --crate-name jacobian tests/jacobian.rs --color always --emit=dep-info,link -C debuginfo=2 --test --cfg 'feature="default"' -C metadata=7d9bf29537462314 -C extra-filename=-7d9bf29537462314 --out-dir /home/build/Peroxide/target/debug/deps -C incremental=/home/build/Peroxide/target/debug/incremental -L dependency=/home/build/Peroxide/target/debug/deps --extern csv=/home/build/Peroxide/target/debug/deps/libcsv-9d79aedddb795234.rlib --extern peroxide=/home/build/Peroxide/target/debug/deps/libperoxide-11181ee15eff285b.rlib --extern rand=/home/build/Peroxide/target/debug/deps/librand-03922ace17b8c1ca.rlib --extern special=/home/build/Peroxide/target/debug/deps/libspecial-7c23753ac5142dce.rlib`
warning: unused `#[macro_use]` import
 --> tests/jacobian.rs:1:1
  |
1 | #[macro_use]
  | ^^^^^^^^^^^^
  |
  = note: `#[warn(unused_imports)]` on by default

     Running `rustc --crate-name matrix tests/matrix.rs --color always --emit=dep-info,link -C debuginfo=2 --test --cfg 'feature="default"' -C metadata=ab3a611cdb3b7f99 -C extra-filename=-ab3a611cdb3b7f99 --out-dir /home/build/Peroxide/target/debug/deps -C incremental=/home/build/Peroxide/target/debug/incremental -L dependency=/home/build/Peroxide/target/debug/deps --extern csv=/home/build/Peroxide/target/debug/deps/libcsv-9d79aedddb795234.rlib --extern peroxide=/home/build/Peroxide/target/debug/deps/libperoxide-11181ee15eff285b.rlib --extern rand=/home/build/Peroxide/target/debug/deps/librand-03922ace17b8c1ca.rlib --extern special=/home/build/Peroxide/target/debug/deps/libspecial-7c23753ac5142dce.rlib`
warning: unused `#[macro_use]` import
 --> tests/matrix.rs:1:1
  |
1 | #[macro_use]
  | ^^^^^^^^^^^^
  |
  = note: `#[warn(unused_imports)]` on by default

     Running `rustc --crate-name change_shape_test tests/change_shape_test.rs --color always --emit=dep-info,link -C debuginfo=2 --test --cfg 'feature="default"' -C metadata=eebdbb1af36a30ff -C extra-filename=-eebdbb1af36a30ff --out-dir /home/build/Peroxide/target/debug/deps -C incremental=/home/build/Peroxide/target/debug/incremental -L dependency=/home/build/Peroxide/target/debug/deps --extern csv=/home/build/Peroxide/target/debug/deps/libcsv-9d79aedddb795234.rlib --extern peroxide=/home/build/Peroxide/target/debug/deps/libperoxide-11181ee15eff285b.rlib --extern rand=/home/build/Peroxide/target/debug/deps/librand-03922ace17b8c1ca.rlib --extern special=/home/build/Peroxide/target/debug/deps/libspecial-7c23753ac5142dce.rlib`
     Running `rustc --crate-name dual tests/dual.rs --color always --emit=dep-info,link -C debuginfo=2 --test --cfg 'feature="default"' -C metadata=018808c20aaa3463 -C extra-filename=-018808c20aaa3463 --out-dir /home/build/Peroxide/target/debug/deps -C incremental=/home/build/Peroxide/target/debug/incremental -L dependency=/home/build/Peroxide/target/debug/deps --extern csv=/home/build/Peroxide/target/debug/deps/libcsv-9d79aedddb795234.rlib --extern peroxide=/home/build/Peroxide/target/debug/deps/libperoxide-11181ee15eff285b.rlib --extern rand=/home/build/Peroxide/target/debug/deps/librand-03922ace17b8c1ca.rlib --extern special=/home/build/Peroxide/target/debug/deps/libspecial-7c23753ac5142dce.rlib`
warning: unused `#[macro_use]` import
 --> tests/dual.rs:1:1
  |
1 | #[macro_use]
  | ^^^^^^^^^^^^
  |
  = note: `#[warn(unused_imports)]` on by default

     Running `rustc --crate-name blas_test tests/blas_test.rs --color always --emit=dep-info,link -C debuginfo=2 --test --cfg 'feature="default"' -C metadata=46ebb182f34ea963 -C extra-filename=-46ebb182f34ea963 --out-dir /home/build/Peroxide/target/debug/deps -C incremental=/home/build/Peroxide/target/debug/incremental -L dependency=/home/build/Peroxide/target/debug/deps --extern csv=/home/build/Peroxide/target/debug/deps/libcsv-9d79aedddb795234.rlib --extern peroxide=/home/build/Peroxide/target/debug/deps/libperoxide-11181ee15eff285b.rlib --extern rand=/home/build/Peroxide/target/debug/deps/librand-03922ace17b8c1ca.rlib --extern special=/home/build/Peroxide/target/debug/deps/libspecial-7c23753ac5142dce.rlib`
warning: unused import: `peroxide::*`
 --> tests/blas_test.rs:2:5
  |
2 | use peroxide::*;
  |     ^^^^^^^^^^^
  |
  = note: `#[warn(unused_imports)]` on by default

     Running `rustc --crate-name number tests/number.rs --color always --emit=dep-info,link -C debuginfo=2 --test --cfg 'feature="default"' -C metadata=ac0d07f260b533da -C extra-filename=-ac0d07f260b533da --out-dir /home/build/Peroxide/target/debug/deps -C incremental=/home/build/Peroxide/target/debug/incremental -L dependency=/home/build/Peroxide/target/debug/deps --extern csv=/home/build/Peroxide/target/debug/deps/libcsv-9d79aedddb795234.rlib --extern peroxide=/home/build/Peroxide/target/debug/deps/libperoxide-11181ee15eff285b.rlib --extern rand=/home/build/Peroxide/target/debug/deps/librand-03922ace17b8c1ca.rlib --extern special=/home/build/Peroxide/target/debug/deps/libspecial-7c23753ac5142dce.rlib`
warning: unused `#[macro_use]` import
 --> tests/number.rs:1:1
  |
1 | #[macro_use]
  | ^^^^^^^^^^^^
  |
  = note: `#[warn(unused_imports)]` on by default

    Finished dev [unoptimized + debuginfo] target(s) in 6.73s
     Running `/home/build/Peroxide/target/debug/deps/peroxide-031456e4cab462c9`

running 0 tests

test result: ok. 0 passed; 0 failed; 0 ignored; 0 measured; 0 filtered out

     Running `/home/build/Peroxide/target/debug/deps/blas_test-46ebb182f34ea963`

running 0 tests

test result: ok. 0 passed; 0 failed; 0 ignored; 0 measured; 0 filtered out

     Running `/home/build/Peroxide/target/debug/deps/change_shape_test-eebdbb1af36a30ff`

running 1 test
test change_shape_test ... ok

test result: ok. 1 passed; 0 failed; 0 ignored; 0 measured; 0 filtered out

     Running `/home/build/Peroxide/target/debug/deps/det-9a6d36b8396cbb76`

running 2 tests
test test_det ... ok
test test_det2 ... ok

test result: ok. 2 passed; 0 failed; 0 ignored; 0 measured; 0 filtered out

     Running `/home/build/Peroxide/target/debug/deps/dual-018808c20aaa3463`

running 1 test
test test_dot_dual ... ok

test result: ok. 1 passed; 0 failed; 0 ignored; 0 measured; 0 filtered out

     Running `/home/build/Peroxide/target/debug/deps/jacobian-7d9bf29537462314`

running 1 test
test test_jacobian ... ok

test result: ok. 1 passed; 0 failed; 0 ignored; 0 measured; 0 filtered out

     Running `/home/build/Peroxide/target/debug/deps/matrix-ab3a611cdb3b7f99`

running 11 tests
test test_accumulation ... ok
test test_add_f64 ... ok
test test_add_matrix ... ok
test test_c ... ok
test test_col ... ok
test test_col_map ... ok
test test_print ... ok
test test_row ... ok
test test_row_map ... ok
test test_seq ... ok
test test_zeros ... ok

test result: ok. 11 passed; 0 failed; 0 ignored; 0 measured; 0 filtered out

     Running `/home/build/Peroxide/target/debug/deps/number-ac0d07f260b533da`

running 3 tests
test test_function_for_number ... ok
test test_ops_btw_number_d ... ok
test test_ops_btw_number_f ... ok

test result: ok. 3 passed; 0 failed; 0 ignored; 0 measured; 0 filtered out

   Doc-tests peroxide
     Running `rustdoc --test /home/build/Peroxide/src/lib.rs --crate-name peroxide -L dependency=/home/build/Peroxide/target/debug/deps -L dependency=/home/build/Peroxide/target/debug/deps --cfg 'feature="default"' --extern csv=/home/build/Peroxide/target/debug/deps/libcsv-9d79aedddb795234.rlib --extern peroxide=/home/build/Peroxide/target/debug/deps/libperoxide-11181ee15eff285b.rlib --extern rand=/home/build/Peroxide/target/debug/deps/librand-03922ace17b8c1ca.rlib --extern special=/home/build/Peroxide/target/debug/deps/libspecial-7c23753ac5142dce.rlib`

running 135 tests
test src/lib.rs -  (line 61) ... ok
test src/macros/matlab_macro.rs - eye (line 69) ... ok
test src/macros/matlab_macro.rs - linspace (line 91) ... ok
test src/macros/matlab_macro.rs - rand (line 37) ... ok
test src/macros/matlab_macro.rs - zeros (line 12) ... ok
test src/macros/r_macro.rs - c (line 14) ... ok
test src/macros/r_macro.rs - cbind (line 111) ... ok
test src/macros/r_macro.rs - lm (line 273) ... ok
test src/macros/r_macro.rs - matrix (line 85) ... ok
test src/macros/r_macro.rs - rbind (line 171) ... ok
test src/macros/r_macro.rs - runif (line 236) ... ok
test src/macros/r_macro.rs - seq (line 52) ... ok
test src/ml/reg.rs - ml::reg::least_square (line 17) ... ok
test src/numerical/ode.rs - numerical::ode (line 126) ... ok
test src/numerical/ode.rs - numerical::ode (line 13) ... ok
test src/numerical/ode.rs - numerical::ode (line 179) ... ok
test src/numerical/ode.rs - numerical::ode (line 58) ... ok
test src/numerical/ode.rs - numerical::ode (line 93) ... ok
test src/numerical/optimize.rs - numerical::optimize (line 44) ... FAILED
test src/numerical/optimize.rs - numerical::optimize (line 7) ... ok
test src/numerical/spline.rs - numerical::spline::cubic_spline (line 21) ... ok
test src/numerical/utils.rs - numerical::utils::jacobian (line 15) ... ok
test src/operation/extra_ops.rs - operation::extra_ops (line 9) ... ok
test src/statistics/dist.rs - statistics::dist (line 109) ... ok
test src/statistics/dist.rs - statistics::dist (line 28) ... ok
test src/statistics/dist.rs - statistics::dist (line 57) ... ok
test src/statistics/dist.rs - statistics::dist (line 81) ... ok
test src/statistics/ops.rs - statistics::ops::C (line 45) ... ok
test src/statistics/ops.rs - statistics::ops::H (line 64) ... ok
test src/statistics/ops.rs - statistics::ops::P (line 26) ... ok
test src/statistics/ops.rs - statistics::ops::factorial (line 8) ... ok
test src/statistics/rand.rs - statistics::rand (line 8) ... ok
test src/statistics/rand.rs - statistics::rand::rand_num (line 31) ... ok
test src/statistics/stat.rs - statistics::stat (line 12) ... ok
test src/statistics/stat.rs - statistics::stat (line 30) ... ok
test src/statistics/stat.rs - statistics::stat (line 45) ... ok
test src/statistics/stat.rs - statistics::stat (line 64) ... ok
test src/statistics/stat.rs - statistics::stat::Matrix::cov (line 231) ... ok
test src/statistics/stat.rs - statistics::stat::Matrix::mean (line 171) ... ok
test src/statistics/stat.rs - statistics::stat::Matrix::sd (line 211) ... ok
test src/statistics/stat.rs - statistics::stat::Matrix::var (line 191) ... ok
test src/statistics/stat.rs - statistics::stat::Vector::mean (line 107) ... ok
test src/statistics/stat.rs - statistics::stat::Vector::sd (line 145) ... ok
test src/statistics/stat.rs - statistics::stat::Vector::var (line 121) ... ok
test src/statistics/stat.rs - statistics::stat::cor (line 303) ... ok
test src/statistics/stat.rs - statistics::stat::cov (line 276) ... ok
test src/statistics/stat.rs - statistics::stat::lm (line 318) ... ok
test src/structure/dual.rs - structure::dual (line 23) ... ok
test src/structure/dual.rs - structure::dual (line 44) ... ok
test src/structure/dual.rs - structure::dual::Dual::new (line 97) ... ok
test src/structure/hyper_dual.rs - structure::hyper_dual (line 14) ... ok
test src/structure/hyper_dual.rs - structure::hyper_dual (line 29) ... ok
test src/structure/matrix.rs - structure::matrix (line 117) ... ok
test src/structure/matrix.rs - structure::matrix (line 152) ... ok
test src/structure/matrix.rs - structure::matrix (line 172) ... ok
test src/structure/matrix.rs - structure::matrix (line 18) ... ok
test src/structure/matrix.rs - structure::matrix (line 194) ... ok
test src/structure/matrix.rs - structure::matrix (line 221) ... ok
test src/structure/matrix.rs - structure::matrix (line 248) ... ok
test src/structure/matrix.rs - structure::matrix (line 268) ... ok
test src/structure/matrix.rs - structure::matrix (line 288) ... ok
test src/structure/matrix.rs - structure::matrix (line 305) ... ok
test src/structure/matrix.rs - structure::matrix (line 327) ... ok
test src/structure/matrix.rs - structure::matrix (line 355) ... ok
test src/structure/matrix.rs - structure::matrix (line 373) ... ok
test src/structure/matrix.rs - structure::matrix (line 399) ... ok
test src/structure/matrix.rs - structure::matrix (line 416) ... ok
test src/structure/matrix.rs - structure::matrix (line 43) ... ok
test src/structure/matrix.rs - structure::matrix (line 434) ... ok
test src/structure/matrix.rs - structure::matrix (line 62) ... ok
test src/structure/matrix.rs - structure::matrix (line 92) ... ok
test src/structure/matrix.rs - structure::matrix::Matrix (line 1223) ... ok
test src/structure/matrix.rs - structure::matrix::Matrix (line 1366) ... ok
test src/structure/matrix.rs - structure::matrix::Matrix (line 1434) ... ok
test src/structure/matrix.rs - structure::matrix::Matrix (line 1788) ... ok
test src/structure/matrix.rs - structure::matrix::Matrix (line 1978) ... ok
test src/structure/matrix.rs - structure::matrix::Matrix (line 2003) ... ok
test src/structure/matrix.rs - structure::matrix::Matrix (line 492) ... ok
test src/structure/matrix.rs - structure::matrix::Matrix::block (line 2504) ... ok
test src/structure/matrix.rs - structure::matrix::Matrix::change_shape (line 632) ... ok
test src/structure/matrix.rs - structure::matrix::Matrix::col (line 770) ... ok
test src/structure/matrix.rs - structure::matrix::Matrix::det (line 2446) ... ok
test src/structure/matrix.rs - structure::matrix::Matrix::diag (line 808) ... ok
test src/structure/matrix.rs - structure::matrix::Matrix::inv (line 2565) ... ok
test src/structure/matrix.rs - structure::matrix::Matrix::lu (line 2348) ... ok
test src/structure/matrix.rs - structure::matrix::Matrix::pseudo_inv (line 2614) ... ok
test src/structure/matrix.rs - structure::matrix::Matrix::read (line 965) ... ok
test src/structure/matrix.rs - structure::matrix::Matrix::row (line 789) ... ok
test src/structure/matrix.rs - structure::matrix::Matrix::spread (line 682) ... ok
test src/structure/matrix.rs - structure::matrix::Matrix::swap (line 830) ... ok
test src/structure/matrix.rs - structure::matrix::Matrix::t (line 1105) ... ok
test src/structure/matrix.rs - structure::matrix::Matrix::transpose (line 1088) ... ok
test src/structure/matrix.rs - structure::matrix::Matrix::write (line 872) ... ok
test src/structure/matrix.rs - structure::matrix::Matrix::write_round (line 897) ... ok
test src/structure/matrix.rs - structure::matrix::PQLU (line 2244) ... ok
test src/structure/matrix.rs - structure::matrix::Shape (line 462) ... ok
test src/structure/matrix.rs - structure::matrix::Vector (line 1939) ... ok
test src/structure/matrix.rs - structure::matrix::combine (line 2670) ... ok
test src/structure/matrix.rs - structure::matrix::f64 (line 1282) ... ok
test src/structure/matrix.rs - structure::matrix::f64 (line 1566) ... ok
test src/structure/matrix.rs - structure::matrix::i32 (line 1309) ... ok
test src/structure/matrix.rs - structure::matrix::inv_l (line 2720) ... ok
test src/structure/matrix.rs - structure::matrix::inv_u (line 2755) ... ok
test src/structure/matrix.rs - structure::matrix::matrix (line 518) ... ok
test src/structure/matrix.rs - structure::matrix::ml_matrix (line 574) ... ok
test src/structure/matrix.rs - structure::matrix::py_matrix (line 547) ... ok
test src/structure/matrix.rs - structure::matrix::usize (line 1336) ... ok
test src/structure/polynomial.rs - structure::polynomial::Polynomial (line 26) ... ok
test src/structure/polynomial.rs - structure::polynomial::Polynomial::eval (line 158) ... ok
test src/structure/vector.rs - structure::vector (line 10) ... ok
test src/structure/vector.rs - structure::vector (line 111) ... ok
test src/structure/vector.rs - structure::vector (line 134) ... ok
test src/structure/vector.rs - structure::vector (line 160) ... ok
test src/structure/vector.rs - structure::vector (line 186) ... ok
test src/structure/vector.rs - structure::vector (line 209) ... ok
test src/structure/vector.rs - structure::vector (line 236) ... ok
test src/structure/vector.rs - structure::vector (line 252) ... ok
test src/structure/vector.rs - structure::vector (line 266) ... ok
test src/structure/vector.rs - structure::vector (line 33) ... ok
test src/structure/vector.rs - structure::vector (line 57) ... ok
test src/structure/vector.rs - structure::vector (line 79) ... ok
test src/structure/vector.rs - structure::vector::Vector::arg_max (line 513) ... ok
test src/structure/vector.rs - structure::vector::Vector::filter (line 349) ... ok
test src/structure/vector.rs - structure::vector::Vector::fmap (line 304) ... ok
test src/structure/vector.rs - structure::vector::Vector::rank (line 456) ... ok
test src/structure/vector.rs - structure::vector::Vector::reduce (line 321) ... ok
test src/structure/vector.rs - structure::vector::Vector::sign (line 482) ... ok
test src/structure/vector.rs - structure::vector::Vector::skip (line 389) ... ok
test src/structure/vector.rs - structure::vector::Vector::take (line 370) ... ok
test src/util/non_macro.rs - util::non_macro::cbind (line 125) ... ok
test src/util/non_macro.rs - util::non_macro::eye (line 98) ... ok
test src/util/non_macro.rs - util::non_macro::rbind (line 158) ... ok
test src/util/non_macro.rs - util::non_macro::seq (line 18) ... ok
test src/util/non_macro.rs - util::non_macro::zeros (line 50) ... ok
test src/util/useful.rs - util::useful::nearly_eq (line 15) ... ok

failures:

---- src/numerical/optimize.rs - numerical::optimize (line 44) stdout ----
error[E0433]: failed to resolve: use of undeclared type or module `Plot2D`
  --> src/numerical/optimize.rs:78:19
   |
35 |     let mut plt = Plot2D::new();
   |                   ^^^^^^ use of undeclared type or module `Plot2D`

error[E0425]: cannot find value `Point` in this scope
  --> src/numerical/optimize.rs:85:26
   |
42 |         .set_marker(vec![Point, Line])
   |                          ^^^^^ not found in this scope

error[E0425]: cannot find value `Line` in this scope
  --> src/numerical/optimize.rs:85:33
   |
42 |         .set_marker(vec![Point, Line])
   |                                 ^^^^ not found in this scope

error: aborting due to 3 previous errors

Some errors have detailed explanations: E0425, E0433.
For more information about an error, try `rustc --explain E0425`.
Couldn't compile the test.

failures:
    src/numerical/optimize.rs - numerical::optimize (line 44)

test result: FAILED. 134 passed; 1 failed; 0 ignored; 0 measured; 0 filtered out

error: test failed, to rerun pass '--doc'
+ :
docs
1
2
3
4
5
6
7
8
9
10
11
12
13
14
15
16
17
18
19
20
21
22
23
24
25
26
27
28
29
30
31
32
33
34
35
36
37
38
+ rustup default nightly
info: using existing install for 'nightly-x86_64-unknown-linux-gnu'
info: default toolchain set to 'nightly-x86_64-unknown-linux-gnu'

  nightly-x86_64-unknown-linux-gnu unchanged - rustc 1.39.0-nightly (17e73e801 2019-08-28)

+ cd Peroxide/
+ RUSTDOCFLAGS='--html-in-header katex-header.html'
+ cargo doc --no-deps
    Checking cfg-if v0.1.9
    Checking lazy_static v1.4.0
    Checking ppv-lite86 v0.2.5
    Checking itoa v0.4.4
    Checking c2-chacha v0.2.2
    Checking libc v0.2.62
    Checking byteorder v1.3.2
    Checking serde v1.0.99
    Checking ryu v1.0.0
    Checking getrandom v0.1.11
    Checking memchr v2.2.1
    Checking special v0.8.1
    Checking regex-automata v0.1.8
    Checking rand_core v0.5.1
    Checking csv-core v0.1.6
    Checking bstr v0.2.7
    Checking rand_chacha v0.2.1
    Checking csv v1.1.1
    Checking rand v0.7.0
 Documenting peroxide v0.15.1 (/home/build/Peroxide)
warning: type `LAPACK_STATUS` should have an upper camel case name
    --> src/structure/matrix.rs:2888:10
     |
2888 | pub enum LAPACK_STATUS {
     |          ^^^^^^^^^^^^^ help: convert the identifier to upper camel case: `LapackStatus`
     |
     = note: `#[warn(non_camel_case_types)]` on by default

    Finished dev [unoptimized + debuginfo] target(s) in 19.32s
Build complete: success 3 months ago (took 5 minutes)