#82575 success

Note

ce5030faxect

little bit optimize

Owner
~axect
Created
3 months ago
Updated
3 months ago
Build manifest
view manifest »

Tasks

view log »
setup view log »
nightly view log »
docs view log »
go to bottom »
setup
1
2
3
4
5
6
7
8
9
10
11
12
13
14
15
16
17
18
19
20
21
22
23
24
25
26
27
28
29
30
31
32
33
34
35
36
37
38
39
40
41
42
43
44
45
46
47
48
49
50
51
52
53
54
55
56
57
58
59
60
61
62
63
64
65
66
67
68
69
70
71
72
73
74
75
76
77
78
79
80
81
82
83
84
85
86
87
88
89
90
91
92
93
94
95
96
97
98
99
100
101
102
103
104
105
106
107
108
109
110
111
112
113
114
115
116
117
118
119
120
121
122
123
124
125
126
127
128
129
130
131
132
133
134
135
136
137
138
139
140
141
142
143
144
145
146
147
148
149
150
151
152
153
154
155
156
157
158
159
160
161
162
163
164
165
166
167
168
169
170
171
172
173
174
[#82575] 2019/08/20 14:45:02 Booting image archlinux (default) on port 22668
[#82575] 2019/08/20 14:45:04 Waiting for guest to settle
[#82575] 2019/08/20 14:45:11 Sending tasks
[#82575] 2019/08/20 14:45:11 Sending build environment
[#82575] 2019/08/20 14:45:12 Installing packages
Warning: Permanently added '[localhost]:22668' (ECDSA) to the list of known hosts.
:: Synchronizing package databases...
downloading core.db...
downloading extra.db...
downloading community.db...
:: Starting full system upgrade...
warning: linux: ignoring package upgrade (5.2.8.arch1-1 => 5.2.9.arch1-1)
warning: linux-firmware: ignoring package upgrade (20190717.bf13a71-1 => 20190815.07b925b-1)
resolving dependencies...
looking for conflicting packages...

Packages (29) blas-3.8.0-2  cblas-3.8.0-2  cryptsetup-2.2.0-1  dbus-1.12.16-2  freetype2-2.10.1-1  git-2.23.0-1  graphite-1:1.3.13-1  harfbuzz-2.6.0-1  lapack-3.8.0-2  libpng-1.6.37-1  man-db-2.8.6.1-1  man-pages-5.02-1  mercurial-5.1-1  python-appdirs-1.4.3-2  python-attrs-19.1.0-1  python-cycler-0.10.0-3  python-dateutil-2.8.0-1  python-kiwisolver-1.1.0-1  python-numpy-1.17.0-1  python-packaging-19.1-2  python-pyparsing-2.4.2-1  python-setuptools-1:41.0.1-1  python-six-1.12.0-1  systemd-242.84-2  systemd-libs-242.84-2  systemd-sysvcompat-242.84-2  python-3.7.4-1  python-matplotlib-3.1.1-1  rustup-1.18.3-1

Total Download Size:    72.37 MiB
Total Installed Size:  311.28 MiB
Net Upgrade Size:      212.25 MiB

warning: dependency cycle detected:
warning: harfbuzz will be installed before its freetype2 dependency
:: Proceed with installation? [Y/n] 
:: Retrieving packages...
downloading systemd-libs-242.84-2-x86_64.pkg.tar.xz...
downloading cryptsetup-2.2.0-1-x86_64.pkg.tar.xz...
downloading dbus-1.12.16-2-x86_64.pkg.tar.xz...
downloading systemd-242.84-2-x86_64.pkg.tar.xz...
downloading man-db-2.8.6.1-1-x86_64.pkg.tar.xz...
downloading man-pages-5.02-1-any.pkg.tar.xz...
downloading systemd-sysvcompat-242.84-2-x86_64.pkg.tar.xz...
downloading python-3.7.4-1-x86_64.pkg.tar.xz...
downloading libpng-1.6.37-1-x86_64.pkg.tar.xz...
downloading graphite-1:1.3.13-1-x86_64.pkg.tar.xz...
downloading harfbuzz-2.6.0-1-x86_64.pkg.tar.xz...
downloading freetype2-2.10.1-1-x86_64.pkg.tar.xz...
downloading blas-3.8.0-2-x86_64.pkg.tar.xz...
downloading cblas-3.8.0-2-x86_64.pkg.tar.xz...
downloading lapack-3.8.0-2-x86_64.pkg.tar.xz...
downloading python-numpy-1.17.0-1-x86_64.pkg.tar.xz...
downloading python-six-1.12.0-1-any.pkg.tar.xz...
downloading python-appdirs-1.4.3-2-any.pkg.tar.xz...
downloading python-attrs-19.1.0-1-any.pkg.tar.xz...
downloading python-pyparsing-2.4.2-1-any.pkg.tar.xz...
downloading python-packaging-19.1-2-any.pkg.tar.xz...
downloading python-setuptools-1:41.0.1-1-any.pkg.tar.xz...
downloading git-2.23.0-1-x86_64.pkg.tar.xz...
downloading mercurial-5.1-1-x86_64.pkg.tar.xz...
downloading rustup-1.18.3-1-x86_64.pkg.tar.xz...
downloading python-cycler-0.10.0-3-any.pkg.tar.xz...
downloading python-dateutil-2.8.0-1-any.pkg.tar.xz...
downloading python-kiwisolver-1.1.0-1-x86_64.pkg.tar.xz...
downloading python-matplotlib-3.1.1-1-x86_64.pkg.tar.xz...
checking keyring...
checking package integrity...
loading package files...
checking for file conflicts...
checking available disk space...
:: Processing package changes...
upgrading systemd-libs...
upgrading cryptsetup...
upgrading dbus...
upgrading systemd...
installing rustup...
You may need to run rustup update stable
and possibly also rustup self upgrade-data
Optional dependencies for rustup
    lldb: rust-lldb script
    gdb: rust-gdb script
installing python...
Optional dependencies for python
    python-setuptools [pending]
    python-pip
    sqlite [installed]
    mpdecimal: for decimal
    xz: for lzma [installed]
    tk: for tkinter
installing libpng...
installing graphite...
installing harfbuzz...
Optional dependencies for harfbuzz
    cairo: hb-view program
installing freetype2...
installing blas...
installing cblas...
installing lapack...
installing python-numpy...
Optional dependencies for python-numpy
    python-nose: testsuite
    openblas: faster linear algebra
installing python-six...
installing python-cycler...
installing python-dateutil...
installing python-appdirs...
installing python-attrs...
installing python-pyparsing...
installing python-packaging...
installing python-setuptools...
installing python-kiwisolver...
installing python-matplotlib...
Optional dependencies for python-matplotlib
    tk: Tk{Agg,Cairo} backends
    python-pyqt5: Qt5{Agg,Cairo} backends
    python-gobject: for GTK3{Agg,Cairo} backend
    python-wxpython: WX{,Agg,Cairo} backend
    python-cairo: {GTK3,Qt5,Tk,WX}Cairo backends
    python-cairocffi: alternative for Cairo backends
    python-tornado: WebAgg backend
    ffmpeg: for saving movies
    imagemagick: for saving animated gifs
    python-pillow: for reading/saving jpeg/bmp/tiff files
    ghostscript: usetex dependencies
    texlive-bin: usetex dependencies
upgrading git...
upgrading man-db...
upgrading man-pages...
upgrading mercurial...
upgrading systemd-sysvcompat...
:: Running post-transaction hooks...
( 1/10) Creating system user accounts...
( 2/10) Updating linux initcpios...
==> Building image from preset: /etc/mkinitcpio.d/linux.preset: 'default'
  -> -k /boot/vmlinuz-linux -c /etc/mkinitcpio.conf -g /boot/initramfs-linux.img
==> Starting build: 5.2.8-arch1-1-ARCH
  -> Running build hook: [base]
  -> Running build hook: [udev]
  -> Running build hook: [autodetect]
  -> Running build hook: [modconf]
  -> Running build hook: [block]
  -> Running build hook: [filesystems]
  -> Running build hook: [keyboard]
  -> Running build hook: [fsck]
==> Generating module dependencies
==> Creating gzip-compressed initcpio image: /boot/initramfs-linux.img
==> Image generation successful
==> Building image from preset: /etc/mkinitcpio.d/linux.preset: 'fallback'
  -> -k /boot/vmlinuz-linux -c /etc/mkinitcpio.conf -g /boot/initramfs-linux-fallback.img -S autodetect
==> Starting build: 5.2.8-arch1-1-ARCH
  -> Running build hook: [base]
  -> Running build hook: [udev]
  -> Running build hook: [modconf]
  -> Running build hook: [block]
==> WARNING: Possibly missing firmware for module: aic94xx
==> WARNING: Possibly missing firmware for module: wd719x
  -> Running build hook: [filesystems]
  -> Running build hook: [keyboard]
  -> Running build hook: [fsck]
==> Generating module dependencies
==> Creating gzip-compressed initcpio image: /boot/initramfs-linux-fallback.img
==> Image generation successful
( 3/10) Reloading system bus configuration...
( 4/10) Updating journal message catalog...
( 5/10) Reloading system manager configuration...
( 6/10) Updating udev hardware database...
( 7/10) Applying kernel sysctl settings...
( 8/10) Creating temporary files...
( 9/10) Reloading device manager configuration...
(10/10) Arming ConditionNeedsUpdate...
:: Searching databases for updates...
:: Searching AUR for updates...
 -> linux: ignoring package upgrade (5.2.8.arch1-1 => 5.2.9.arch1-1)
 -> linux-firmware: ignoring package upgrade (20190717.bf13a71-1 => 20190815.07b925b-1)
 there is nothing to do
[#82575] 2019/08/20 14:45:58 Cloning repositories
Cloning into 'Peroxide'...
+ cd Peroxide
+ git checkout -q ce5030ff13f054bbc7c9924e75d7dc6835bd9c38
+ cd Peroxide
+ git submodule update --init
[#82575] 2019/08/20 14:45:59 Running task setup
[#82575] 2019/08/20 14:47:25 Running task nightly
[#82575] 2019/08/20 14:51:38 Running task docs
setup
1
2
3
4
5
6
7
8
9
10
11
12
13
14
15
16
17
18
19
20
21
22
23
24
25
26
27
28
29
30
31
32
33
34
35
36
37
38
39
40
41
42
43
44
45
46
47
48
49
50
51
52
53
54
55
56
57
58
59
60
61
62
63
64
65
66
67
68
69
70
71
72
73
74
75
76
77
78
79
80
81
82
83
84
85
86
87
88
89
90
91
92
93
94
95
96
97
98
99
100
101
102
103
104
105
106
107
108
109
110
111
112
113
114
115
116
117
118
119
120
121
122
123
124
125
126
127
128
129
130
131
132
133
134
135
136
137
138
139
140
141
142
143
144
145
146
147
148
149
150
151
152
153
154
155
156
157
158
159
160
161
162
163
164
165
166
+ rustup toolchain install nightly
info: syncing channel updates for 'nightly-x86_64-unknown-linux-gnu'
info: latest update on 2019-08-20, rust version 1.39.0-nightly (29a54035c 2019-08-19)
info: downloading component 'rustc'

  9.4 MiB /  66.1 MiB ( 14 %)   0 B/s in  1s ETA: Unknown
                                                         
 18.5 MiB /  66.1 MiB ( 28 %)   9.4 MiB/s in  2s ETA:  5s
                                                         
 27.5 MiB /  66.1 MiB ( 42 %)   9.3 MiB/s in  3s ETA:  4s
                                                         
 36.8 MiB /  66.1 MiB ( 56 %)   9.2 MiB/s in  4s ETA:  3s
                                                         
 45.8 MiB /  66.1 MiB ( 69 %)   9.2 MiB/s in  5s ETA:  2s
                                                         
 54.7 MiB /  66.1 MiB ( 83 %)   9.2 MiB/s in  6s ETA:  1s
                                                         
 63.8 MiB /  66.1 MiB ( 96 %)   9.1 MiB/s in  7s ETA:  0s
                                                         
 66.1 MiB /  66.1 MiB (100 %)   9.0 MiB/s in  7s ETA:  0s
info: downloading component 'rust-std'

  8.9 MiB / 173.9 MiB (  5 %)   0 B/s in  1s ETA: Unknown
                                                         
 18.3 MiB / 173.9 MiB ( 11 %)   8.9 MiB/s in  2s ETA: 17s
                                                         
 25.9 MiB / 173.9 MiB ( 15 %)   9.1 MiB/s in  3s ETA: 16s
                                                         
 35.5 MiB / 173.9 MiB ( 20 %)   8.6 MiB/s in  4s ETA: 16s
                                                         
 44.7 MiB / 173.9 MiB ( 26 %)   8.9 MiB/s in  5s ETA: 14s
                                                         
 54.0 MiB / 173.9 MiB ( 31 %)   8.9 MiB/s in  6s ETA: 13s
                                                         
 61.6 MiB / 173.9 MiB ( 35 %)   9.0 MiB/s in  7s ETA: 12s
                                                         
 70.6 MiB / 173.9 MiB ( 41 %)   8.7 MiB/s in  8s ETA: 11s
                                                         
 79.6 MiB / 173.9 MiB ( 46 %)   8.9 MiB/s in  9s ETA: 10s
                                                         
 88.9 MiB / 173.9 MiB ( 51 %)   8.8 MiB/s in 10s ETA:  9s
                                                         
 97.7 MiB / 173.9 MiB ( 56 %)   8.8 MiB/s in 11s ETA:  8s
                                                         
107.1 MiB / 173.9 MiB ( 62 %)   8.7 MiB/s in 12s ETA:  7s
                                                         
116.8 MiB / 173.9 MiB ( 67 %)   9.1 MiB/s in 13s ETA:  6s
                                                         
125.8 MiB / 173.9 MiB ( 72 %)   9.2 MiB/s in 14s ETA:  5s
                                                         
135.1 MiB / 173.9 MiB ( 78 %)   9.2 MiB/s in 15s ETA:  4s
                                                         
144.5 MiB / 173.9 MiB ( 83 %)   9.2 MiB/s in 16s ETA:  3s
                                                         
153.8 MiB / 173.9 MiB ( 88 %)   9.4 MiB/s in 17s ETA:  2s
                                                         
162.9 MiB / 173.9 MiB ( 94 %)   9.3 MiB/s in 18s ETA:  1s
                                                         
172.0 MiB / 173.9 MiB ( 99 %)   9.2 MiB/s in 19s ETA:  0s
                                                         
173.9 MiB / 173.9 MiB (100 %)   9.3 MiB/s in 19s ETA:  0s
info: downloading component 'cargo'
info: downloading component 'rust-docs'

  9.3 MiB /  11.7 MiB ( 80 %)   0 B/s in  1s ETA: Unknown
                                                         
 11.7 MiB /  11.7 MiB (100 %)   9.3 MiB/s in  1s ETA:  0s
info: installing component 'rustc'

 10.8 MiB /  66.1 MiB ( 16 %)   0 B/s in  1s ETA: Unknown
                                                         
 20.3 MiB /  66.1 MiB ( 31 %)  10.8 MiB/s in  2s ETA:  4s
                                                         
 31.1 MiB /  66.1 MiB ( 47 %)  10.1 MiB/s in  3s ETA:  3s
                                                         
 41.1 MiB /  66.1 MiB ( 62 %)  10.4 MiB/s in  4s ETA:  2s
                                                         
 50.0 MiB /  66.1 MiB ( 76 %)  10.3 MiB/s in  5s ETA:  1s
                                                         
 59.4 MiB /  66.1 MiB ( 90 %)  10.0 MiB/s in  6s ETA:  0s
                                                         
 66.1 MiB /  66.1 MiB (100 %)   9.7 MiB/s in  6s ETA:  0s
info: installing component 'rust-std'

 16.8 MiB / 173.9 MiB ( 10 %)   0 B/s in  1s ETA: Unknown
                                                         
 39.7 MiB / 173.9 MiB ( 23 %)  16.8 MiB/s in  2s ETA:  7s
                                                         
 62.8 MiB / 173.9 MiB ( 36 %)  19.9 MiB/s in  3s ETA:  5s
                                                         
 76.1 MiB / 173.9 MiB ( 44 %)  20.9 MiB/s in  4s ETA:  4s
                                                         
107.0 MiB / 173.9 MiB ( 62 %)  19.0 MiB/s in  5s ETA:  3s
                                                         
127.5 MiB / 173.9 MiB ( 73 %)  21.4 MiB/s in  6s ETA:  2s
                                                         
144.0 MiB / 173.9 MiB ( 83 %)  22.1 MiB/s in  7s ETA:  1s
                                                         
162.4 MiB / 173.9 MiB ( 93 %)  20.8 MiB/s in  8s ETA:  0s
                                                         
171.0 MiB / 173.9 MiB ( 98 %)  19.9 MiB/s in  9s ETA:  0s
                                                         
173.9 MiB / 173.9 MiB (100 %)  19.0 MiB/s in  9s ETA:  0s
info: installing component 'cargo'
info: installing component 'rust-docs'

  4.8 MiB /  11.7 MiB ( 41 %)   0 B/s in  1s ETA: Unknown
                                                         
  8.3 MiB /  11.7 MiB ( 71 %)   4.8 MiB/s in  2s ETA:  0s
                                                         
 11.7 MiB /  11.7 MiB (100 %)   4.1 MiB/s in  2s ETA:  0s

  nightly-x86_64-unknown-linux-gnu installed - rustc 1.39.0-nightly (29a54035c 2019-08-19)

+ cd Peroxide/
+ rustup run nightly cargo fetch
    Updating crates.io index
 Downloading crates ...
  Downloaded rand_hc v0.2.0
  Downloaded cfg-if v0.1.9
  Downloaded lazy_static v1.3.0
  Downloaded rand_core v0.5.0
  Downloaded regex v1.2.1
  Downloaded aho-corasick v0.7.6
  Downloaded quote v0.6.13
  Downloaded proc-macro2 v1.0.1
  Downloaded itoa v0.4.4
  Downloaded libc v0.2.62
  Downloaded rand v0.7.0
  Downloaded wasi v0.5.0
  Downloaded inventory v0.1.4
  Downloaded special v0.8.1
  Downloaded unicode-xid v0.1.0
  Downloaded num-traits v0.2.8
  Downloaded quote v1.0.2
  Downloaded getrandom v0.1.10
  Downloaded thread_local v0.3.6
  Downloaded version_check v0.1.5
  Downloaded proc-macro2 v0.4.30
  Downloaded mashup-impl v0.1.9
  Downloaded ryu v1.0.0
  Downloaded proc-macro-hack-impl v0.4.2
  Downloaded ctor v0.1.10
  Downloaded inventory-impl v0.1.4
  Downloaded pyo3-derive-backend v0.7.0
  Downloaded spin v0.5.1
  Downloaded c2-chacha v0.2.2
  Downloaded byteorder v1.3.2
  Downloaded bstr v0.2.7
  Downloaded rand_chacha v0.2.1
  Downloaded syn v0.15.44
  Downloaded pyo3cls v0.7.0
  Downloaded syn v1.0.3
  Downloaded ghost v0.1.1
  Downloaded regex-syntax v0.6.11
  Downloaded serde v1.0.99
  Downloaded mashup v0.1.9
  Downloaded ppv-lite86 v0.2.5
  Downloaded csv-core v0.1.6
  Downloaded autocfg v0.1.6
  Downloaded memchr v2.2.1
  Downloaded unicode-xid v0.2.0
  Downloaded pyo3 v0.7.0
  Downloaded regex-automata v0.1.8
  Downloaded proc-macro-hack v0.4.2
  Downloaded csv v1.1.1
nightly


1
2
3
4
5
6
7
8
9
10
11
12
13
14
15
16
17
18
19
20
21
22
23
24
25
26
27
28
29
30
31
32
33
34
35
36
37
38
39
40
41
42
43
44
45
46
47
48
49
50
51
52
53
54
55
56
57
58
59
60
61
62
63
64
65
66
67
68
69
70
71
72
73
74
75
76
77
78
79
80
81
82
83
84
85
86
87
88
89
90
91
92
93
94
95
96
97
98
99
100
101
102
103
104
105
106
107
108
109
110
111
112
113
114
115
116
117
118
119
120
121
122
123
124
125
126
127
128
129
130
131
132
133
134
135
136
137
138
139
140
141
142
143
144
145
146
147
148
149
150
151
152
153
154
155
156
157
158
159
160
161
162
163
164
165
166
167
168
169
170
171
172
173
174
175
176
177
178
179
180
181
182
183
184
185
186
187
188
189
190
191
192
193
194
195
196
197
198
199
200
201
202
203
204
205
206
207
208
209
210
211
212
213
214
215
216
217
218
219
220
221
222
223
224
225
226
227
228
229
230
231
232
233
234
235
236
237
238
239
240
241
242
243
244
245
246
247
248
249
250
251
252
253
254
255
256
257
258
259
260
261
262
263
264
265
266
267
268
269
270
271
272
273
274
275
276
277
278
279
280
281
282
283
284
285
286
287
288
289
290
291
292
293
294
295
296
297
298
299
300
301
302
303
304
305
306
307
308
309
310
311
312
313
314
315
316
317
318
319
320
321
322
323
324
325
326
327
328
329
330
331
332
333
334
335
336
337
338
339
340
341
342
343
344
345
346
347
348
349
350
351
352
353
354
355
356
357
358
359
360
361
362
363
364
365
366
367
368
369
370
371
372
373
374
375
376
377
378
379
380
381
382
383
384
385
386
387
388
389
390
391
392
393
394
395
396
397
398
399
400
401
402
403
404
405
406
407
408
409
410
411
412
413
414
415
416
417
418
419
420
421
422
423
424
425
426
427
428
429
430
431
432
433
434
435
436
437
438
439
440
441
442
443
444
445
446
447
448
449
450
451
452
453
454
455
456
457
458
459
460
461
462
463
464
465
466
467
468
469
470
471
472
473
474
475
476
477
478
479
480
481
482
483
484
485
486
487
488
489
490
491
492
493
494
495
496
497
498
499
500
501
502
503
504
505
506
507
508
509
510
511
512
513
514
515
516
517
518
519
520
521
522
523
524
525
526
527
528
529
530
531
532
533
534
535
536
537
538
539
540
541
542
543
544
545
546
547
548
549
550
551
552
553
554
555
556
557
558
559
560
561
562
563
564
565
566
567
568
569
570
571
572
573
574
575
576
577
578
579
580
581
582
583
584
585
586
587
588
589
590
591
592
593
594
595
596
597
598
599
600
601
602
603
604
605
606
607
608
609
610
611
612
613
614
615
616
617
618
619
620
621
622
623
624
625
626
627
628
629
630
631
632
633
634
635
636
637
638
639
640
641
642
643
644
645
646
647
648
649
650
651
652
653
654
655
656
657
658
659
660
661
662
663
664
665
666
667
668
669
670
671
672
673
674
675
676
677
678
679
680
681
682
683
684
685
686
687
688
689
690
691
692
693
694
695
696
697
698
699
700
701
702
703
704
705
706
707
708
709
710
711
712
713
714
715
716
717
718
719
720
721
722
723
724
725
726
727
728
729
730
731
732
733
734
735
736
737
738
739
740
This is a big file! Only the last 128KiB is shown. Click here to download the full log.

   Compiling proc-macro2 v0.4.30
     Running `rustc --crate-name build_script_build /home/build/.cargo/registry/src/github.com-1ecc6299db9ec823/proc-macro2-0.4.30/build.rs --color always --crate-type bin --emit=dep-info,link -C debuginfo=2 --cfg 'feature="default"' --cfg 'feature="proc-macro"' -C metadata=bffcecf832686633 -C extra-filename=-bffcecf832686633 --out-dir /home/build/Peroxide/target/debug/build/proc-macro2-bffcecf832686633 -L dependency=/home/build/Peroxide/target/debug/deps --cap-lints allow`
   Compiling proc-macro2 v1.0.1
     Running `rustc --edition=2018 --crate-name build_script_build /home/build/.cargo/registry/src/github.com-1ecc6299db9ec823/proc-macro2-1.0.1/build.rs --color always --crate-type bin --emit=dep-info,link -C debuginfo=2 --cfg 'feature="default"' --cfg 'feature="proc-macro"' -C metadata=63b957323d468f16 -C extra-filename=-63b957323d468f16 --out-dir /home/build/Peroxide/target/debug/build/proc-macro2-63b957323d468f16 -L dependency=/home/build/Peroxide/target/debug/deps --cap-lints allow`
   Compiling unicode-xid v0.2.0
     Running `rustc --crate-name unicode_xid /home/build/.cargo/registry/src/github.com-1ecc6299db9ec823/unicode-xid-0.2.0/src/lib.rs --error-format=json --json=diagnostic-rendered-ansi,artifacts --crate-type lib --emit=dep-info,metadata,link -C debuginfo=2 --cfg 'feature="default"' -C metadata=ad954635c2430267 -C extra-filename=-ad954635c2430267 --out-dir /home/build/Peroxide/target/debug/deps -L dependency=/home/build/Peroxide/target/debug/deps --cap-lints allow`
   Compiling unicode-xid v0.1.0
     Running `rustc --crate-name unicode_xid /home/build/.cargo/registry/src/github.com-1ecc6299db9ec823/unicode-xid-0.1.0/src/lib.rs --error-format=json --json=diagnostic-rendered-ansi,artifacts --crate-type lib --emit=dep-info,metadata,link -C debuginfo=2 --cfg 'feature="default"' -C metadata=14e0da87fc84874b -C extra-filename=-14e0da87fc84874b --out-dir /home/build/Peroxide/target/debug/deps -L dependency=/home/build/Peroxide/target/debug/deps --cap-lints allow`
   Compiling syn v1.0.3
     Running `rustc --edition=2018 --crate-name build_script_build /home/build/.cargo/registry/src/github.com-1ecc6299db9ec823/syn-1.0.3/build.rs --color always --crate-type bin --emit=dep-info,link -C debuginfo=2 --cfg 'feature="clone-impls"' --cfg 'feature="default"' --cfg 'feature="derive"' --cfg 'feature="fold"' --cfg 'feature="full"' --cfg 'feature="parsing"' --cfg 'feature="printing"' --cfg 'feature="proc-macro"' --cfg 'feature="quote"' -C metadata=a1f2575d22bb11e1 -C extra-filename=-a1f2575d22bb11e1 --out-dir /home/build/Peroxide/target/debug/build/syn-a1f2575d22bb11e1 -L dependency=/home/build/Peroxide/target/debug/deps --cap-lints allow`
   Compiling byteorder v1.3.2
     Running `rustc --crate-name build_script_build /home/build/.cargo/registry/src/github.com-1ecc6299db9ec823/byteorder-1.3.2/build.rs --color always --crate-type bin --emit=dep-info,link -C debuginfo=2 -C metadata=0ac149d0535f8dc1 -C extra-filename=-0ac149d0535f8dc1 --out-dir /home/build/Peroxide/target/debug/build/byteorder-0ac149d0535f8dc1 -L dependency=/home/build/Peroxide/target/debug/deps --cap-lints allow`
   Compiling syn v0.15.44
     Running `rustc --crate-name build_script_build /home/build/.cargo/registry/src/github.com-1ecc6299db9ec823/syn-0.15.44/build.rs --color always --crate-type bin --emit=dep-info,link -C debuginfo=2 --cfg 'feature="clone-impls"' --cfg 'feature="default"' --cfg 'feature="derive"' --cfg 'feature="extra-traits"' --cfg 'feature="full"' --cfg 'feature="parsing"' --cfg 'feature="printing"' --cfg 'feature="proc-macro"' --cfg 'feature="quote"' -C metadata=ab2a4a21ebdd2a69 -C extra-filename=-ab2a4a21ebdd2a69 --out-dir /home/build/Peroxide/target/debug/build/syn-ab2a4a21ebdd2a69 -L dependency=/home/build/Peroxide/target/debug/deps --cap-lints allow`
   Compiling lazy_static v1.3.0
     Running `rustc --crate-name lazy_static /home/build/.cargo/registry/src/github.com-1ecc6299db9ec823/lazy_static-1.3.0/src/lib.rs --error-format=json --json=diagnostic-rendered-ansi,artifacts --crate-type lib --emit=dep-info,metadata,link -C debuginfo=2 -C metadata=0d302924bac79a66 -C extra-filename=-0d302924bac79a66 --out-dir /home/build/Peroxide/target/debug/deps -L dependency=/home/build/Peroxide/target/debug/deps --cap-lints allow`
   Compiling getrandom v0.1.10
     Running `rustc --edition=2018 --crate-name build_script_build /home/build/.cargo/registry/src/github.com-1ecc6299db9ec823/getrandom-0.1.10/build.rs --color always --crate-type bin --emit=dep-info,link -C debuginfo=2 --cfg 'feature="std"' -C metadata=edf78eef77f32181 -C extra-filename=-edf78eef77f32181 --out-dir /home/build/Peroxide/target/debug/build/getrandom-edf78eef77f32181 -L dependency=/home/build/Peroxide/target/debug/deps --cap-lints allow`
   Compiling proc-macro-hack-impl v0.4.2
     Running `rustc --crate-name proc_macro_hack_impl /home/build/.cargo/registry/src/github.com-1ecc6299db9ec823/proc-macro-hack-impl-0.4.2/src/lib.rs --color always --crate-type proc-macro --emit=dep-info,link -C prefer-dynamic -C debuginfo=2 -C metadata=14e7a3f93e650afc -C extra-filename=-14e7a3f93e650afc --out-dir /home/build/Peroxide/target/debug/deps -L dependency=/home/build/Peroxide/target/debug/deps --cap-lints allow`
   Compiling cfg-if v0.1.9
     Running `rustc --crate-name cfg_if /home/build/.cargo/registry/src/github.com-1ecc6299db9ec823/cfg-if-0.1.9/src/lib.rs --error-format=json --json=diagnostic-rendered-ansi,artifacts --crate-type lib --emit=dep-info,metadata,link -C debuginfo=2 -C metadata=6c8a14337e0bb345 -C extra-filename=-6c8a14337e0bb345 --out-dir /home/build/Peroxide/target/debug/deps -L dependency=/home/build/Peroxide/target/debug/deps --cap-lints allow`
   Compiling serde v1.0.99
     Running `rustc --crate-name build_script_build /home/build/.cargo/registry/src/github.com-1ecc6299db9ec823/serde-1.0.99/build.rs --color always --crate-type bin --emit=dep-info,link -C debuginfo=2 --cfg 'feature="default"' --cfg 'feature="std"' -C metadata=871e044edc19d9ca -C extra-filename=-871e044edc19d9ca --out-dir /home/build/Peroxide/target/debug/build/serde-871e044edc19d9ca -L dependency=/home/build/Peroxide/target/debug/deps --cap-lints allow`
   Compiling regex-syntax v0.6.11
     Running `rustc --crate-name regex_syntax /home/build/.cargo/registry/src/github.com-1ecc6299db9ec823/regex-syntax-0.6.11/src/lib.rs --error-format=json --json=diagnostic-rendered-ansi,artifacts --crate-type lib --emit=dep-info,metadata,link -C debuginfo=2 -C metadata=cbad81727d07a531 -C extra-filename=-cbad81727d07a531 --out-dir /home/build/Peroxide/target/debug/deps -L dependency=/home/build/Peroxide/target/debug/deps --cap-lints allow`
   Compiling autocfg v0.1.6
     Running `rustc --crate-name autocfg /home/build/.cargo/registry/src/github.com-1ecc6299db9ec823/autocfg-0.1.6/src/lib.rs --color always --crate-type lib --emit=dep-info,metadata,link -C debuginfo=2 -C metadata=0ed9854d754876dd -C extra-filename=-0ed9854d754876dd --out-dir /home/build/Peroxide/target/debug/deps -L dependency=/home/build/Peroxide/target/debug/deps --cap-lints allow`
   Compiling ppv-lite86 v0.2.5
     Running `rustc --edition=2018 --crate-name ppv_lite86 /home/build/.cargo/registry/src/github.com-1ecc6299db9ec823/ppv-lite86-0.2.5/src/lib.rs --error-format=json --json=diagnostic-rendered-ansi,artifacts --crate-type lib --emit=dep-info,metadata,link -C debuginfo=2 --cfg 'feature="default"' --cfg 'feature="simd"' --cfg 'feature="std"' -C metadata=e891108c233479a8 -C extra-filename=-e891108c233479a8 --out-dir /home/build/Peroxide/target/debug/deps -L dependency=/home/build/Peroxide/target/debug/deps --cap-lints allow`
   Compiling ryu v1.0.0
     Running `rustc --crate-name build_script_build /home/build/.cargo/registry/src/github.com-1ecc6299db9ec823/ryu-1.0.0/build.rs --color always --crate-type bin --emit=dep-info,link -C debuginfo=2 -C metadata=68edda0e9fe695eb -C extra-filename=-68edda0e9fe695eb --out-dir /home/build/Peroxide/target/debug/build/ryu-68edda0e9fe695eb -L dependency=/home/build/Peroxide/target/debug/deps --cap-lints allow`
   Compiling version_check v0.1.5
     Running `rustc --crate-name version_check /home/build/.cargo/registry/src/github.com-1ecc6299db9ec823/version_check-0.1.5/src/lib.rs --color always --crate-type lib --emit=dep-info,metadata,link -C debuginfo=2 -C metadata=8f4a892399a47703 -C extra-filename=-8f4a892399a47703 --out-dir /home/build/Peroxide/target/debug/deps -L dependency=/home/build/Peroxide/target/debug/deps --cap-lints allow`
   Compiling spin v0.5.1
     Running `rustc --crate-name spin /home/build/.cargo/registry/src/github.com-1ecc6299db9ec823/spin-0.5.1/src/lib.rs --error-format=json --json=diagnostic-rendered-ansi,artifacts --crate-type lib --emit=dep-info,metadata,link -C debuginfo=2 -C metadata=354dcc7a4c8793f4 -C extra-filename=-354dcc7a4c8793f4 --out-dir /home/build/Peroxide/target/debug/deps -L dependency=/home/build/Peroxide/target/debug/deps --cap-lints allow`
   Compiling itoa v0.4.4
     Running `rustc --crate-name itoa /home/build/.cargo/registry/src/github.com-1ecc6299db9ec823/itoa-0.4.4/src/lib.rs --error-format=json --json=diagnostic-rendered-ansi,artifacts --crate-type lib --emit=dep-info,metadata,link -C debuginfo=2 --cfg 'feature="default"' --cfg 'feature="std"' -C metadata=c398e77cb1dfeed7 -C extra-filename=-c398e77cb1dfeed7 --out-dir /home/build/Peroxide/target/debug/deps -L dependency=/home/build/Peroxide/target/debug/deps --cap-lints allow`
     Running `/home/build/Peroxide/target/debug/build/libc-c996ae27c85ead11/build-script-build`
     Running `/home/build/Peroxide/target/debug/build/memchr-fc81211e70dd4157/build-script-build`
     Running `/home/build/Peroxide/target/debug/build/proc-macro2-bffcecf832686633/build-script-build`
     Running `/home/build/Peroxide/target/debug/build/proc-macro2-63b957323d468f16/build-script-build`
     Running `/home/build/Peroxide/target/debug/build/syn-a1f2575d22bb11e1/build-script-build`
     Running `/home/build/Peroxide/target/debug/build/byteorder-0ac149d0535f8dc1/build-script-build`
     Running `/home/build/Peroxide/target/debug/build/syn-ab2a4a21ebdd2a69/build-script-build`
   Compiling thread_local v0.3.6
     Running `rustc --crate-name thread_local /home/build/.cargo/registry/src/github.com-1ecc6299db9ec823/thread_local-0.3.6/src/lib.rs --error-format=json --json=diagnostic-rendered-ansi,artifacts --crate-type lib --emit=dep-info,metadata,link -C debuginfo=2 -C metadata=fe6d8230eafeb9b0 -C extra-filename=-fe6d8230eafeb9b0 --out-dir /home/build/Peroxide/target/debug/deps -L dependency=/home/build/Peroxide/target/debug/deps --extern lazy_static=/home/build/Peroxide/target/debug/deps/liblazy_static-0d302924bac79a66.rmeta --cap-lints allow`
     Running `/home/build/Peroxide/target/debug/build/getrandom-edf78eef77f32181/build-script-build`
   Compiling proc-macro-hack v0.4.2
     Running `rustc --crate-name proc_macro_hack /home/build/.cargo/registry/src/github.com-1ecc6299db9ec823/proc-macro-hack-0.4.2/src/lib.rs --error-format=json --json=diagnostic-rendered-ansi,artifacts --crate-type lib --emit=dep-info,metadata,link -C debuginfo=2 -C metadata=3f4d818a024fe5c2 -C extra-filename=-3f4d818a024fe5c2 --out-dir /home/build/Peroxide/target/debug/deps -L dependency=/home/build/Peroxide/target/debug/deps --extern proc_macro_hack_impl=/home/build/Peroxide/target/debug/deps/libproc_macro_hack_impl-14e7a3f93e650afc.so --cap-lints allow`
     Running `/home/build/Peroxide/target/debug/build/serde-871e044edc19d9ca/build-script-build`
   Compiling num-traits v0.2.8
     Running `rustc --crate-name build_script_build /home/build/.cargo/registry/src/github.com-1ecc6299db9ec823/num-traits-0.2.8/build.rs --color always --crate-type bin --emit=dep-info,link -C debuginfo=2 --cfg 'feature="default"' --cfg 'feature="std"' -C metadata=2491059fae653afa -C extra-filename=-2491059fae653afa --out-dir /home/build/Peroxide/target/debug/build/num-traits-2491059fae653afa -L dependency=/home/build/Peroxide/target/debug/deps --extern autocfg=/home/build/Peroxide/target/debug/deps/libautocfg-0ed9854d754876dd.rlib --cap-lints allow`
   Compiling c2-chacha v0.2.2
     Running `rustc --edition=2018 --crate-name c2_chacha /home/build/.cargo/registry/src/github.com-1ecc6299db9ec823/c2-chacha-0.2.2/src/lib.rs --error-format=json --json=diagnostic-rendered-ansi,artifacts --crate-type lib --emit=dep-info,metadata,link -C debuginfo=2 --cfg 'feature="lazy_static"' --cfg 'feature="simd"' --cfg 'feature="std"' -C metadata=7348e0383f63967f -C extra-filename=-7348e0383f63967f --out-dir /home/build/Peroxide/target/debug/deps -L dependency=/home/build/Peroxide/target/debug/deps --extern lazy_static=/home/build/Peroxide/target/debug/deps/liblazy_static-0d302924bac79a66.rmeta --extern ppv_lite86=/home/build/Peroxide/target/debug/deps/libppv_lite86-e891108c233479a8.rmeta --cap-lints allow`
     Running `/home/build/Peroxide/target/debug/build/ryu-68edda0e9fe695eb/build-script-build`
     Running `rustc --crate-name libc /home/build/.cargo/registry/src/github.com-1ecc6299db9ec823/libc-0.2.62/src/lib.rs --error-format=json --json=diagnostic-rendered-ansi,artifacts --crate-type lib --emit=dep-info,metadata,link -C debuginfo=2 --cfg 'feature="default"' --cfg 'feature="std"' -C metadata=3ca60aaac7a7afe9 -C extra-filename=-3ca60aaac7a7afe9 --out-dir /home/build/Peroxide/target/debug/deps -L dependency=/home/build/Peroxide/target/debug/deps --cap-lints allow --cfg freebsd11 --cfg libc_priv_mod_use --cfg libc_union --cfg libc_const_size_of --cfg libc_align --cfg libc_core_cvoid --cfg libc_packedN`
     Running `rustc --crate-name proc_macro2 /home/build/.cargo/registry/src/github.com-1ecc6299db9ec823/proc-macro2-0.4.30/src/lib.rs --error-format=json --json=diagnostic-rendered-ansi,artifacts --crate-type lib --emit=dep-info,metadata,link -C debuginfo=2 --cfg 'feature="default"' --cfg 'feature="proc-macro"' -C metadata=77e7745ec252ffda -C extra-filename=-77e7745ec252ffda --out-dir /home/build/Peroxide/target/debug/deps -L dependency=/home/build/Peroxide/target/debug/deps --extern unicode_xid=/home/build/Peroxide/target/debug/deps/libunicode_xid-14e0da87fc84874b.rmeta --cap-lints allow --cfg u128 --cfg use_proc_macro --cfg wrap_proc_macro --cfg proc_macro_span`
     Running `rustc --edition=2018 --crate-name proc_macro2 /home/build/.cargo/registry/src/github.com-1ecc6299db9ec823/proc-macro2-1.0.1/src/lib.rs --error-format=json --json=diagnostic-rendered-ansi,artifacts --crate-type lib --emit=dep-info,metadata,link -C debuginfo=2 --cfg 'feature="default"' --cfg 'feature="proc-macro"' -C metadata=b1f9618aa6b9c1da -C extra-filename=-b1f9618aa6b9c1da --out-dir /home/build/Peroxide/target/debug/deps -L dependency=/home/build/Peroxide/target/debug/deps --extern unicode_xid=/home/build/Peroxide/target/debug/deps/libunicode_xid-ad954635c2430267.rmeta --cap-lints allow --cfg use_proc_macro --cfg wrap_proc_macro --cfg proc_macro_span`
     Running `rustc --crate-name byteorder /home/build/.cargo/registry/src/github.com-1ecc6299db9ec823/byteorder-1.3.2/src/lib.rs --error-format=json --json=diagnostic-rendered-ansi,artifacts --crate-type lib --emit=dep-info,metadata,link -C debuginfo=2 -C metadata=1bfdd0bb62fae2ff -C extra-filename=-1bfdd0bb62fae2ff --out-dir /home/build/Peroxide/target/debug/deps -L dependency=/home/build/Peroxide/target/debug/deps --cap-lints allow --cfg byteorder_i128`
     Running `rustc --crate-name serde /home/build/.cargo/registry/src/github.com-1ecc6299db9ec823/serde-1.0.99/src/lib.rs --error-format=json --json=diagnostic-rendered-ansi,artifacts --crate-type lib --emit=dep-info,metadata,link -C debuginfo=2 --cfg 'feature="default"' --cfg 'feature="std"' -C metadata=c05a1e41f10023eb -C extra-filename=-c05a1e41f10023eb --out-dir /home/build/Peroxide/target/debug/deps -L dependency=/home/build/Peroxide/target/debug/deps --cap-lints allow --cfg ops_bound --cfg core_reverse --cfg de_boxed_c_str --cfg de_rc_dst --cfg core_duration --cfg integer128 --cfg range_inclusive --cfg num_nonzero --cfg core_try_from --cfg num_nonzero_signed --cfg std_atomic64 --cfg std_atomic`
     Running `/home/build/Peroxide/target/debug/build/num-traits-2491059fae653afa/build-script-build`
     Running `rustc --crate-name ryu /home/build/.cargo/registry/src/github.com-1ecc6299db9ec823/ryu-1.0.0/src/lib.rs --error-format=json --json=diagnostic-rendered-ansi,artifacts --crate-type lib --emit=dep-info,metadata,link -C debuginfo=2 -C metadata=c644ccd6afd39853 -C extra-filename=-c644ccd6afd39853 --out-dir /home/build/Peroxide/target/debug/deps -L dependency=/home/build/Peroxide/target/debug/deps --cap-lints allow --cfg integer128 --cfg must_use_return`
     Running `rustc --crate-name memchr /home/build/.cargo/registry/src/github.com-1ecc6299db9ec823/memchr-2.2.1/src/lib.rs --error-format=json --json=diagnostic-rendered-ansi,artifacts --crate-type lib --emit=dep-info,metadata,link -C debuginfo=2 --cfg 'feature="default"' --cfg 'feature="libc"' --cfg 'feature="use_std"' -C metadata=e10867fa98bcc390 -C extra-filename=-e10867fa98bcc390 --out-dir /home/build/Peroxide/target/debug/deps -L dependency=/home/build/Peroxide/target/debug/deps --extern libc=/home/build/Peroxide/target/debug/deps/liblibc-3ca60aaac7a7afe9.rmeta --cap-lints allow --cfg memchr_runtime_simd --cfg memchr_runtime_sse2 --cfg memchr_runtime_sse42 --cfg memchr_runtime_avx --cfg memchr_libc`
     Running `rustc --edition=2018 --crate-name getrandom /home/build/.cargo/registry/src/github.com-1ecc6299db9ec823/getrandom-0.1.10/src/lib.rs --error-format=json --json=diagnostic-rendered-ansi,artifacts --crate-type lib --emit=dep-info,metadata,link -C debuginfo=2 --cfg 'feature="std"' -C metadata=9e1d346a536d3ab6 -C extra-filename=-9e1d346a536d3ab6 --out-dir /home/build/Peroxide/target/debug/deps -L dependency=/home/build/Peroxide/target/debug/deps --extern cfg_if=/home/build/Peroxide/target/debug/deps/libcfg_if-6c8a14337e0bb345.rmeta --extern libc=/home/build/Peroxide/target/debug/deps/liblibc-3ca60aaac7a7afe9.rmeta --cap-lints allow`
   Compiling special v0.8.1
     Running `rustc --crate-name special /home/build/.cargo/registry/src/github.com-1ecc6299db9ec823/special-0.8.1/src/lib.rs --error-format=json --json=diagnostic-rendered-ansi,artifacts --crate-type lib --emit=dep-info,metadata,link -C debuginfo=2 -C metadata=585ff5d6f6fa831a -C extra-filename=-585ff5d6f6fa831a --out-dir /home/build/Peroxide/target/debug/deps -L dependency=/home/build/Peroxide/target/debug/deps --extern libc=/home/build/Peroxide/target/debug/deps/liblibc-3ca60aaac7a7afe9.rmeta --cap-lints allow`
   Compiling quote v0.6.13
     Running `rustc --crate-name quote /home/build/.cargo/registry/src/github.com-1ecc6299db9ec823/quote-0.6.13/src/lib.rs --error-format=json --json=diagnostic-rendered-ansi,artifacts --crate-type lib --emit=dep-info,metadata,link -C debuginfo=2 --cfg 'feature="default"' --cfg 'feature="proc-macro"' -C metadata=8137e0024bb018f3 -C extra-filename=-8137e0024bb018f3 --out-dir /home/build/Peroxide/target/debug/deps -L dependency=/home/build/Peroxide/target/debug/deps --extern proc_macro2=/home/build/Peroxide/target/debug/deps/libproc_macro2-77e7745ec252ffda.rmeta --cap-lints allow`
   Compiling mashup-impl v0.1.9
     Running `rustc --crate-name mashup_impl /home/build/.cargo/registry/src/github.com-1ecc6299db9ec823/mashup-impl-0.1.9/src/lib.rs --color always --crate-type proc-macro --emit=dep-info,link -C prefer-dynamic -C debuginfo=2 -C metadata=7d74022fcc141270 -C extra-filename=-7d74022fcc141270 --out-dir /home/build/Peroxide/target/debug/deps -L dependency=/home/build/Peroxide/target/debug/deps --extern proc_macro_hack=/home/build/Peroxide/target/debug/deps/libproc_macro_hack-3f4d818a024fe5c2.rlib --extern proc_macro2=/home/build/Peroxide/target/debug/deps/libproc_macro2-77e7745ec252ffda.rlib --cap-lints allow`
   Compiling quote v1.0.2
     Running `rustc --edition=2018 --crate-name quote /home/build/.cargo/registry/src/github.com-1ecc6299db9ec823/quote-1.0.2/src/lib.rs --error-format=json --json=diagnostic-rendered-ansi,artifacts --crate-type lib --emit=dep-info,metadata,link -C debuginfo=2 --cfg 'feature="default"' --cfg 'feature="proc-macro"' -C metadata=69a00a80acd152ae -C extra-filename=-69a00a80acd152ae --out-dir /home/build/Peroxide/target/debug/deps -L dependency=/home/build/Peroxide/target/debug/deps --extern proc_macro2=/home/build/Peroxide/target/debug/deps/libproc_macro2-b1f9618aa6b9c1da.rmeta --cap-lints allow`
   Compiling regex-automata v0.1.8
     Running `rustc --crate-name regex_automata /home/build/.cargo/registry/src/github.com-1ecc6299db9ec823/regex-automata-0.1.8/src/lib.rs --error-format=json --json=diagnostic-rendered-ansi,artifacts --crate-type lib --emit=dep-info,metadata,link -C debuginfo=2 -C metadata=920203aa1e4848b1 -C extra-filename=-920203aa1e4848b1 --out-dir /home/build/Peroxide/target/debug/deps -L dependency=/home/build/Peroxide/target/debug/deps --extern byteorder=/home/build/Peroxide/target/debug/deps/libbyteorder-1bfdd0bb62fae2ff.rmeta --cap-lints allow`
     Running `rustc --crate-name num_traits /home/build/.cargo/registry/src/github.com-1ecc6299db9ec823/num-traits-0.2.8/src/lib.rs --error-format=json --json=diagnostic-rendered-ansi,artifacts --crate-type lib --emit=dep-info,metadata,link -C debuginfo=2 --cfg 'feature="default"' --cfg 'feature="std"' -C metadata=5023b607e4d8a39c -C extra-filename=-5023b607e4d8a39c --out-dir /home/build/Peroxide/target/debug/deps -L dependency=/home/build/Peroxide/target/debug/deps --cap-lints allow --cfg has_i128`
   Compiling aho-corasick v0.7.6
     Running `rustc --crate-name aho_corasick /home/build/.cargo/registry/src/github.com-1ecc6299db9ec823/aho-corasick-0.7.6/src/lib.rs --error-format=json --json=diagnostic-rendered-ansi,artifacts --crate-type lib --emit=dep-info,metadata,link -C debuginfo=2 --cfg 'feature="default"' --cfg 'feature="std"' -C metadata=ec012a9647150f29 -C extra-filename=-ec012a9647150f29 --out-dir /home/build/Peroxide/target/debug/deps -L dependency=/home/build/Peroxide/target/debug/deps --extern memchr=/home/build/Peroxide/target/debug/deps/libmemchr-e10867fa98bcc390.rmeta --cap-lints allow`
   Compiling csv-core v0.1.6
     Running `rustc --edition=2018 --crate-name csv_core /home/build/.cargo/registry/src/github.com-1ecc6299db9ec823/csv-core-0.1.6/src/lib.rs --error-format=json --json=diagnostic-rendered-ansi,artifacts --crate-type lib --emit=dep-info,metadata,link -C debuginfo=2 --cfg 'feature="default"' --cfg 'feature="libc"' -C metadata=cacc7fdcae8973ab -C extra-filename=-cacc7fdcae8973ab --out-dir /home/build/Peroxide/target/debug/deps -L dependency=/home/build/Peroxide/target/debug/deps --extern memchr=/home/build/Peroxide/target/debug/deps/libmemchr-e10867fa98bcc390.rmeta --cap-lints allow`
   Compiling rand_core v0.5.0
     Running `rustc --crate-name rand_core /home/build/.cargo/registry/src/github.com-1ecc6299db9ec823/rand_core-0.5.0/src/lib.rs --error-format=json --json=diagnostic-rendered-ansi,artifacts --crate-type lib --emit=dep-info,metadata,link -C debuginfo=2 --cfg 'feature="alloc"' --cfg 'feature="getrandom"' --cfg 'feature="std"' -C metadata=bafd52b559711f10 -C extra-filename=-bafd52b559711f10 --out-dir /home/build/Peroxide/target/debug/deps -L dependency=/home/build/Peroxide/target/debug/deps --extern getrandom=/home/build/Peroxide/target/debug/deps/libgetrandom-9e1d346a536d3ab6.rmeta --cap-lints allow`
     Running `rustc --crate-name syn /home/build/.cargo/registry/src/github.com-1ecc6299db9ec823/syn-0.15.44/src/lib.rs --error-format=json --json=diagnostic-rendered-ansi,artifacts --crate-type lib --emit=dep-info,metadata,link -C debuginfo=2 --cfg 'feature="clone-impls"' --cfg 'feature="default"' --cfg 'feature="derive"' --cfg 'feature="extra-traits"' --cfg 'feature="full"' --cfg 'feature="parsing"' --cfg 'feature="printing"' --cfg 'feature="proc-macro"' --cfg 'feature="quote"' -C metadata=43f84dfe1dfe1b83 -C extra-filename=-43f84dfe1dfe1b83 --out-dir /home/build/Peroxide/target/debug/deps -L dependency=/home/build/Peroxide/target/debug/deps --extern proc_macro2=/home/build/Peroxide/target/debug/deps/libproc_macro2-77e7745ec252ffda.rmeta --extern quote=/home/build/Peroxide/target/debug/deps/libquote-8137e0024bb018f3.rmeta --extern unicode_xid=/home/build/Peroxide/target/debug/deps/libunicode_xid-14e0da87fc84874b.rmeta --cap-lints allow --cfg syn_can_match_trailing_dollar --cfg syn_can_use_thread_id --cfg syn_can_use_associated_constants --cfg syn_can_call_macro_by_path`
   Compiling mashup v0.1.9
     Running `rustc --crate-name mashup /home/build/.cargo/registry/src/github.com-1ecc6299db9ec823/mashup-0.1.9/src/lib.rs --error-format=json --json=diagnostic-rendered-ansi,artifacts --crate-type lib --emit=dep-info,metadata,link -C debuginfo=2 -C metadata=074d8ce29d67fe1d -C extra-filename=-074d8ce29d67fe1d --out-dir /home/build/Peroxide/target/debug/deps -L dependency=/home/build/Peroxide/target/debug/deps --extern mashup_impl=/home/build/Peroxide/target/debug/deps/libmashup_impl-7d74022fcc141270.so --extern proc_macro_hack=/home/build/Peroxide/target/debug/deps/libproc_macro_hack-3f4d818a024fe5c2.rmeta --cap-lints allow`
     Running `rustc --edition=2018 --crate-name syn /home/build/.cargo/registry/src/github.com-1ecc6299db9ec823/syn-1.0.3/src/lib.rs --color always --crate-type lib --emit=dep-info,metadata,link -C debuginfo=2 --cfg 'feature="clone-impls"' --cfg 'feature="default"' --cfg 'feature="derive"' --cfg 'feature="fold"' --cfg 'feature="full"' --cfg 'feature="parsing"' --cfg 'feature="printing"' --cfg 'feature="proc-macro"' --cfg 'feature="quote"' -C metadata=164f5010c4d37396 -C extra-filename=-164f5010c4d37396 --out-dir /home/build/Peroxide/target/debug/deps -L dependency=/home/build/Peroxide/target/debug/deps --extern proc_macro2=/home/build/Peroxide/target/debug/deps/libproc_macro2-b1f9618aa6b9c1da.rmeta --extern quote=/home/build/Peroxide/target/debug/deps/libquote-69a00a80acd152ae.rmeta --extern unicode_xid=/home/build/Peroxide/target/debug/deps/libunicode_xid-ad954635c2430267.rmeta --cap-lints allow`
   Compiling bstr v0.2.7
     Running `rustc --crate-name bstr /home/build/.cargo/registry/src/github.com-1ecc6299db9ec823/bstr-0.2.7/src/lib.rs --error-format=json --json=diagnostic-rendered-ansi,artifacts --crate-type lib --emit=dep-info,metadata,link -C debuginfo=2 --cfg 'feature="default"' --cfg 'feature="lazy_static"' --cfg 'feature="regex-automata"' --cfg 'feature="serde"' --cfg 'feature="serde1"' --cfg 'feature="serde1-nostd"' --cfg 'feature="std"' --cfg 'feature="unicode"' -C metadata=08f2a45cdf3b8bae -C extra-filename=-08f2a45cdf3b8bae --out-dir /home/build/Peroxide/target/debug/deps -L dependency=/home/build/Peroxide/target/debug/deps --extern lazy_static=/home/build/Peroxide/target/debug/deps/liblazy_static-0d302924bac79a66.rmeta --extern memchr=/home/build/Peroxide/target/debug/deps/libmemchr-e10867fa98bcc390.rmeta --extern regex_automata=/home/build/Peroxide/target/debug/deps/libregex_automata-920203aa1e4848b1.rmeta --extern serde=/home/build/Peroxide/target/debug/deps/libserde-c05a1e41f10023eb.rmeta --cap-lints allow`
   Compiling regex v1.2.1
     Running `rustc --crate-name regex /home/build/.cargo/registry/src/github.com-1ecc6299db9ec823/regex-1.2.1/src/lib.rs --color always --crate-type lib --emit=dep-info,metadata,link -C debuginfo=2 --cfg 'feature="default"' --cfg 'feature="use_std"' -C metadata=d47d8496d952947e -C extra-filename=-d47d8496d952947e --out-dir /home/build/Peroxide/target/debug/deps -L dependency=/home/build/Peroxide/target/debug/deps --extern aho_corasick=/home/build/Peroxide/target/debug/deps/libaho_corasick-ec012a9647150f29.rmeta --extern memchr=/home/build/Peroxide/target/debug/deps/libmemchr-e10867fa98bcc390.rmeta --extern regex_syntax=/home/build/Peroxide/target/debug/deps/libregex_syntax-cbad81727d07a531.rmeta --extern thread_local=/home/build/Peroxide/target/debug/deps/libthread_local-fe6d8230eafeb9b0.rmeta --cap-lints allow`
   Compiling rand_chacha v0.2.1
     Running `rustc --edition=2018 --crate-name rand_chacha /home/build/.cargo/registry/src/github.com-1ecc6299db9ec823/rand_chacha-0.2.1/src/lib.rs --error-format=json --json=diagnostic-rendered-ansi,artifacts --crate-type lib --emit=dep-info,metadata,link -C debuginfo=2 --cfg 'feature="default"' --cfg 'feature="simd"' --cfg 'feature="std"' -C metadata=17e4e1803283cc82 -C extra-filename=-17e4e1803283cc82 --out-dir /home/build/Peroxide/target/debug/deps -L dependency=/home/build/Peroxide/target/debug/deps --extern c2_chacha=/home/build/Peroxide/target/debug/deps/libc2_chacha-7348e0383f63967f.rmeta --extern rand_core=/home/build/Peroxide/target/debug/deps/librand_core-bafd52b559711f10.rmeta --cap-lints allow`
   Compiling pyo3-derive-backend v0.7.0
     Running `rustc --edition=2018 --crate-name pyo3_derive_backend /home/build/.cargo/registry/src/github.com-1ecc6299db9ec823/pyo3-derive-backend-0.7.0/src/lib.rs --color always --crate-type lib --emit=dep-info,metadata,link -C debuginfo=2 -C metadata=b991b3b02dabccfa -C extra-filename=-b991b3b02dabccfa --out-dir /home/build/Peroxide/target/debug/deps -L dependency=/home/build/Peroxide/target/debug/deps --extern proc_macro2=/home/build/Peroxide/target/debug/deps/libproc_macro2-77e7745ec252ffda.rmeta --extern quote=/home/build/Peroxide/target/debug/deps/libquote-8137e0024bb018f3.rmeta --extern syn=/home/build/Peroxide/target/debug/deps/libsyn-43f84dfe1dfe1b83.rmeta --cap-lints allow`
   Compiling ghost v0.1.1
     Running `rustc --edition=2018 --crate-name ghost /home/build/.cargo/registry/src/github.com-1ecc6299db9ec823/ghost-0.1.1/src/lib.rs --color always --crate-type proc-macro --emit=dep-info,link -C prefer-dynamic -C debuginfo=2 -C metadata=5f0a777ee4650a2e -C extra-filename=-5f0a777ee4650a2e --out-dir /home/build/Peroxide/target/debug/deps -L dependency=/home/build/Peroxide/target/debug/deps --extern proc_macro2=/home/build/Peroxide/target/debug/deps/libproc_macro2-b1f9618aa6b9c1da.rlib --extern quote=/home/build/Peroxide/target/debug/deps/libquote-69a00a80acd152ae.rlib --extern syn=/home/build/Peroxide/target/debug/deps/libsyn-164f5010c4d37396.rlib --cap-lints allow`
   Compiling inventory-impl v0.1.4
     Running `rustc --edition=2018 --crate-name inventory_impl /home/build/.cargo/registry/src/github.com-1ecc6299db9ec823/inventory-impl-0.1.4/src/lib.rs --color always --crate-type proc-macro --emit=dep-info,link -C prefer-dynamic -C debuginfo=2 -C metadata=5f229761cd90a0ff -C extra-filename=-5f229761cd90a0ff --out-dir /home/build/Peroxide/target/debug/deps -L dependency=/home/build/Peroxide/target/debug/deps --extern proc_macro2=/home/build/Peroxide/target/debug/deps/libproc_macro2-b1f9618aa6b9c1da.rlib --extern quote=/home/build/Peroxide/target/debug/deps/libquote-69a00a80acd152ae.rlib --extern syn=/home/build/Peroxide/target/debug/deps/libsyn-164f5010c4d37396.rlib --cap-lints allow`
   Compiling ctor v0.1.10
     Running `rustc --edition=2018 --crate-name ctor /home/build/.cargo/registry/src/github.com-1ecc6299db9ec823/ctor-0.1.10/src/lib.rs --color always --crate-type proc-macro --emit=dep-info,link -C prefer-dynamic -C debuginfo=2 -C metadata=40ff998ae9570e1e -C extra-filename=-40ff998ae9570e1e --out-dir /home/build/Peroxide/target/debug/deps -L dependency=/home/build/Peroxide/target/debug/deps --extern quote=/home/build/Peroxide/target/debug/deps/libquote-69a00a80acd152ae.rlib --extern syn=/home/build/Peroxide/target/debug/deps/libsyn-164f5010c4d37396.rlib --cap-lints allow`
   Compiling csv v1.1.1
     Running `rustc --edition=2018 --crate-name csv /home/build/.cargo/registry/src/github.com-1ecc6299db9ec823/csv-1.1.1/src/lib.rs --error-format=json --json=diagnostic-rendered-ansi,artifacts --crate-type lib --emit=dep-info,metadata,link -C debuginfo=2 -C metadata=6969047f78d86bfe -C extra-filename=-6969047f78d86bfe --out-dir /home/build/Peroxide/target/debug/deps -L dependency=/home/build/Peroxide/target/debug/deps --extern bstr=/home/build/Peroxide/target/debug/deps/libbstr-08f2a45cdf3b8bae.rmeta --extern csv_core=/home/build/Peroxide/target/debug/deps/libcsv_core-cacc7fdcae8973ab.rmeta --extern itoa=/home/build/Peroxide/target/debug/deps/libitoa-c398e77cb1dfeed7.rmeta --extern ryu=/home/build/Peroxide/target/debug/deps/libryu-c644ccd6afd39853.rmeta --extern serde=/home/build/Peroxide/target/debug/deps/libserde-c05a1e41f10023eb.rmeta --cap-lints allow`
   Compiling pyo3 v0.7.0
     Running `rustc --edition=2018 --crate-name build_script_build /home/build/.cargo/registry/src/github.com-1ecc6299db9ec823/pyo3-0.7.0/build.rs --color always --crate-type bin --emit=dep-info,link -C debuginfo=2 --cfg 'feature="default"' -C metadata=0ca1f1c3146eb469 -C extra-filename=-0ca1f1c3146eb469 --out-dir /home/build/Peroxide/target/debug/build/pyo3-0ca1f1c3146eb469 -L dependency=/home/build/Peroxide/target/debug/deps --extern regex=/home/build/Peroxide/target/debug/deps/libregex-d47d8496d952947e.rlib --extern version_check=/home/build/Peroxide/target/debug/deps/libversion_check-8f4a892399a47703.rlib --cap-lints allow`
   Compiling rand v0.7.0
     Running `rustc --edition=2018 --crate-name rand /home/build/.cargo/registry/src/github.com-1ecc6299db9ec823/rand-0.7.0/src/lib.rs --error-format=json --json=diagnostic-rendered-ansi,artifacts --crate-type lib --emit=dep-info,metadata,link -C debuginfo=2 --cfg 'feature="alloc"' --cfg 'feature="default"' --cfg 'feature="getrandom"' --cfg 'feature="getrandom_package"' --cfg 'feature="std"' -C metadata=124378dd801f0a0c -C extra-filename=-124378dd801f0a0c --out-dir /home/build/Peroxide/target/debug/deps -L dependency=/home/build/Peroxide/target/debug/deps --extern getrandom_package=/home/build/Peroxide/target/debug/deps/libgetrandom-9e1d346a536d3ab6.rmeta --extern libc=/home/build/Peroxide/target/debug/deps/liblibc-3ca60aaac7a7afe9.rmeta --extern rand_chacha=/home/build/Peroxide/target/debug/deps/librand_chacha-17e4e1803283cc82.rmeta --extern rand_core=/home/build/Peroxide/target/debug/deps/librand_core-bafd52b559711f10.rmeta --cap-lints allow`
   Compiling pyo3cls v0.7.0
     Running `rustc --edition=2018 --crate-name pyo3cls /home/build/.cargo/registry/src/github.com-1ecc6299db9ec823/pyo3cls-0.7.0/src/lib.rs --color always --crate-type proc-macro --emit=dep-info,link -C prefer-dynamic -C debuginfo=2 -C metadata=ba699b69f7d3d497 -C extra-filename=-ba699b69f7d3d497 --out-dir /home/build/Peroxide/target/debug/deps -L dependency=/home/build/Peroxide/target/debug/deps --extern proc_macro2=/home/build/Peroxide/target/debug/deps/libproc_macro2-77e7745ec252ffda.rlib --extern pyo3_derive_backend=/home/build/Peroxide/target/debug/deps/libpyo3_derive_backend-b991b3b02dabccfa.rlib --extern quote=/home/build/Peroxide/target/debug/deps/libquote-8137e0024bb018f3.rlib --extern syn=/home/build/Peroxide/target/debug/deps/libsyn-43f84dfe1dfe1b83.rlib --cap-lints allow`
   Compiling inventory v0.1.4
     Running `rustc --edition=2018 --crate-name inventory /home/build/.cargo/registry/src/github.com-1ecc6299db9ec823/inventory-0.1.4/src/lib.rs --error-format=json --json=diagnostic-rendered-ansi,artifacts --crate-type lib --emit=dep-info,metadata,link -C debuginfo=2 -C metadata=9c67ecc0157116b7 -C extra-filename=-9c67ecc0157116b7 --out-dir /home/build/Peroxide/target/debug/deps -L dependency=/home/build/Peroxide/target/debug/deps --extern ctor=/home/build/Peroxide/target/debug/deps/libctor-40ff998ae9570e1e.so --extern ghost=/home/build/Peroxide/target/debug/deps/libghost-5f0a777ee4650a2e.so --extern inventory_impl=/home/build/Peroxide/target/debug/deps/libinventory_impl-5f229761cd90a0ff.so --cap-lints allow`
     Running `/home/build/Peroxide/target/debug/build/pyo3-0ca1f1c3146eb469/build-script-build`
     Running `rustc --edition=2018 --crate-name pyo3 /home/build/.cargo/registry/src/github.com-1ecc6299db9ec823/pyo3-0.7.0/src/lib.rs --error-format=json --json=diagnostic-rendered-ansi,artifacts --crate-type lib --emit=dep-info,metadata,link -C debuginfo=2 --cfg 'feature="default"' -C metadata=16c8c6ef6697d71f -C extra-filename=-16c8c6ef6697d71f --out-dir /home/build/Peroxide/target/debug/deps -L dependency=/home/build/Peroxide/target/debug/deps --extern inventory=/home/build/Peroxide/target/debug/deps/libinventory-9c67ecc0157116b7.rmeta --extern libc=/home/build/Peroxide/target/debug/deps/liblibc-3ca60aaac7a7afe9.rmeta --extern mashup=/home/build/Peroxide/target/debug/deps/libmashup-074d8ce29d67fe1d.rmeta --extern num_traits=/home/build/Peroxide/target/debug/deps/libnum_traits-5023b607e4d8a39c.rmeta --extern pyo3cls=/home/build/Peroxide/target/debug/deps/libpyo3cls-ba699b69f7d3d497.so --extern spin=/home/build/Peroxide/target/debug/deps/libspin-354dcc7a4c8793f4.rmeta --cap-lints allow -L native=/usr/lib --cfg Py_3_5 --cfg Py_3_6 --cfg Py_3_7 --cfg Py_3 --cfg 'py_sys_config="WITH_THREAD"' -l python3.7m`
   Compiling peroxide v0.13.0 (/home/build/Peroxide)
     Running `rustc --crate-name peroxide src/lib.rs --color always --crate-type lib --emit=dep-info,metadata,link -C debuginfo=2 -C metadata=f20ac947b328ddcf -C extra-filename=-f20ac947b328ddcf --out-dir /home/build/Peroxide/target/debug/deps -C incremental=/home/build/Peroxide/target/debug/incremental -L dependency=/home/build/Peroxide/target/debug/deps --extern csv=/home/build/Peroxide/target/debug/deps/libcsv-6969047f78d86bfe.rmeta --extern pyo3=/home/build/Peroxide/target/debug/deps/libpyo3-16c8c6ef6697d71f.rmeta --extern rand=/home/build/Peroxide/target/debug/deps/librand-124378dd801f0a0c.rmeta --extern special=/home/build/Peroxide/target/debug/deps/libspecial-585ff5d6f6fa831a.rmeta -L native=/usr/lib`
warning: unused import: `std::fs::File`
 --> src/util/writer.rs:5:5
  |
5 | use std::fs::File;
  |     ^^^^^^^^^^^^^
  |
  = note: `#[warn(unused_imports)]` on by default

warning: unused import: `std::io::Write`
 --> src/util/writer.rs:6:5
  |
6 | use std::io::Write;
  |     ^^^^^^^^^^^^^^

warning: unused import: `std::process::exit`
 --> src/util/writer.rs:7:5
  |
7 | use std::process::exit;
  |     ^^^^^^^^^^^^^^^^^^

     Running `rustc --crate-name optimize src/bin/optimize.rs --color always --crate-type bin --emit=dep-info,link -C debuginfo=2 -C metadata=bfe3e69a3529800f -C extra-filename=-bfe3e69a3529800f --out-dir /home/build/Peroxide/target/debug/deps -C incremental=/home/build/Peroxide/target/debug/incremental -L dependency=/home/build/Peroxide/target/debug/deps --extern csv=/home/build/Peroxide/target/debug/deps/libcsv-6969047f78d86bfe.rlib --extern peroxide=/home/build/Peroxide/target/debug/deps/libperoxide-f20ac947b328ddcf.rlib --extern pyo3=/home/build/Peroxide/target/debug/deps/libpyo3-16c8c6ef6697d71f.rlib --extern rand=/home/build/Peroxide/target/debug/deps/librand-124378dd801f0a0c.rlib --extern special=/home/build/Peroxide/target/debug/deps/libspecial-585ff5d6f6fa831a.rlib -L native=/usr/lib`
     Running `rustc --crate-name norm src/bin/norm.rs --color always --crate-type bin --emit=dep-info,link -C debuginfo=2 -C metadata=fa964f7c3b505f0e -C extra-filename=-fa964f7c3b505f0e --out-dir /home/build/Peroxide/target/debug/deps -C incremental=/home/build/Peroxide/target/debug/incremental -L dependency=/home/build/Peroxide/target/debug/deps --extern csv=/home/build/Peroxide/target/debug/deps/libcsv-6969047f78d86bfe.rlib --extern peroxide=/home/build/Peroxide/target/debug/deps/libperoxide-f20ac947b328ddcf.rlib --extern pyo3=/home/build/Peroxide/target/debug/deps/libpyo3-16c8c6ef6697d71f.rlib --extern rand=/home/build/Peroxide/target/debug/deps/librand-124378dd801f0a0c.rlib --extern special=/home/build/Peroxide/target/debug/deps/libspecial-585ff5d6f6fa831a.rlib -L native=/usr/lib`
     Running `rustc --crate-name real_trait_test src/bin/real_trait_test.rs --color always --crate-type bin --emit=dep-info,link -C debuginfo=2 -C metadata=6e1fb371e5f4142d -C extra-filename=-6e1fb371e5f4142d --out-dir /home/build/Peroxide/target/debug/deps -C incremental=/home/build/Peroxide/target/debug/incremental -L dependency=/home/build/Peroxide/target/debug/deps --extern csv=/home/build/Peroxide/target/debug/deps/libcsv-6969047f78d86bfe.rlib --extern peroxide=/home/build/Peroxide/target/debug/deps/libperoxide-f20ac947b328ddcf.rlib --extern pyo3=/home/build/Peroxide/target/debug/deps/libpyo3-16c8c6ef6697d71f.rlib --extern rand=/home/build/Peroxide/target/debug/deps/librand-124378dd801f0a0c.rlib --extern special=/home/build/Peroxide/target/debug/deps/libspecial-585ff5d6f6fa831a.rlib -L native=/usr/lib`
     Running `rustc --crate-name spread src/bin/spread.rs --color always --crate-type bin --emit=dep-info,link -C debuginfo=2 -C metadata=b2003efbbc67aade -C extra-filename=-b2003efbbc67aade --out-dir /home/build/Peroxide/target/debug/deps -C incremental=/home/build/Peroxide/target/debug/incremental -L dependency=/home/build/Peroxide/target/debug/deps --extern csv=/home/build/Peroxide/target/debug/deps/libcsv-6969047f78d86bfe.rlib --extern peroxide=/home/build/Peroxide/target/debug/deps/libperoxide-f20ac947b328ddcf.rlib --extern pyo3=/home/build/Peroxide/target/debug/deps/libpyo3-16c8c6ef6697d71f.rlib --extern rand=/home/build/Peroxide/target/debug/deps/librand-124378dd801f0a0c.rlib --extern special=/home/build/Peroxide/target/debug/deps/libspecial-585ff5d6f6fa831a.rlib -L native=/usr/lib`
     Running `rustc --crate-name dual src/bin/dual.rs --color always --crate-type bin --emit=dep-info,link -C debuginfo=2 -C metadata=7e3eda37eac36fbc -C extra-filename=-7e3eda37eac36fbc --out-dir /home/build/Peroxide/target/debug/deps -C incremental=/home/build/Peroxide/target/debug/incremental -L dependency=/home/build/Peroxide/target/debug/deps --extern csv=/home/build/Peroxide/target/debug/deps/libcsv-6969047f78d86bfe.rlib --extern peroxide=/home/build/Peroxide/target/debug/deps/libperoxide-f20ac947b328ddcf.rlib --extern pyo3=/home/build/Peroxide/target/debug/deps/libpyo3-16c8c6ef6697d71f.rlib --extern rand=/home/build/Peroxide/target/debug/deps/librand-124378dd801f0a0c.rlib --extern special=/home/build/Peroxide/target/debug/deps/libspecial-585ff5d6f6fa831a.rlib -L native=/usr/lib`
     Running `rustc --crate-name matmul1 src/bin/matmul1.rs --color always --crate-type bin --emit=dep-info,link -C debuginfo=2 -C metadata=fb661afe6576343d -C extra-filename=-fb661afe6576343d --out-dir /home/build/Peroxide/target/debug/deps -C incremental=/home/build/Peroxide/target/debug/incremental -L dependency=/home/build/Peroxide/target/debug/deps --extern csv=/home/build/Peroxide/target/debug/deps/libcsv-6969047f78d86bfe.rlib --extern peroxide=/home/build/Peroxide/target/debug/deps/libperoxide-f20ac947b328ddcf.rlib --extern pyo3=/home/build/Peroxide/target/debug/deps/libpyo3-16c8c6ef6697d71f.rlib --extern rand=/home/build/Peroxide/target/debug/deps/librand-124378dd801f0a0c.rlib --extern special=/home/build/Peroxide/target/debug/deps/libspecial-585ff5d6f6fa831a.rlib -L native=/usr/lib`
     Running `rustc --crate-name ode_test_rk4 src/bin/ode_test_rk4.rs --color always --crate-type bin --emit=dep-info,link -C debuginfo=2 -C metadata=8d7dfda3883d0da7 -C extra-filename=-8d7dfda3883d0da7 --out-dir /home/build/Peroxide/target/debug/deps -C incremental=/home/build/Peroxide/target/debug/incremental -L dependency=/home/build/Peroxide/target/debug/deps --extern csv=/home/build/Peroxide/target/debug/deps/libcsv-6969047f78d86bfe.rlib --extern peroxide=/home/build/Peroxide/target/debug/deps/libperoxide-f20ac947b328ddcf.rlib --extern pyo3=/home/build/Peroxide/target/debug/deps/libpyo3-16c8c6ef6697d71f.rlib --extern rand=/home/build/Peroxide/target/debug/deps/librand-124378dd801f0a0c.rlib --extern special=/home/build/Peroxide/target/debug/deps/libspecial-585ff5d6f6fa831a.rlib -L native=/usr/lib`
warning: unused variable: `result`
  --> src/bin/ode_test_rk4.rs:15:9
   |
15 |     let result = ode_solver.integrate();
   |         ^^^^^^ help: consider prefixing with an underscore: `_result`

     Running `rustc --crate-name dist src/bin/dist.rs --color always --crate-type bin --emit=dep-info,link -C debuginfo=2 -C metadata=1ecf3b9856ba95ed -C extra-filename=-1ecf3b9856ba95ed --out-dir /home/build/Peroxide/target/debug/deps -C incremental=/home/build/Peroxide/target/debug/incremental -L dependency=/home/build/Peroxide/target/debug/deps --extern csv=/home/build/Peroxide/target/debug/deps/libcsv-6969047f78d86bfe.rlib --extern peroxide=/home/build/Peroxide/target/debug/deps/libperoxide-f20ac947b328ddcf.rlib --extern pyo3=/home/build/Peroxide/target/debug/deps/libpyo3-16c8c6ef6697d71f.rlib --extern rand=/home/build/Peroxide/target/debug/deps/librand-124378dd801f0a0c.rlib --extern special=/home/build/Peroxide/target/debug/deps/libspecial-585ff5d6f6fa831a.rlib -L native=/usr/lib`
     Running `rustc --crate-name lda_ls src/bin/lda_ls.rs --color always --crate-type bin --emit=dep-info,link -C debuginfo=2 -C metadata=9b38f143804a0300 -C extra-filename=-9b38f143804a0300 --out-dir /home/build/Peroxide/target/debug/deps -C incremental=/home/build/Peroxide/target/debug/incremental -L dependency=/home/build/Peroxide/target/debug/deps --extern csv=/home/build/Peroxide/target/debug/deps/libcsv-6969047f78d86bfe.rlib --extern peroxide=/home/build/Peroxide/target/debug/deps/libperoxide-f20ac947b328ddcf.rlib --extern pyo3=/home/build/Peroxide/target/debug/deps/libpyo3-16c8c6ef6697d71f.rlib --extern rand=/home/build/Peroxide/target/debug/deps/librand-124378dd801f0a0c.rlib --extern special=/home/build/Peroxide/target/debug/deps/libspecial-585ff5d6f6fa831a.rlib -L native=/usr/lib`
     Running `rustc --crate-name poly src/bin/poly.rs --color always --crate-type bin --emit=dep-info,link -C debuginfo=2 -C metadata=feda9a1e70741a73 -C extra-filename=-feda9a1e70741a73 --out-dir /home/build/Peroxide/target/debug/deps -C incremental=/home/build/Peroxide/target/debug/incremental -L dependency=/home/build/Peroxide/target/debug/deps --extern csv=/home/build/Peroxide/target/debug/deps/libcsv-6969047f78d86bfe.rlib --extern peroxide=/home/build/Peroxide/target/debug/deps/libperoxide-f20ac947b328ddcf.rlib --extern pyo3=/home/build/Peroxide/target/debug/deps/libpyo3-16c8c6ef6697d71f.rlib --extern rand=/home/build/Peroxide/target/debug/deps/librand-124378dd801f0a0c.rlib --extern special=/home/build/Peroxide/target/debug/deps/libspecial-585ff5d6f6fa831a.rlib -L native=/usr/lib`
     Running `rustc --crate-name lm2 src/bin/lm2.rs --color always --crate-type bin --emit=dep-info,link -C debuginfo=2 -C metadata=362a341dee6a44aa -C extra-filename=-362a341dee6a44aa --out-dir /home/build/Peroxide/target/debug/deps -C incremental=/home/build/Peroxide/target/debug/incremental -L dependency=/home/build/Peroxide/target/debug/deps --extern csv=/home/build/Peroxide/target/debug/deps/libcsv-6969047f78d86bfe.rlib --extern peroxide=/home/build/Peroxide/target/debug/deps/libperoxide-f20ac947b328ddcf.rlib --extern pyo3=/home/build/Peroxide/target/debug/deps/libpyo3-16c8c6ef6697d71f.rlib --extern rand=/home/build/Peroxide/target/debug/deps/librand-124378dd801f0a0c.rlib --extern special=/home/build/Peroxide/target/debug/deps/libspecial-585ff5d6f6fa831a.rlib -L native=/usr/lib`
     Running `rustc --crate-name lm_test src/bin/lm_test.rs --color always --crate-type bin --emit=dep-info,link -C debuginfo=2 -C metadata=efadbe3266a20928 -C extra-filename=-efadbe3266a20928 --out-dir /home/build/Peroxide/target/debug/deps -C incremental=/home/build/Peroxide/target/debug/incremental -L dependency=/home/build/Peroxide/target/debug/deps --extern csv=/home/build/Peroxide/target/debug/deps/libcsv-6969047f78d86bfe.rlib --extern peroxide=/home/build/Peroxide/target/debug/deps/libperoxide-f20ac947b328ddcf.rlib --extern pyo3=/home/build/Peroxide/target/debug/deps/libpyo3-16c8c6ef6697d71f.rlib --extern rand=/home/build/Peroxide/target/debug/deps/librand-124378dd801f0a0c.rlib --extern special=/home/build/Peroxide/target/debug/deps/libspecial-585ff5d6f6fa831a.rlib -L native=/usr/lib`
warning: unused `#[macro_use]` import
 --> src/bin/lm_test.rs:1:1
  |
1 | #[macro_use]
  | ^^^^^^^^^^^^
  |
  = note: `#[warn(unused_imports)]` on by default

     Running `rustc --crate-name hyper src/bin/hyper.rs --color always --crate-type bin --emit=dep-info,link -C debuginfo=2 -C metadata=60ae28a53df9aa47 -C extra-filename=-60ae28a53df9aa47 --out-dir /home/build/Peroxide/target/debug/deps -C incremental=/home/build/Peroxide/target/debug/incremental -L dependency=/home/build/Peroxide/target/debug/deps --extern csv=/home/build/Peroxide/target/debug/deps/libcsv-6969047f78d86bfe.rlib --extern peroxide=/home/build/Peroxide/target/debug/deps/libperoxide-f20ac947b328ddcf.rlib --extern pyo3=/home/build/Peroxide/target/debug/deps/libpyo3-16c8c6ef6697d71f.rlib --extern rand=/home/build/Peroxide/target/debug/deps/librand-124378dd801f0a0c.rlib --extern special=/home/build/Peroxide/target/debug/deps/libspecial-585ff5d6f6fa831a.rlib -L native=/usr/lib`
     Running `rustc --crate-name plot src/bin/plot.rs --color always --crate-type bin --emit=dep-info,link -C debuginfo=2 -C metadata=b9073a21992b7c45 -C extra-filename=-b9073a21992b7c45 --out-dir /home/build/Peroxide/target/debug/deps -C incremental=/home/build/Peroxide/target/debug/incremental -L dependency=/home/build/Peroxide/target/debug/deps --extern csv=/home/build/Peroxide/target/debug/deps/libcsv-6969047f78d86bfe.rlib --extern peroxide=/home/build/Peroxide/target/debug/deps/libperoxide-f20ac947b328ddcf.rlib --extern pyo3=/home/build/Peroxide/target/debug/deps/libpyo3-16c8c6ef6697d71f.rlib --extern rand=/home/build/Peroxide/target/debug/deps/librand-124378dd801f0a0c.rlib --extern special=/home/build/Peroxide/target/debug/deps/libspecial-585ff5d6f6fa831a.rlib -L native=/usr/lib`
     Running `rustc --crate-name ode_test_lorenz src/bin/ode_test_lorenz.rs --color always --crate-type bin --emit=dep-info,link -C debuginfo=2 -C metadata=329fce4d2eb3f7a7 -C extra-filename=-329fce4d2eb3f7a7 --out-dir /home/build/Peroxide/target/debug/deps -C incremental=/home/build/Peroxide/target/debug/incremental -L dependency=/home/build/Peroxide/target/debug/deps --extern csv=/home/build/Peroxide/target/debug/deps/libcsv-6969047f78d86bfe.rlib --extern peroxide=/home/build/Peroxide/target/debug/deps/libperoxide-f20ac947b328ddcf.rlib --extern pyo3=/home/build/Peroxide/target/debug/deps/libpyo3-16c8c6ef6697d71f.rlib --extern rand=/home/build/Peroxide/target/debug/deps/librand-124378dd801f0a0c.rlib --extern special=/home/build/Peroxide/target/debug/deps/libspecial-585ff5d6f6fa831a.rlib -L native=/usr/lib`
warning: unused variable: `results`
  --> src/bin/ode_test_lorenz.rs:16:9
   |
16 |     let results = ex_test.integrate();
   |         ^^^^^^^ help: consider prefixing with an underscore: `_results`
   |
   = note: `#[warn(unused_variables)]` on by default

warning: unused variable: `results2`
  --> src/bin/ode_test_lorenz.rs:20:9
   |
20 |     let results2 = ex_test2.integrate();
   |         ^^^^^^^^ help: consider prefixing with an underscore: `_results2`

     Running `rustc --crate-name matmul2 src/bin/matmul2.rs --color always --crate-type bin --emit=dep-info,link -C debuginfo=2 -C metadata=c4227d948ecc0bac -C extra-filename=-c4227d948ecc0bac --out-dir /home/build/Peroxide/target/debug/deps -C incremental=/home/build/Peroxide/target/debug/incremental -L dependency=/home/build/Peroxide/target/debug/deps --extern csv=/home/build/Peroxide/target/debug/deps/libcsv-6969047f78d86bfe.rlib --extern peroxide=/home/build/Peroxide/target/debug/deps/libperoxide-f20ac947b328ddcf.rlib --extern pyo3=/home/build/Peroxide/target/debug/deps/libpyo3-16c8c6ef6697d71f.rlib --extern rand=/home/build/Peroxide/target/debug/deps/librand-124378dd801f0a0c.rlib --extern special=/home/build/Peroxide/target/debug/deps/libspecial-585ff5d6f6fa831a.rlib -L native=/usr/lib`
     Running `rustc --crate-name mlp src/bin/mlp.rs --color always --crate-type bin --emit=dep-info,link -C debuginfo=2 -C metadata=1afd6004ce7472e2 -C extra-filename=-1afd6004ce7472e2 --out-dir /home/build/Peroxide/target/debug/deps -C incremental=/home/build/Peroxide/target/debug/incremental -L dependency=/home/build/Peroxide/target/debug/deps --extern csv=/home/build/Peroxide/target/debug/deps/libcsv-6969047f78d86bfe.rlib --extern peroxide=/home/build/Peroxide/target/debug/deps/libperoxide-f20ac947b328ddcf.rlib --extern pyo3=/home/build/Peroxide/target/debug/deps/libpyo3-16c8c6ef6697d71f.rlib --extern rand=/home/build/Peroxide/target/debug/deps/librand-124378dd801f0a0c.rlib --extern special=/home/build/Peroxide/target/debug/deps/libspecial-585ff5d6f6fa831a.rlib -L native=/usr/lib`
     Running `rustc --crate-name thomas src/bin/thomas.rs --color always --crate-type bin --emit=dep-info,link -C debuginfo=2 -C metadata=d29fb189dc2bb2a6 -C extra-filename=-d29fb189dc2bb2a6 --out-dir /home/build/Peroxide/target/debug/deps -C incremental=/home/build/Peroxide/target/debug/incremental -L dependency=/home/build/Peroxide/target/debug/deps --extern csv=/home/build/Peroxide/target/debug/deps/libcsv-6969047f78d86bfe.rlib --extern peroxide=/home/build/Peroxide/target/debug/deps/libperoxide-f20ac947b328ddcf.rlib --extern pyo3=/home/build/Peroxide/target/debug/deps/libpyo3-16c8c6ef6697d71f.rlib --extern rand=/home/build/Peroxide/target/debug/deps/librand-124378dd801f0a0c.rlib --extern special=/home/build/Peroxide/target/debug/deps/libspecial-585ff5d6f6fa831a.rlib -L native=/usr/lib`
     Running `rustc --crate-name jacobian src/bin/jacobian.rs --color always --crate-type bin --emit=dep-info,link -C debuginfo=2 -C metadata=1de5cdc1d176391e -C extra-filename=-1de5cdc1d176391e --out-dir /home/build/Peroxide/target/debug/deps -C incremental=/home/build/Peroxide/target/debug/incremental -L dependency=/home/build/Peroxide/target/debug/deps --extern csv=/home/build/Peroxide/target/debug/deps/libcsv-6969047f78d86bfe.rlib --extern peroxide=/home/build/Peroxide/target/debug/deps/libperoxide-f20ac947b328ddcf.rlib --extern pyo3=/home/build/Peroxide/target/debug/deps/libpyo3-16c8c6ef6697d71f.rlib --extern rand=/home/build/Peroxide/target/debug/deps/librand-124378dd801f0a0c.rlib --extern special=/home/build/Peroxide/target/debug/deps/libspecial-585ff5d6f6fa831a.rlib -L native=/usr/lib`
     Running `rustc --crate-name lu src/bin/lu.rs --color always --crate-type bin --emit=dep-info,link -C debuginfo=2 -C metadata=ff924372c1816fec -C extra-filename=-ff924372c1816fec --out-dir /home/build/Peroxide/target/debug/deps -C incremental=/home/build/Peroxide/target/debug/incremental -L dependency=/home/build/Peroxide/target/debug/deps --extern csv=/home/build/Peroxide/target/debug/deps/libcsv-6969047f78d86bfe.rlib --extern peroxide=/home/build/Peroxide/target/debug/deps/libperoxide-f20ac947b328ddcf.rlib --extern pyo3=/home/build/Peroxide/target/debug/deps/libpyo3-16c8c6ef6697d71f.rlib --extern rand=/home/build/Peroxide/target/debug/deps/librand-124378dd801f0a0c.rlib --extern special=/home/build/Peroxide/target/debug/deps/libspecial-585ff5d6f6fa831a.rlib -L native=/usr/lib`
warning: unused variable: `pqlu`
 --> src/bin/lu.rs:6:9
  |
6 |     let pqlu = a.lu().unwrap();
  |         ^^^^ help: consider prefixing with an underscore: `_pqlu`
  |
  = note: `#[warn(unused_variables)]` on by default

     Running `rustc --crate-name lm src/bin/lm.rs --color always --crate-type bin --emit=dep-info,link -C debuginfo=2 -C metadata=aaf3b767b2496b36 -C extra-filename=-aaf3b767b2496b36 --out-dir /home/build/Peroxide/target/debug/deps -C incremental=/home/build/Peroxide/target/debug/incremental -L dependency=/home/build/Peroxide/target/debug/deps --extern csv=/home/build/Peroxide/target/debug/deps/libcsv-6969047f78d86bfe.rlib --extern peroxide=/home/build/Peroxide/target/debug/deps/libperoxide-f20ac947b328ddcf.rlib --extern pyo3=/home/build/Peroxide/target/debug/deps/libpyo3-16c8c6ef6697d71f.rlib --extern rand=/home/build/Peroxide/target/debug/deps/librand-124378dd801f0a0c.rlib --extern special=/home/build/Peroxide/target/debug/deps/libspecial-585ff5d6f6fa831a.rlib -L native=/usr/lib`
warning: unused `#[macro_use]` import
 --> src/bin/lm.rs:1:1
  |
1 | #[macro_use]
  | ^^^^^^^^^^^^
  |
  = note: `#[warn(unused_imports)]` on by default

     Running `rustc --crate-name matmul3 src/bin/matmul3.rs --color always --crate-type bin --emit=dep-info,link -C debuginfo=2 -C metadata=1b6935d0469fb234 -C extra-filename=-1b6935d0469fb234 --out-dir /home/build/Peroxide/target/debug/deps -C incremental=/home/build/Peroxide/target/debug/incremental -L dependency=/home/build/Peroxide/target/debug/deps --extern csv=/home/build/Peroxide/target/debug/deps/libcsv-6969047f78d86bfe.rlib --extern peroxide=/home/build/Peroxide/target/debug/deps/libperoxide-f20ac947b328ddcf.rlib --extern pyo3=/home/build/Peroxide/target/debug/deps/libpyo3-16c8c6ef6697d71f.rlib --extern rand=/home/build/Peroxide/target/debug/deps/librand-124378dd801f0a0c.rlib --extern special=/home/build/Peroxide/target/debug/deps/libspecial-585ff5d6f6fa831a.rlib -L native=/usr/lib`
     Running `rustc --crate-name read_csv src/bin/read_csv.rs --color always --crate-type bin --emit=dep-info,link -C debuginfo=2 -C metadata=c7fbf02b65156d8f -C extra-filename=-c7fbf02b65156d8f --out-dir /home/build/Peroxide/target/debug/deps -C incremental=/home/build/Peroxide/target/debug/incremental -L dependency=/home/build/Peroxide/target/debug/deps --extern csv=/home/build/Peroxide/target/debug/deps/libcsv-6969047f78d86bfe.rlib --extern peroxide=/home/build/Peroxide/target/debug/deps/libperoxide-f20ac947b328ddcf.rlib --extern pyo3=/home/build/Peroxide/target/debug/deps/libpyo3-16c8c6ef6697d71f.rlib --extern rand=/home/build/Peroxide/target/debug/deps/librand-124378dd801f0a0c.rlib --extern special=/home/build/Peroxide/target/debug/deps/libspecial-585ff5d6f6fa831a.rlib -L native=/usr/lib`
    Finished dev [unoptimized + debuginfo] target(s) in 2m 23s
+ cargo test --verbose
       Fresh unicode-xid v0.2.0
       Fresh unicode-xid v0.1.0
       Fresh lazy_static v1.3.0
       Fresh cfg-if v0.1.9
       Fresh autocfg v0.1.6
       Fresh regex-syntax v0.6.11
       Fresh proc-macro-hack-impl v0.4.2
       Fresh version_check v0.1.5
       Fresh ppv-lite86 v0.2.5
       Fresh spin v0.5.1
       Fresh itoa v0.4.4
       Fresh thread_local v0.3.6
       Fresh proc-macro-hack v0.4.2
       Fresh c2-chacha v0.2.2
       Fresh libc v0.2.62
       Fresh proc-macro2 v1.0.1
       Fresh proc-macro2 v0.4.30
       Fresh byteorder v1.3.2
       Fresh serde v1.0.99
       Fresh ryu v1.0.0
       Fresh memchr v2.2.1
       Fresh getrandom v0.1.10
       Fresh special v0.8.1
       Fresh quote v1.0.2
       Fresh quote v0.6.13
       Fresh mashup-impl v0.1.9
       Fresh regex-automata v0.1.8
       Fresh num-traits v0.2.8
       Fresh aho-corasick v0.7.6
       Fresh csv-core v0.1.6
       Fresh rand_core v0.5.0
       Fresh syn v1.0.3
       Fresh syn v0.15.44
       Fresh mashup v0.1.9
       Fresh bstr v0.2.7
       Fresh regex v1.2.1
       Fresh rand_chacha v0.2.1
       Fresh inventory-impl v0.1.4
       Fresh ctor v0.1.10
       Fresh ghost v0.1.1
       Fresh pyo3-derive-backend v0.7.0
       Fresh csv v1.1.1
       Fresh rand v0.7.0
       Fresh inventory v0.1.4
       Fresh pyo3cls v0.7.0
       Fresh pyo3 v0.7.0
   Compiling peroxide v0.13.0 (/home/build/Peroxide)
     Running `rustc --crate-name peroxide src/lib.rs --color always --emit=dep-info,link -C debuginfo=2 --test -C metadata=cb968bff56724ef0 -C extra-filename=-cb968bff56724ef0 --out-dir /home/build/Peroxide/target/debug/deps -C incremental=/home/build/Peroxide/target/debug/incremental -L dependency=/home/build/Peroxide/target/debug/deps --extern csv=/home/build/Peroxide/target/debug/deps/libcsv-6969047f78d86bfe.rlib --extern pyo3=/home/build/Peroxide/target/debug/deps/libpyo3-16c8c6ef6697d71f.rlib --extern rand=/home/build/Peroxide/target/debug/deps/librand-124378dd801f0a0c.rlib --extern special=/home/build/Peroxide/target/debug/deps/libspecial-585ff5d6f6fa831a.rlib -L native=/usr/lib`
warning: unused import: `std::fs::File`
 --> src/util/writer.rs:5:5
  |
5 | use std::fs::File;
  |     ^^^^^^^^^^^^^
  |
  = note: `#[warn(unused_imports)]` on by default

warning: unused import: `std::io::Write`
 --> src/util/writer.rs:6:5
  |
6 | use std::io::Write;
  |     ^^^^^^^^^^^^^^

warning: unused import: `std::process::exit`
 --> src/util/writer.rs:7:5
  |
7 | use std::process::exit;
  |     ^^^^^^^^^^^^^^^^^^

     Running `rustc --crate-name spread src/bin/spread.rs --color always --emit=dep-info,link -C debuginfo=2 --test -C metadata=b4c81135750dbdcb -C extra-filename=-b4c81135750dbdcb --out-dir /home/build/Peroxide/target/debug/deps -C incremental=/home/build/Peroxide/target/debug/incremental -L dependency=/home/build/Peroxide/target/debug/deps --extern csv=/home/build/Peroxide/target/debug/deps/libcsv-6969047f78d86bfe.rlib --extern peroxide=/home/build/Peroxide/target/debug/deps/libperoxide-f20ac947b328ddcf.rlib --extern pyo3=/home/build/Peroxide/target/debug/deps/libpyo3-16c8c6ef6697d71f.rlib --extern rand=/home/build/Peroxide/target/debug/deps/librand-124378dd801f0a0c.rlib --extern special=/home/build/Peroxide/target/debug/deps/libspecial-585ff5d6f6fa831a.rlib -L native=/usr/lib`
     Running `rustc --crate-name optimize src/bin/optimize.rs --color always --emit=dep-info,link -C debuginfo=2 --test -C metadata=2f41770a78e7813c -C extra-filename=-2f41770a78e7813c --out-dir /home/build/Peroxide/target/debug/deps -C incremental=/home/build/Peroxide/target/debug/incremental -L dependency=/home/build/Peroxide/target/debug/deps --extern csv=/home/build/Peroxide/target/debug/deps/libcsv-6969047f78d86bfe.rlib --extern peroxide=/home/build/Peroxide/target/debug/deps/libperoxide-f20ac947b328ddcf.rlib --extern pyo3=/home/build/Peroxide/target/debug/deps/libpyo3-16c8c6ef6697d71f.rlib --extern rand=/home/build/Peroxide/target/debug/deps/librand-124378dd801f0a0c.rlib --extern special=/home/build/Peroxide/target/debug/deps/libspecial-585ff5d6f6fa831a.rlib -L native=/usr/lib`
     Running `rustc --crate-name lm_test src/bin/lm_test.rs --color always --emit=dep-info,link -C debuginfo=2 --test -C metadata=91fdaff9b48d4d5f -C extra-filename=-91fdaff9b48d4d5f --out-dir /home/build/Peroxide/target/debug/deps -C incremental=/home/build/Peroxide/target/debug/incremental -L dependency=/home/build/Peroxide/target/debug/deps --extern csv=/home/build/Peroxide/target/debug/deps/libcsv-6969047f78d86bfe.rlib --extern peroxide=/home/build/Peroxide/target/debug/deps/libperoxide-f20ac947b328ddcf.rlib --extern pyo3=/home/build/Peroxide/target/debug/deps/libpyo3-16c8c6ef6697d71f.rlib --extern rand=/home/build/Peroxide/target/debug/deps/librand-124378dd801f0a0c.rlib --extern special=/home/build/Peroxide/target/debug/deps/libspecial-585ff5d6f6fa831a.rlib -L native=/usr/lib`
warning: unused `#[macro_use]` import
 --> src/bin/lm_test.rs:1:1
  |
1 | #[macro_use]
  | ^^^^^^^^^^^^
  |
  = note: `#[warn(unused_imports)]` on by default

     Running `rustc --crate-name mlp src/bin/mlp.rs --color always --emit=dep-info,link -C debuginfo=2 --test -C metadata=8b5c2b05914ebde2 -C extra-filename=-8b5c2b05914ebde2 --out-dir /home/build/Peroxide/target/debug/deps -C incremental=/home/build/Peroxide/target/debug/incremental -L dependency=/home/build/Peroxide/target/debug/deps --extern csv=/home/build/Peroxide/target/debug/deps/libcsv-6969047f78d86bfe.rlib --extern peroxide=/home/build/Peroxide/target/debug/deps/libperoxide-f20ac947b328ddcf.rlib --extern pyo3=/home/build/Peroxide/target/debug/deps/libpyo3-16c8c6ef6697d71f.rlib --extern rand=/home/build/Peroxide/target/debug/deps/librand-124378dd801f0a0c.rlib --extern special=/home/build/Peroxide/target/debug/deps/libspecial-585ff5d6f6fa831a.rlib -L native=/usr/lib`
     Running `rustc --crate-name matmul1 src/bin/matmul1.rs --color always --emit=dep-info,link -C debuginfo=2 --test -C metadata=8faf44b729658b3f -C extra-filename=-8faf44b729658b3f --out-dir /home/build/Peroxide/target/debug/deps -C incremental=/home/build/Peroxide/target/debug/incremental -L dependency=/home/build/Peroxide/target/debug/deps --extern csv=/home/build/Peroxide/target/debug/deps/libcsv-6969047f78d86bfe.rlib --extern peroxide=/home/build/Peroxide/target/debug/deps/libperoxide-f20ac947b328ddcf.rlib --extern pyo3=/home/build/Peroxide/target/debug/deps/libpyo3-16c8c6ef6697d71f.rlib --extern rand=/home/build/Peroxide/target/debug/deps/librand-124378dd801f0a0c.rlib --extern special=/home/build/Peroxide/target/debug/deps/libspecial-585ff5d6f6fa831a.rlib -L native=/usr/lib`
     Running `rustc --crate-name plot src/bin/plot.rs --color always --emit=dep-info,link -C debuginfo=2 --test -C metadata=d8873b486ceaf410 -C extra-filename=-d8873b486ceaf410 --out-dir /home/build/Peroxide/target/debug/deps -C incremental=/home/build/Peroxide/target/debug/incremental -L dependency=/home/build/Peroxide/target/debug/deps --extern csv=/home/build/Peroxide/target/debug/deps/libcsv-6969047f78d86bfe.rlib --extern peroxide=/home/build/Peroxide/target/debug/deps/libperoxide-f20ac947b328ddcf.rlib --extern pyo3=/home/build/Peroxide/target/debug/deps/libpyo3-16c8c6ef6697d71f.rlib --extern rand=/home/build/Peroxide/target/debug/deps/librand-124378dd801f0a0c.rlib --extern special=/home/build/Peroxide/target/debug/deps/libspecial-585ff5d6f6fa831a.rlib -L native=/usr/lib`
     Running `rustc --crate-name real_trait_test src/bin/real_trait_test.rs --color always --emit=dep-info,link -C debuginfo=2 --test -C metadata=c3be2aeac9770519 -C extra-filename=-c3be2aeac9770519 --out-dir /home/build/Peroxide/target/debug/deps -C incremental=/home/build/Peroxide/target/debug/incremental -L dependency=/home/build/Peroxide/target/debug/deps --extern csv=/home/build/Peroxide/target/debug/deps/libcsv-6969047f78d86bfe.rlib --extern peroxide=/home/build/Peroxide/target/debug/deps/libperoxide-f20ac947b328ddcf.rlib --extern pyo3=/home/build/Peroxide/target/debug/deps/libpyo3-16c8c6ef6697d71f.rlib --extern rand=/home/build/Peroxide/target/debug/deps/librand-124378dd801f0a0c.rlib --extern special=/home/build/Peroxide/target/debug/deps/libspecial-585ff5d6f6fa831a.rlib -L native=/usr/lib`
     Running `rustc --crate-name matmul3 src/bin/matmul3.rs --color always --emit=dep-info,link -C debuginfo=2 --test -C metadata=cb1d75555635dd0c -C extra-filename=-cb1d75555635dd0c --out-dir /home/build/Peroxide/target/debug/deps -C incremental=/home/build/Peroxide/target/debug/incremental -L dependency=/home/build/Peroxide/target/debug/deps --extern csv=/home/build/Peroxide/target/debug/deps/libcsv-6969047f78d86bfe.rlib --extern peroxide=/home/build/Peroxide/target/debug/deps/libperoxide-f20ac947b328ddcf.rlib --extern pyo3=/home/build/Peroxide/target/debug/deps/libpyo3-16c8c6ef6697d71f.rlib --extern rand=/home/build/Peroxide/target/debug/deps/librand-124378dd801f0a0c.rlib --extern special=/home/build/Peroxide/target/debug/deps/libspecial-585ff5d6f6fa831a.rlib -L native=/usr/lib`
     Running `rustc --crate-name ode_test_lorenz src/bin/ode_test_lorenz.rs --color always --emit=dep-info,link -C debuginfo=2 --test -C metadata=0cb16f24eae0c06c -C extra-filename=-0cb16f24eae0c06c --out-dir /home/build/Peroxide/target/debug/deps -C incremental=/home/build/Peroxide/target/debug/incremental -L dependency=/home/build/Peroxide/target/debug/deps --extern csv=/home/build/Peroxide/target/debug/deps/libcsv-6969047f78d86bfe.rlib --extern peroxide=/home/build/Peroxide/target/debug/deps/libperoxide-f20ac947b328ddcf.rlib --extern pyo3=/home/build/Peroxide/target/debug/deps/libpyo3-16c8c6ef6697d71f.rlib --extern rand=/home/build/Peroxide/target/debug/deps/librand-124378dd801f0a0c.rlib --extern special=/home/build/Peroxide/target/debug/deps/libspecial-585ff5d6f6fa831a.rlib -L native=/usr/lib`
warning: unused variable: `results`
  --> src/bin/ode_test_lorenz.rs:16:9
   |
16 |     let results = ex_test.integrate();
   |         ^^^^^^^ help: consider prefixing with an underscore: `_results`
   |
   = note: `#[warn(unused_variables)]` on by default

warning: unused variable: `results2`
  --> src/bin/ode_test_lorenz.rs:20:9
   |
20 |     let results2 = ex_test2.integrate();
   |         ^^^^^^^^ help: consider prefixing with an underscore: `_results2`

     Running `rustc --crate-name lda_ls src/bin/lda_ls.rs --color always --emit=dep-info,link -C debuginfo=2 --test -C metadata=c89fdec8eb833ae3 -C extra-filename=-c89fdec8eb833ae3 --out-dir /home/build/Peroxide/target/debug/deps -C incremental=/home/build/Peroxide/target/debug/incremental -L dependency=/home/build/Peroxide/target/debug/deps --extern csv=/home/build/Peroxide/target/debug/deps/libcsv-6969047f78d86bfe.rlib --extern peroxide=/home/build/Peroxide/target/debug/deps/libperoxide-f20ac947b328ddcf.rlib --extern pyo3=/home/build/Peroxide/target/debug/deps/libpyo3-16c8c6ef6697d71f.rlib --extern rand=/home/build/Peroxide/target/debug/deps/librand-124378dd801f0a0c.rlib --extern special=/home/build/Peroxide/target/debug/deps/libspecial-585ff5d6f6fa831a.rlib -L native=/usr/lib`
     Running `rustc --crate-name norm src/bin/norm.rs --color always --emit=dep-info,link -C debuginfo=2 --test -C metadata=a5a793630735403c -C extra-filename=-a5a793630735403c --out-dir /home/build/Peroxide/target/debug/deps -C incremental=/home/build/Peroxide/target/debug/incremental -L dependency=/home/build/Peroxide/target/debug/deps --extern csv=/home/build/Peroxide/target/debug/deps/libcsv-6969047f78d86bfe.rlib --extern peroxide=/home/build/Peroxide/target/debug/deps/libperoxide-f20ac947b328ddcf.rlib --extern pyo3=/home/build/Peroxide/target/debug/deps/libpyo3-16c8c6ef6697d71f.rlib --extern rand=/home/build/Peroxide/target/debug/deps/librand-124378dd801f0a0c.rlib --extern special=/home/build/Peroxide/target/debug/deps/libspecial-585ff5d6f6fa831a.rlib -L native=/usr/lib`
     Running `rustc --crate-name dist src/bin/dist.rs --color always --emit=dep-info,link -C debuginfo=2 --test -C metadata=014bc7fcfa2cb8f6 -C extra-filename=-014bc7fcfa2cb8f6 --out-dir /home/build/Peroxide/target/debug/deps -C incremental=/home/build/Peroxide/target/debug/incremental -L dependency=/home/build/Peroxide/target/debug/deps --extern csv=/home/build/Peroxide/target/debug/deps/libcsv-6969047f78d86bfe.rlib --extern peroxide=/home/build/Peroxide/target/debug/deps/libperoxide-f20ac947b328ddcf.rlib --extern pyo3=/home/build/Peroxide/target/debug/deps/libpyo3-16c8c6ef6697d71f.rlib --extern rand=/home/build/Peroxide/target/debug/deps/librand-124378dd801f0a0c.rlib --extern special=/home/build/Peroxide/target/debug/deps/libspecial-585ff5d6f6fa831a.rlib -L native=/usr/lib`
     Running `rustc --crate-name hyper src/bin/hyper.rs --color always --emit=dep-info,link -C debuginfo=2 --test -C metadata=d794c659c537fcbc -C extra-filename=-d794c659c537fcbc --out-dir /home/build/Peroxide/target/debug/deps -C incremental=/home/build/Peroxide/target/debug/incremental -L dependency=/home/build/Peroxide/target/debug/deps --extern csv=/home/build/Peroxide/target/debug/deps/libcsv-6969047f78d86bfe.rlib --extern peroxide=/home/build/Peroxide/target/debug/deps/libperoxide-f20ac947b328ddcf.rlib --extern pyo3=/home/build/Peroxide/target/debug/deps/libpyo3-16c8c6ef6697d71f.rlib --extern rand=/home/build/Peroxide/target/debug/deps/librand-124378dd801f0a0c.rlib --extern special=/home/build/Peroxide/target/debug/deps/libspecial-585ff5d6f6fa831a.rlib -L native=/usr/lib`
     Running `rustc --crate-name thomas src/bin/thomas.rs --color always --emit=dep-info,link -C debuginfo=2 --test -C metadata=57ca1831d915b701 -C extra-filename=-57ca1831d915b701 --out-dir /home/build/Peroxide/target/debug/deps -C incremental=/home/build/Peroxide/target/debug/incremental -L dependency=/home/build/Peroxide/target/debug/deps --extern csv=/home/build/Peroxide/target/debug/deps/libcsv-6969047f78d86bfe.rlib --extern peroxide=/home/build/Peroxide/target/debug/deps/libperoxide-f20ac947b328ddcf.rlib --extern pyo3=/home/build/Peroxide/target/debug/deps/libpyo3-16c8c6ef6697d71f.rlib --extern rand=/home/build/Peroxide/target/debug/deps/librand-124378dd801f0a0c.rlib --extern special=/home/build/Peroxide/target/debug/deps/libspecial-585ff5d6f6fa831a.rlib -L native=/usr/lib`
     Running `rustc --crate-name read_csv src/bin/read_csv.rs --color always --emit=dep-info,link -C debuginfo=2 --test -C metadata=1078573a2c9a5efc -C extra-filename=-1078573a2c9a5efc --out-dir /home/build/Peroxide/target/debug/deps -C incremental=/home/build/Peroxide/target/debug/incremental -L dependency=/home/build/Peroxide/target/debug/deps --extern csv=/home/build/Peroxide/target/debug/deps/libcsv-6969047f78d86bfe.rlib --extern peroxide=/home/build/Peroxide/target/debug/deps/libperoxide-f20ac947b328ddcf.rlib --extern pyo3=/home/build/Peroxide/target/debug/deps/libpyo3-16c8c6ef6697d71f.rlib --extern rand=/home/build/Peroxide/target/debug/deps/librand-124378dd801f0a0c.rlib --extern special=/home/build/Peroxide/target/debug/deps/libspecial-585ff5d6f6fa831a.rlib -L native=/usr/lib`
     Running `rustc --crate-name ode_test_rk4 src/bin/ode_test_rk4.rs --color always --emit=dep-info,link -C debuginfo=2 --test -C metadata=04b65788d141b145 -C extra-filename=-04b65788d141b145 --out-dir /home/build/Peroxide/target/debug/deps -C incremental=/home/build/Peroxide/target/debug/incremental -L dependency=/home/build/Peroxide/target/debug/deps --extern csv=/home/build/Peroxide/target/debug/deps/libcsv-6969047f78d86bfe.rlib --extern peroxide=/home/build/Peroxide/target/debug/deps/libperoxide-f20ac947b328ddcf.rlib --extern pyo3=/home/build/Peroxide/target/debug/deps/libpyo3-16c8c6ef6697d71f.rlib --extern rand=/home/build/Peroxide/target/debug/deps/librand-124378dd801f0a0c.rlib --extern special=/home/build/Peroxide/target/debug/deps/libspecial-585ff5d6f6fa831a.rlib -L native=/usr/lib`
warning: unused variable: `result`
  --> src/bin/ode_test_rk4.rs:15:9
   |
15 |     let result = ode_solver.integrate();
   |         ^^^^^^ help: consider prefixing with an underscore: `_result`

     Running `rustc --crate-name jacobian src/bin/jacobian.rs --color always --emit=dep-info,link -C debuginfo=2 --test -C metadata=e6275f9bacdddcf5 -C extra-filename=-e6275f9bacdddcf5 --out-dir /home/build/Peroxide/target/debug/deps -C incremental=/home/build/Peroxide/target/debug/incremental -L dependency=/home/build/Peroxide/target/debug/deps --extern csv=/home/build/Peroxide/target/debug/deps/libcsv-6969047f78d86bfe.rlib --extern peroxide=/home/build/Peroxide/target/debug/deps/libperoxide-f20ac947b328ddcf.rlib --extern pyo3=/home/build/Peroxide/target/debug/deps/libpyo3-16c8c6ef6697d71f.rlib --extern rand=/home/build/Peroxide/target/debug/deps/librand-124378dd801f0a0c.rlib --extern special=/home/build/Peroxide/target/debug/deps/libspecial-585ff5d6f6fa831a.rlib -L native=/usr/lib`
     Running `rustc --crate-name lm2 src/bin/lm2.rs --color always --emit=dep-info,link -C debuginfo=2 --test -C metadata=f6c871b1118783ce -C extra-filename=-f6c871b1118783ce --out-dir /home/build/Peroxide/target/debug/deps -C incremental=/home/build/Peroxide/target/debug/incremental -L dependency=/home/build/Peroxide/target/debug/deps --extern csv=/home/build/Peroxide/target/debug/deps/libcsv-6969047f78d86bfe.rlib --extern peroxide=/home/build/Peroxide/target/debug/deps/libperoxide-f20ac947b328ddcf.rlib --extern pyo3=/home/build/Peroxide/target/debug/deps/libpyo3-16c8c6ef6697d71f.rlib --extern rand=/home/build/Peroxide/target/debug/deps/librand-124378dd801f0a0c.rlib --extern special=/home/build/Peroxide/target/debug/deps/libspecial-585ff5d6f6fa831a.rlib -L native=/usr/lib`
     Running `rustc --crate-name lm src/bin/lm.rs --color always --emit=dep-info,link -C debuginfo=2 --test -C metadata=702642ed8f0bc880 -C extra-filename=-702642ed8f0bc880 --out-dir /home/build/Peroxide/target/debug/deps -C incremental=/home/build/Peroxide/target/debug/incremental -L dependency=/home/build/Peroxide/target/debug/deps --extern csv=/home/build/Peroxide/target/debug/deps/libcsv-6969047f78d86bfe.rlib --extern peroxide=/home/build/Peroxide/target/debug/deps/libperoxide-f20ac947b328ddcf.rlib --extern pyo3=/home/build/Peroxide/target/debug/deps/libpyo3-16c8c6ef6697d71f.rlib --extern rand=/home/build/Peroxide/target/debug/deps/librand-124378dd801f0a0c.rlib --extern special=/home/build/Peroxide/target/debug/deps/libspecial-585ff5d6f6fa831a.rlib -L native=/usr/lib`
warning: unused `#[macro_use]` import
 --> src/bin/lm.rs:1:1
  |
1 | #[macro_use]
  | ^^^^^^^^^^^^
  |
  = note: `#[warn(unused_imports)]` on by default

     Running `rustc --crate-name poly src/bin/poly.rs --color always --emit=dep-info,link -C debuginfo=2 --test -C metadata=8a71f90a8260db6e -C extra-filename=-8a71f90a8260db6e --out-dir /home/build/Peroxide/target/debug/deps -C incremental=/home/build/Peroxide/target/debug/incremental -L dependency=/home/build/Peroxide/target/debug/deps --extern csv=/home/build/Peroxide/target/debug/deps/libcsv-6969047f78d86bfe.rlib --extern peroxide=/home/build/Peroxide/target/debug/deps/libperoxide-f20ac947b328ddcf.rlib --extern pyo3=/home/build/Peroxide/target/debug/deps/libpyo3-16c8c6ef6697d71f.rlib --extern rand=/home/build/Peroxide/target/debug/deps/librand-124378dd801f0a0c.rlib --extern special=/home/build/Peroxide/target/debug/deps/libspecial-585ff5d6f6fa831a.rlib -L native=/usr/lib`
     Running `rustc --crate-name matmul2 src/bin/matmul2.rs --color always --emit=dep-info,link -C debuginfo=2 --test -C metadata=60a8e0ecfc5c4303 -C extra-filename=-60a8e0ecfc5c4303 --out-dir /home/build/Peroxide/target/debug/deps -C incremental=/home/build/Peroxide/target/debug/incremental -L dependency=/home/build/Peroxide/target/debug/deps --extern csv=/home/build/Peroxide/target/debug/deps/libcsv-6969047f78d86bfe.rlib --extern peroxide=/home/build/Peroxide/target/debug/deps/libperoxide-f20ac947b328ddcf.rlib --extern pyo3=/home/build/Peroxide/target/debug/deps/libpyo3-16c8c6ef6697d71f.rlib --extern rand=/home/build/Peroxide/target/debug/deps/librand-124378dd801f0a0c.rlib --extern special=/home/build/Peroxide/target/debug/deps/libspecial-585ff5d6f6fa831a.rlib -L native=/usr/lib`
     Running `rustc --crate-name dual src/bin/dual.rs --color always --emit=dep-info,link -C debuginfo=2 --test -C metadata=0a2b9b76c8e283aa -C extra-filename=-0a2b9b76c8e283aa --out-dir /home/build/Peroxide/target/debug/deps -C incremental=/home/build/Peroxide/target/debug/incremental -L dependency=/home/build/Peroxide/target/debug/deps --extern csv=/home/build/Peroxide/target/debug/deps/libcsv-6969047f78d86bfe.rlib --extern peroxide=/home/build/Peroxide/target/debug/deps/libperoxide-f20ac947b328ddcf.rlib --extern pyo3=/home/build/Peroxide/target/debug/deps/libpyo3-16c8c6ef6697d71f.rlib --extern rand=/home/build/Peroxide/target/debug/deps/librand-124378dd801f0a0c.rlib --extern special=/home/build/Peroxide/target/debug/deps/libspecial-585ff5d6f6fa831a.rlib -L native=/usr/lib`
     Running `rustc --crate-name lu src/bin/lu.rs --color always --emit=dep-info,link -C debuginfo=2 --test -C metadata=11175e642ff92ee9 -C extra-filename=-11175e642ff92ee9 --out-dir /home/build/Peroxide/target/debug/deps -C incremental=/home/build/Peroxide/target/debug/incremental -L dependency=/home/build/Peroxide/target/debug/deps --extern csv=/home/build/Peroxide/target/debug/deps/libcsv-6969047f78d86bfe.rlib --extern peroxide=/home/build/Peroxide/target/debug/deps/libperoxide-f20ac947b328ddcf.rlib --extern pyo3=/home/build/Peroxide/target/debug/deps/libpyo3-16c8c6ef6697d71f.rlib --extern rand=/home/build/Peroxide/target/debug/deps/librand-124378dd801f0a0c.rlib --extern special=/home/build/Peroxide/target/debug/deps/libspecial-585ff5d6f6fa831a.rlib -L native=/usr/lib`
warning: unused variable: `pqlu`
 --> src/bin/lu.rs:6:9
  |
6 |     let pqlu = a.lu().unwrap();
  |         ^^^^ help: consider prefixing with an underscore: `_pqlu`
  |
  = note: `#[warn(unused_variables)]` on by default

     Running `rustc --crate-name det tests/det.rs --color always --emit=dep-info,link -C debuginfo=2 --test -C metadata=b4f2f270822e95a8 -C extra-filename=-b4f2f270822e95a8 --out-dir /home/build/Peroxide/target/debug/deps -C incremental=/home/build/Peroxide/target/debug/incremental -L dependency=/home/build/Peroxide/target/debug/deps --extern csv=/home/build/Peroxide/target/debug/deps/libcsv-6969047f78d86bfe.rlib --extern peroxide=/home/build/Peroxide/target/debug/deps/libperoxide-f20ac947b328ddcf.rlib --extern pyo3=/home/build/Peroxide/target/debug/deps/libpyo3-16c8c6ef6697d71f.rlib --extern rand=/home/build/Peroxide/target/debug/deps/librand-124378dd801f0a0c.rlib --extern special=/home/build/Peroxide/target/debug/deps/libspecial-585ff5d6f6fa831a.rlib -L native=/usr/lib`
     Running `rustc --crate-name dual tests/dual.rs --color always --emit=dep-info,link -C debuginfo=2 --test -C metadata=501ba77e241faa71 -C extra-filename=-501ba77e241faa71 --out-dir /home/build/Peroxide/target/debug/deps -C incremental=/home/build/Peroxide/target/debug/incremental -L dependency=/home/build/Peroxide/target/debug/deps --extern csv=/home/build/Peroxide/target/debug/deps/libcsv-6969047f78d86bfe.rlib --extern peroxide=/home/build/Peroxide/target/debug/deps/libperoxide-f20ac947b328ddcf.rlib --extern pyo3=/home/build/Peroxide/target/debug/deps/libpyo3-16c8c6ef6697d71f.rlib --extern rand=/home/build/Peroxide/target/debug/deps/librand-124378dd801f0a0c.rlib --extern special=/home/build/Peroxide/target/debug/deps/libspecial-585ff5d6f6fa831a.rlib -L native=/usr/lib`
warning: unused `#[macro_use]` import
 --> tests/dual.rs:1:1
  |
1 | #[macro_use]
  | ^^^^^^^^^^^^
  |
  = note: `#[warn(unused_imports)]` on by default

     Running `rustc --crate-name matrix tests/matrix.rs --color always --emit=dep-info,link -C debuginfo=2 --test -C metadata=9daf351326566f13 -C extra-filename=-9daf351326566f13 --out-dir /home/build/Peroxide/target/debug/deps -C incremental=/home/build/Peroxide/target/debug/incremental -L dependency=/home/build/Peroxide/target/debug/deps --extern csv=/home/build/Peroxide/target/debug/deps/libcsv-6969047f78d86bfe.rlib --extern peroxide=/home/build/Peroxide/target/debug/deps/libperoxide-f20ac947b328ddcf.rlib --extern pyo3=/home/build/Peroxide/target/debug/deps/libpyo3-16c8c6ef6697d71f.rlib --extern rand=/home/build/Peroxide/target/debug/deps/librand-124378dd801f0a0c.rlib --extern special=/home/build/Peroxide/target/debug/deps/libspecial-585ff5d6f6fa831a.rlib -L native=/usr/lib`
warning: unused `#[macro_use]` import
 --> tests/matrix.rs:1:1
  |
1 | #[macro_use]
  | ^^^^^^^^^^^^
  |
  = note: `#[warn(unused_imports)]` on by default

     Running `rustc --crate-name change_shape_test tests/change_shape_test.rs --color always --emit=dep-info,link -C debuginfo=2 --test -C metadata=2e6a8e92b90c713f -C extra-filename=-2e6a8e92b90c713f --out-dir /home/build/Peroxide/target/debug/deps -C incremental=/home/build/Peroxide/target/debug/incremental -L dependency=/home/build/Peroxide/target/debug/deps --extern csv=/home/build/Peroxide/target/debug/deps/libcsv-6969047f78d86bfe.rlib --extern peroxide=/home/build/Peroxide/target/debug/deps/libperoxide-f20ac947b328ddcf.rlib --extern pyo3=/home/build/Peroxide/target/debug/deps/libpyo3-16c8c6ef6697d71f.rlib --extern rand=/home/build/Peroxide/target/debug/deps/librand-124378dd801f0a0c.rlib --extern special=/home/build/Peroxide/target/debug/deps/libspecial-585ff5d6f6fa831a.rlib -L native=/usr/lib`
     Running `rustc --crate-name number tests/number.rs --color always --emit=dep-info,link -C debuginfo=2 --test -C metadata=a3f7a9a9084c2aa9 -C extra-filename=-a3f7a9a9084c2aa9 --out-dir /home/build/Peroxide/target/debug/deps -C incremental=/home/build/Peroxide/target/debug/incremental -L dependency=/home/build/Peroxide/target/debug/deps --extern csv=/home/build/Peroxide/target/debug/deps/libcsv-6969047f78d86bfe.rlib --extern peroxide=/home/build/Peroxide/target/debug/deps/libperoxide-f20ac947b328ddcf.rlib --extern pyo3=/home/build/Peroxide/target/debug/deps/libpyo3-16c8c6ef6697d71f.rlib --extern rand=/home/build/Peroxide/target/debug/deps/librand-124378dd801f0a0c.rlib --extern special=/home/build/Peroxide/target/debug/deps/libspecial-585ff5d6f6fa831a.rlib -L native=/usr/lib`
warning: unused `#[macro_use]` import
 --> tests/number.rs:1:1
  |
1 | #[macro_use]
  | ^^^^^^^^^^^^
  |
  = note: `#[warn(unused_imports)]` on by default

     Running `rustc --crate-name jacobian tests/jacobian.rs --color always --emit=dep-info,link -C debuginfo=2 --test -C metadata=b826997a2d2bbc0f -C extra-filename=-b826997a2d2bbc0f --out-dir /home/build/Peroxide/target/debug/deps -C incremental=/home/build/Peroxide/target/debug/incremental -L dependency=/home/build/Peroxide/target/debug/deps --extern csv=/home/build/Peroxide/target/debug/deps/libcsv-6969047f78d86bfe.rlib --extern peroxide=/home/build/Peroxide/target/debug/deps/libperoxide-f20ac947b328ddcf.rlib --extern pyo3=/home/build/Peroxide/target/debug/deps/libpyo3-16c8c6ef6697d71f.rlib --extern rand=/home/build/Peroxide/target/debug/deps/librand-124378dd801f0a0c.rlib --extern special=/home/build/Peroxide/target/debug/deps/libspecial-585ff5d6f6fa831a.rlib -L native=/usr/lib`
warning: unused `#[macro_use]` import
 --> tests/jacobian.rs:1:1
  |
1 | #[macro_use]
  | ^^^^^^^^^^^^
  |
  = note: `#[warn(unused_imports)]` on by default

    Finished dev [unoptimized + debuginfo] target(s) in 16.15s
     Running `/home/build/Peroxide/target/debug/deps/peroxide-cb968bff56724ef0`

running 0 tests

test result: ok. 0 passed; 0 failed; 0 ignored; 0 measured; 0 filtered out

     Running `/home/build/Peroxide/target/debug/deps/dist-014bc7fcfa2cb8f6`

running 0 tests

test result: ok. 0 passed; 0 failed; 0 ignored; 0 measured; 0 filtered out

     Running `/home/build/Peroxide/target/debug/deps/dual-0a2b9b76c8e283aa`

running 0 tests

test result: ok. 0 passed; 0 failed; 0 ignored; 0 measured; 0 filtered out

     Running `/home/build/Peroxide/target/debug/deps/hyper-d794c659c537fcbc`

running 0 tests

test result: ok. 0 passed; 0 failed; 0 ignored; 0 measured; 0 filtered out

     Running `/home/build/Peroxide/target/debug/deps/jacobian-e6275f9bacdddcf5`

running 0 tests

test result: ok. 0 passed; 0 failed; 0 ignored; 0 measured; 0 filtered out

     Running `/home/build/Peroxide/target/debug/deps/lda_ls-c89fdec8eb833ae3`

running 0 tests

test result: ok. 0 passed; 0 failed; 0 ignored; 0 measured; 0 filtered out

     Running `/home/build/Peroxide/target/debug/deps/lm-702642ed8f0bc880`

running 0 tests

test result: ok. 0 passed; 0 failed; 0 ignored; 0 measured; 0 filtered out

     Running `/home/build/Peroxide/target/debug/deps/lm2-f6c871b1118783ce`

running 0 tests

test result: ok. 0 passed; 0 failed; 0 ignored; 0 measured; 0 filtered out

     Running `/home/build/Peroxide/target/debug/deps/lm_test-91fdaff9b48d4d5f`

running 0 tests

test result: ok. 0 passed; 0 failed; 0 ignored; 0 measured; 0 filtered out

     Running `/home/build/Peroxide/target/debug/deps/lu-11175e642ff92ee9`

running 0 tests

test result: ok. 0 passed; 0 failed; 0 ignored; 0 measured; 0 filtered out

     Running `/home/build/Peroxide/target/debug/deps/matmul1-8faf44b729658b3f`

running 0 tests

test result: ok. 0 passed; 0 failed; 0 ignored; 0 measured; 0 filtered out

     Running `/home/build/Peroxide/target/debug/deps/matmul2-60a8e0ecfc5c4303`

running 0 tests

test result: ok. 0 passed; 0 failed; 0 ignored; 0 measured; 0 filtered out

     Running `/home/build/Peroxide/target/debug/deps/matmul3-cb1d75555635dd0c`

running 0 tests

test result: ok. 0 passed; 0 failed; 0 ignored; 0 measured; 0 filtered out

     Running `/home/build/Peroxide/target/debug/deps/mlp-8b5c2b05914ebde2`

running 0 tests

test result: ok. 0 passed; 0 failed; 0 ignored; 0 measured; 0 filtered out

     Running `/home/build/Peroxide/target/debug/deps/norm-a5a793630735403c`

running 0 tests

test result: ok. 0 passed; 0 failed; 0 ignored; 0 measured; 0 filtered out

     Running `/home/build/Peroxide/target/debug/deps/ode_test_lorenz-0cb16f24eae0c06c`

running 0 tests

test result: ok. 0 passed; 0 failed; 0 ignored; 0 measured; 0 filtered out

     Running `/home/build/Peroxide/target/debug/deps/ode_test_rk4-04b65788d141b145`

running 0 tests

test result: ok. 0 passed; 0 failed; 0 ignored; 0 measured; 0 filtered out

     Running `/home/build/Peroxide/target/debug/deps/optimize-2f41770a78e7813c`

running 0 tests

test result: ok. 0 passed; 0 failed; 0 ignored; 0 measured; 0 filtered out

     Running `/home/build/Peroxide/target/debug/deps/plot-d8873b486ceaf410`

running 0 tests

test result: ok. 0 passed; 0 failed; 0 ignored; 0 measured; 0 filtered out

     Running `/home/build/Peroxide/target/debug/deps/poly-8a71f90a8260db6e`

running 0 tests

test result: ok. 0 passed; 0 failed; 0 ignored; 0 measured; 0 filtered out

     Running `/home/build/Peroxide/target/debug/deps/read_csv-1078573a2c9a5efc`

running 0 tests

test result: ok. 0 passed; 0 failed; 0 ignored; 0 measured; 0 filtered out

     Running `/home/build/Peroxide/target/debug/deps/real_trait_test-c3be2aeac9770519`

running 0 tests

test result: ok. 0 passed; 0 failed; 0 ignored; 0 measured; 0 filtered out

     Running `/home/build/Peroxide/target/debug/deps/spread-b4c81135750dbdcb`

running 0 tests

test result: ok. 0 passed; 0 failed; 0 ignored; 0 measured; 0 filtered out

     Running `/home/build/Peroxide/target/debug/deps/thomas-57ca1831d915b701`

running 0 tests

test result: ok. 0 passed; 0 failed; 0 ignored; 0 measured; 0 filtered out

     Running `/home/build/Peroxide/target/debug/deps/change_shape_test-2e6a8e92b90c713f`

running 1 test
test change_shape_test ... ok

test result: ok. 1 passed; 0 failed; 0 ignored; 0 measured; 0 filtered out

     Running `/home/build/Peroxide/target/debug/deps/det-b4f2f270822e95a8`

running 2 tests
test test_det ... ok
test test_det2 ... ok

test result: ok. 2 passed; 0 failed; 0 ignored; 0 measured; 0 filtered out

     Running `/home/build/Peroxide/target/debug/deps/dual-501ba77e241faa71`

running 1 test
test test_dot_dual ... ok

test result: ok. 1 passed; 0 failed; 0 ignored; 0 measured; 0 filtered out

     Running `/home/build/Peroxide/target/debug/deps/jacobian-b826997a2d2bbc0f`

running 1 test
test test_jacobian ... ok

test result: ok. 1 passed; 0 failed; 0 ignored; 0 measured; 0 filtered out

     Running `/home/build/Peroxide/target/debug/deps/matrix-9daf351326566f13`

running 11 tests
test test_accumulation ... ok
test test_add_f64 ... ok
test test_add_matrix ... ok
test test_c ... ok
test test_col ... ok
test test_col_map ... ok
test test_print ... ok
test test_row ... ok
test test_row_map ... ok
test test_seq ... ok
test test_zeros ... ok

test result: ok. 11 passed; 0 failed; 0 ignored; 0 measured; 0 filtered out

     Running `/home/build/Peroxide/target/debug/deps/number-a3f7a9a9084c2aa9`

running 3 tests
test test_function_for_number ... ok
test test_ops_btw_number_d ... ok
test test_ops_btw_number_f ... ok

test result: ok. 3 passed; 0 failed; 0 ignored; 0 measured; 0 filtered out

   Doc-tests peroxide
     Running `rustdoc --test /home/build/Peroxide/src/lib.rs --crate-name peroxide -L dependency=/home/build/Peroxide/target/debug/deps -L native=/usr/lib -L dependency=/home/build/Peroxide/target/debug/deps --extern csv=/home/build/Peroxide/target/debug/deps/libcsv-6969047f78d86bfe.rlib --extern peroxide=/home/build/Peroxide/target/debug/deps/libperoxide-f20ac947b328ddcf.rlib --extern pyo3=/home/build/Peroxide/target/debug/deps/libpyo3-16c8c6ef6697d71f.rlib --extern rand=/home/build/Peroxide/target/debug/deps/librand-124378dd801f0a0c.rlib --extern special=/home/build/Peroxide/target/debug/deps/libspecial-585ff5d6f6fa831a.rlib`

running 137 tests
test src/lib.rs -  (line 61) ... ok
test src/macros/matlab_macro.rs - eye (line 69) ... ok
test src/macros/matlab_macro.rs - linspace (line 91) ... ok
test src/macros/matlab_macro.rs - rand (line 37) ... ok
test src/macros/matlab_macro.rs - zeros (line 12) ... ok
test src/macros/r_macro.rs - c (line 14) ... ok
test src/macros/r_macro.rs - cbind (line 111) ... ok
test src/macros/r_macro.rs - lm (line 273) ... ok
test src/macros/r_macro.rs - matrix (line 85) ... ok
test src/macros/r_macro.rs - rbind (line 171) ... ok
test src/macros/r_macro.rs - runif (line 236) ... ok
test src/macros/r_macro.rs - seq (line 52) ... ok
test src/ml/reg.rs - ml::reg::least_square (line 17) ... ok
test src/numerical/ode.rs - numerical::ode (line 126) ... ok
test src/numerical/ode.rs - numerical::ode (line 13) ... ok
test src/numerical/ode.rs - numerical::ode (line 179) ... ok
test src/numerical/ode.rs - numerical::ode (line 58) ... ok
test src/numerical/ode.rs - numerical::ode (line 93) ... ok
test src/numerical/optimize.rs - numerical::optimize (line 44) ... FAILED
test src/numerical/optimize.rs - numerical::optimize (line 7) ... ok
test src/numerical/spline.rs - numerical::spline::cubic_spline (line 21) ... ok
test src/numerical/utils.rs - numerical::utils::jacobian (line 15) ... ok
test src/operation/extra_ops.rs - operation::extra_ops (line 9) ... ok
test src/statistics/dist.rs - statistics::dist (line 109) ... ok
test src/statistics/dist.rs - statistics::dist (line 28) ... ok
test src/statistics/dist.rs - statistics::dist (line 57) ... ok
test src/statistics/dist.rs - statistics::dist (line 81) ... ok
test src/statistics/ops.rs - statistics::ops::C (line 45) ... ok
test src/statistics/ops.rs - statistics::ops::H (line 64) ... ok
test src/statistics/ops.rs - statistics::ops::P (line 26) ... ok
test src/statistics/ops.rs - statistics::ops::factorial (line 8) ... ok
test src/statistics/rand.rs - statistics::rand (line 8) ... ok
test src/statistics/rand.rs - statistics::rand::rand_num (line 31) ... ok
test src/statistics/stat.rs - statistics::stat (line 12) ... ok
test src/statistics/stat.rs - statistics::stat (line 30) ... ok
test src/statistics/stat.rs - statistics::stat (line 45) ... ok
test src/statistics/stat.rs - statistics::stat (line 64) ... ok
test src/statistics/stat.rs - statistics::stat::Matrix::cov (line 231) ... ok
test src/statistics/stat.rs - statistics::stat::Matrix::mean (line 171) ... ok
test src/statistics/stat.rs - statistics::stat::Matrix::sd (line 211) ... ok
test src/statistics/stat.rs - statistics::stat::Matrix::var (line 191) ... ok
test src/statistics/stat.rs - statistics::stat::Vector::mean (line 107) ... ok
test src/statistics/stat.rs - statistics::stat::Vector::sd (line 145) ... ok
test src/statistics/stat.rs - statistics::stat::Vector::var (line 121) ... ok
test src/statistics/stat.rs - statistics::stat::cor (line 303) ... ok
test src/statistics/stat.rs - statistics::stat::cov (line 276) ... ok
test src/statistics/stat.rs - statistics::stat::lm (line 318) ... ok
test src/structure/dual.rs - structure::dual (line 23) ... ok
test src/structure/dual.rs - structure::dual (line 44) ... ok
test src/structure/dual.rs - structure::dual::Dual::new (line 97) ... ok
test src/structure/hyper_dual.rs - structure::hyper_dual (line 14) ... ok
test src/structure/hyper_dual.rs - structure::hyper_dual (line 29) ... ok
test src/structure/matrix.rs - structure::matrix (line 117) ... ok
test src/structure/matrix.rs - structure::matrix (line 152) ... ok
test src/structure/matrix.rs - structure::matrix (line 172) ... ok
test src/structure/matrix.rs - structure::matrix (line 18) ... ok
test src/structure/matrix.rs - structure::matrix (line 194) ... ok
test src/structure/matrix.rs - structure::matrix (line 221) ... ok
test src/structure/matrix.rs - structure::matrix (line 248) ... ok
test src/structure/matrix.rs - structure::matrix (line 268) ... ok
test src/structure/matrix.rs - structure::matrix (line 288) ... ok
test src/structure/matrix.rs - structure::matrix (line 305) ... ok
test src/structure/matrix.rs - structure::matrix (line 327) ... ok
test src/structure/matrix.rs - structure::matrix (line 355) ... ok
test src/structure/matrix.rs - structure::matrix (line 373) ... ok
test src/structure/matrix.rs - structure::matrix (line 399) ... ok
test src/structure/matrix.rs - structure::matrix (line 416) ... ok
test src/structure/matrix.rs - structure::matrix (line 43) ... ok
test src/structure/matrix.rs - structure::matrix (line 434) ... ok
test src/structure/matrix.rs - structure::matrix (line 62) ... ok
test src/structure/matrix.rs - structure::matrix (line 92) ... ok
test src/structure/matrix.rs - structure::matrix::Matrix (line 1163) ... ok
test src/structure/matrix.rs - structure::matrix::Matrix (line 1278) ... ok
test src/structure/matrix.rs - structure::matrix::Matrix (line 1323) ... ok
test src/structure/matrix.rs - structure::matrix::Matrix (line 1581) ... ok
test src/structure/matrix.rs - structure::matrix::Matrix (line 1657) ... ok
test src/structure/matrix.rs - structure::matrix::Matrix (line 1682) ... ok
test src/structure/matrix.rs - structure::matrix::Matrix (line 480) ... ok
test src/structure/matrix.rs - structure::matrix::Matrix::block (line 2151) ... ok
test src/structure/matrix.rs - structure::matrix::Matrix::change_shape (line 620) ... ok
test src/structure/matrix.rs - structure::matrix::Matrix::col (line 758) ... ok
test src/structure/matrix.rs - structure::matrix::Matrix::det (line 2125) ... ok
test src/structure/matrix.rs - structure::matrix::Matrix::diag (line 796) ... ok
test src/structure/matrix.rs - structure::matrix::Matrix::inv (line 2212) ... ok
test src/structure/matrix.rs - structure::matrix::Matrix::lu (line 2027) ... ok
test src/structure/matrix.rs - structure::matrix::Matrix::pseudo_inv (line 2247) ... ok
test src/structure/matrix.rs - structure::matrix::Matrix::read (line 953) ... ok
test src/structure/matrix.rs - structure::matrix::Matrix::row (line 777) ... ok
test src/structure/matrix.rs - structure::matrix::Matrix::spread (line 670) ... ok
test src/structure/matrix.rs - structure::matrix::Matrix::swap (line 818) ... ok
test src/structure/matrix.rs - structure::matrix::Matrix::t (line 1087) ... ok
test src/structure/matrix.rs - structure::matrix::Matrix::transpose (line 1070) ... ok
test src/structure/matrix.rs - structure::matrix::Matrix::write (line 860) ... ok
test src/structure/matrix.rs - structure::matrix::Matrix::write_round (line 885) ... ok
test src/structure/matrix.rs - structure::matrix::PQLU (line 1923) ... ok
test src/structure/matrix.rs - structure::matrix::Shape (line 450) ... ok
test src/structure/matrix.rs - structure::matrix::Vector (line 1618) ... ok
test src/structure/matrix.rs - structure::matrix::combine (line 2278) ... ok
test src/structure/matrix.rs - structure::matrix::f64 (line 1194) ... ok
test src/structure/matrix.rs - structure::matrix::f64 (line 1391) ... ok
test src/structure/matrix.rs - structure::matrix::i32 (line 1221) ... ok
test src/structure/matrix.rs - structure::matrix::inv_l (line 2328) ... ok
test src/structure/matrix.rs - structure::matrix::inv_u (line 2363) ... ok
test src/structure/matrix.rs - structure::matrix::matrix (line 506) ... ok
test src/structure/matrix.rs - structure::matrix::ml_matrix (line 562) ... ok
test src/structure/matrix.rs - structure::matrix::py_matrix (line 535) ... ok
test src/structure/matrix.rs - structure::matrix::usize (line 1248) ... ok
test src/structure/polynomial.rs - structure::polynomial::Polynomial (line 26) ... ok
test src/structure/polynomial.rs - structure::polynomial::Polynomial::eval (line 158) ... ok
test src/structure/vector.rs - structure::vector (line 10) ... ok
test src/structure/vector.rs - structure::vector (line 111) ... ok
test src/structure/vector.rs - structure::vector (line 134) ... ok
test src/structure/vector.rs - structure::vector (line 160) ... ok
test src/structure/vector.rs - structure::vector (line 186) ... ok
test src/structure/vector.rs - structure::vector (line 209) ... ok
test src/structure/vector.rs - structure::vector (line 236) ... ok
test src/structure/vector.rs - structure::vector (line 252) ... ok
test src/structure/vector.rs - structure::vector (line 266) ... ok
test src/structure/vector.rs - structure::vector (line 33) ... ok
test src/structure/vector.rs - structure::vector (line 57) ... ok
test src/structure/vector.rs - structure::vector (line 79) ... ok
test src/structure/vector.rs - structure::vector::Vector::arg_max (line 508) ... ok
test src/structure/vector.rs - structure::vector::Vector::filter (line 344) ... ok
test src/structure/vector.rs - structure::vector::Vector::fmap (line 299) ... ok
test src/structure/vector.rs - structure::vector::Vector::rank (line 451) ... ok
test src/structure/vector.rs - structure::vector::Vector::reduce (line 316) ... ok
test src/structure/vector.rs - structure::vector::Vector::sign (line 477) ... ok
test src/structure/vector.rs - structure::vector::Vector::skip (line 384) ... ok
test src/structure/vector.rs - structure::vector::Vector::take (line 365) ... ok
test src/util/non_macro.rs - util::non_macro::cbind (line 125) ... ok
test src/util/non_macro.rs - util::non_macro::eye (line 98) ... ok
test src/util/non_macro.rs - util::non_macro::rbind (line 158) ... ok
test src/util/non_macro.rs - util::non_macro::seq (line 18) ... ok
test src/util/non_macro.rs - util::non_macro::zeros (line 50) ... ok
test src/util/plot.rs - util::plot (line 37) ... ok
test src/util/plot.rs - util::plot (line 8) ... ok
test src/util/useful.rs - util::useful::nearly_eq (line 15) ... ok

failures:

---- src/numerical/optimize.rs - numerical::optimize (line 44) stdout ----
Test executable failed (exit code 101).

stdout:
[2.0004]
103.42423283811462

stderr:
thread 'main' panicked at 'Can't draw a plot: PyErr { type: Py(0x7f24cc6dd920, PhantomData) }', src/libcore/result.rs:1084:5
note: run with `RUST_BACKTRACE=1` environment variable to display a backtrace.



failures:
    src/numerical/optimize.rs - numerical::optimize (line 44)

test result: FAILED. 136 passed; 1 failed; 0 ignored; 0 measured; 0 filtered out

error: test failed, to rerun pass '--doc'
+ :
docs
1
2
3
4
5
6
7
8
9
10
11
12
13
14
15
16
17
18
19
20
21
22
23
24
25
26
27
28
29
30
31
32
33
34
35
36
37
38
39
40
41
42
43
44
45
46
47
48
49
50
51
52
53
54
55
56
57
+ rustup default nightly
info: using existing install for 'nightly-x86_64-unknown-linux-gnu'
info: default toolchain set to 'nightly-x86_64-unknown-linux-gnu'

  nightly-x86_64-unknown-linux-gnu unchanged - rustc 1.39.0-nightly (29a54035c 2019-08-19)

+ cd Peroxide/
+ RUSTDOCFLAGS='--html-in-header katex-header.html'
+ cargo doc --no-deps
    Checking cfg-if v0.1.9
    Checking ppv-lite86 v0.2.5
    Checking lazy_static v1.3.0
    Checking itoa v0.4.4
    Checking spin v0.5.1
    Checking proc-macro-hack v0.4.2
    Checking c2-chacha v0.2.2
    Checking libc v0.2.62
    Checking byteorder v1.3.2
    Checking serde v1.0.99
    Checking ryu v1.0.0
    Checking getrandom v0.1.10
    Checking memchr v2.2.1
    Checking special v0.8.1
    Checking regex-automata v0.1.8
    Checking num-traits v0.2.8
    Checking rand_core v0.5.0
    Checking csv-core v0.1.6
    Checking mashup v0.1.9
    Checking bstr v0.2.7
    Checking rand_chacha v0.2.1
    Checking csv v1.1.1
    Checking rand v0.7.0
    Checking inventory v0.1.4
    Checking pyo3 v0.7.0
    Checking peroxide v0.13.0 (/home/build/Peroxide)
warning: unused import: `std::fs::File`
 --> src/util/writer.rs:5:5
  |
5 | use std::fs::File;
  |     ^^^^^^^^^^^^^
  |
  = note: `#[warn(unused_imports)]` on by default

warning: unused import: `std::io::Write`
 --> src/util/writer.rs:6:5
  |
6 | use std::io::Write;
  |     ^^^^^^^^^^^^^^

warning: unused import: `std::process::exit`
 --> src/util/writer.rs:7:5
  |
7 | use std::process::exit;
  |     ^^^^^^^^^^^^^^^^^^

 Documenting peroxide v0.13.0 (/home/build/Peroxide)
    Finished dev [unoptimized + debuginfo] target(s) in 1m 09s
Build complete: success 3 months ago (took 7 minutes)